Build failed in Jenkins: geotools-master-online-oracle #312

classic Classic list List threaded Threaded
2 messages Options
Reply | Threaded
Open this post in threaded view
|

Build failed in Jenkins: geotools-master-online-oracle #312

monitor
See <http://ares.boundlessgeo.com/jenkins/job/geotools-master-online-oracle/312/changes>

Changes:

[jeroen.dries] GEOT-5773 avoid NPE in GridCoverageRenderer when colormodel is null.

[schulz.johng] Fixed test to remove '' from true false assertions

------------------------------------------
[...truncated 5180 lines...]
     [exec] copying downloadable files... [ 73%] <http://ares.boundlessgeo.com/jenkins/job/geotools-master-online-oracle/ws/docs/user/tutorial/feature/artifacts/locations.csv>
     [exec] copying downloadable files... [ 75%] <http://ares.boundlessgeo.com/jenkins/job/geotools-master-online-oracle/ws/modules/unsupported/csv/src/test/java/org/geotools/data/csv/parse/CSVWriteStrategyTest.java>
     [exec] copying downloadable files... [ 77%] <http://ares.boundlessgeo.com/jenkins/job/geotools-master-online-oracle/ws/docs/user/tutorial/quickstart/artifacts/pom.xml>
     [exec] copying downloadable files... [ 79%] <http://ares.boundlessgeo.com/jenkins/job/geotools-master-online-oracle/ws/modules/plugin/svg/src/test/resources/org/geotools/renderer/lite/test-data/fillHouse.sld>
     [exec] copying downloadable files... [ 81%] <http://ares.boundlessgeo.com/jenkins/job/geotools-master-online-oracle/ws/docs/src/main/java/org/geotools/po/bindings/ItemsBinding.java>
     [exec] copying downloadable files... [ 83%] <http://ares.boundlessgeo.com/jenkins/job/geotools-master-online-oracle/ws/docs/user/artifacts/xml/po.xml>
     [exec] copying downloadable files... [ 85%] <http://ares.boundlessgeo.com/jenkins/job/geotools-master-online-oracle/ws/docs/src/main/java/org/geotools/tutorial/csv2/CSVFeatureStore.java>
     [exec] copying downloadable files... [ 87%] <http://ares.boundlessgeo.com/jenkins/job/geotools-master-online-oracle/ws/docs/src/main/java/org/geotools/swing/JExampleWizard.java>
     [exec] copying downloadable files... [ 89%] <http://ares.boundlessgeo.com/jenkins/job/geotools-master-online-oracle/ws/modules/unsupported/csv/src/main/java/org/geotools/data/csv/CSVFileState.java>
     [exec] copying downloadable files... [ 91%] <http://ares.boundlessgeo.com/jenkins/job/geotools-master-online-oracle/ws/modules/extension/xsd/xsd-kml/src/main/resources/org/geotools/kml/states.kml>
     [exec] copying downloadable files... [ 93%] <http://ares.boundlessgeo.com/jenkins/job/geotools-master-online-oracle/ws/modules/unsupported/csv/src/main/java/org/geotools/data/csv/parse/CSVStrategy.java>
     [exec] copying downloadable files... [ 95%] <http://ares.boundlessgeo.com/jenkins/job/geotools-master-online-oracle/ws/docs/user/tutorial/artifacts/example.properties>
     [exec] copying downloadable files... [ 97%] <http://ares.boundlessgeo.com/jenkins/job/geotools-master-online-oracle/ws/docs/user/artifacts/xml/pom3.xml>
     [exec] copying downloadable files... [100%] <http://ares.boundlessgeo.com/jenkins/job/geotools-master-online-oracle/ws/modules/plugin/charts/src/test/resources/org/geotools/renderer/chart/test-data/cities.properties>

     [exec] copying static files... done
     [exec] dumping search index... done
     [exec] dumping object inventory... done
     [exec] build succeeded.

web:

sphinx:
     [echo] Running sphinx-build -D release=18-SNAPSHOT -W -b html -d "<http://ares.boundlessgeo.com/jenkins/job/geotools-master-online-oracle/ws/docs/target/web/doctrees"> . "<http://ares.boundlessgeo.com/jenkins/job/geotools-master-online-oracle/ws/docs/target/web/html">
     [exec] Making output directory...
     [exec] Running Sphinx v1.2b1
     [exec] loading pickled environment... not yet created
     [exec] building [html]: targets for 3 source files that are out of date
     [exec] updating environment: 3 added, 0 changed, 0 removed
     [exec] reading sources... [ 33%] about
     [exec] reading sources... [ 66%] getinvolved
     [exec] reading sources... [100%] index

     [exec] looking for now-outdated files... none found
     [exec] pickling environment... done
     [exec] checking consistency... done
     [exec] preparing documents... done
     [exec] writing output... [ 33%] about
     [exec] writing output... [ 66%] getinvolved
     [exec] writing output... [100%] index

     [exec] writing additional files... search
     [exec] copying static files... done
     [exec] dumping search index... done
     [exec] dumping object inventory... done
     [exec] build succeeded.

developer:

sphinx:
     [echo] Running sphinx-build -D release=18-SNAPSHOT -W -b html -d "<http://ares.boundlessgeo.com/jenkins/job/geotools-master-online-oracle/ws/docs/target/developer/doctrees"> . "<http://ares.boundlessgeo.com/jenkins/job/geotools-master-online-oracle/ws/docs/target/developer/html">
     [exec] Making output directory...
     [exec] Running Sphinx v1.2b1
     [exec] loading pickled environment... not yet created
     [exec] building [html]: targets for 45 source files that are out of date
     [exec] updating environment: 45 added, 0 changed, 0 removed
     [exec] reading sources... [  2%] communication
     [exec] reading sources... [  4%] conventions/code/assert
     [exec] reading sources... [  6%] conventions/code/assumptions
     [exec] reading sources... [  8%] conventions/code/code
     [exec] reading sources... [ 11%] conventions/code/exception
     [exec] reading sources... [ 13%] conventions/code/javadocutils
     [exec] reading sources... [ 15%] conventions/code/log
     [exec] reading sources... [ 17%] conventions/code/null
     [exec] reading sources... [ 20%] conventions/code/style
     [exec] reading sources... [ 22%] conventions/code/url
     [exec] reading sources... [ 24%] conventions/index
     [exec] reading sources... [ 26%] conventions/module
     [exec] reading sources... [ 28%] conventions/name
     [exec] reading sources... [ 31%] conventions/profile
     [exec] reading sources... [ 33%] conventions/refactor
     [exec] reading sources... [ 35%] conventions/test/data
     [exec] reading sources... [ 37%] conventions/test/junit
     [exec] reading sources... [ 40%] conventions/test/online
     [exec] reading sources... [ 42%] conventions/test/test
     [exec] reading sources... [ 44%] conventions/version
     [exec] reading sources... [ 46%] docs/index
     [exec] reading sources... [ 48%] docs/reference
     [exec] reading sources... [ 51%] docs/tutorial
     [exec] reading sources... [ 53%] docs/welcome
     [exec] reading sources... [ 55%] index
     [exec] reading sources... [ 57%] introduction
     [exec] reading sources... [ 60%] procedures/add
     [exec] reading sources... [ 62%] procedures/build_server
     [exec] reading sources... [ 64%] procedures/check
     [exec] reading sources... [ 66%] procedures/contribute
     [exec] reading sources... [ 68%] procedures/contribution_license
     [exec] reading sources... [ 71%] procedures/create
     [exec] reading sources... [ 73%] procedures/git
     [exec] reading sources... [ 75%] procedures/index
     [exec] reading sources... [ 77%] procedures/proposal
     [exec] reading sources... [ 80%] procedures/pull_requests
     [exec] reading sources... [ 82%] procedures/release
     [exec] reading sources... [ 84%] procedures/stable
     [exec] reading sources... [ 86%] procedures/supported
     [exec] reading sources... [ 88%] procedures/website
     [exec] reading sources... [ 91%] roles/committee
     [exec] reading sources... [ 93%] roles/committer
     [exec] reading sources... [ 95%] roles/contributor
     [exec] reading sources... [ 97%] roles/index
     [exec] reading sources... [100%] roles/maintainer

     [exec] looking for now-outdated files... none found
     [exec] pickling environment... done
     [exec] checking consistency... done
     [exec] preparing documents... done
     [exec] writing output... [  2%] communication
     [exec] writing output... [  4%] conventions/code/assert
     [exec] writing output... [  6%] conventions/code/assumptions
     [exec] writing output... [  8%] conventions/code/code
     [exec] writing output... [ 11%] conventions/code/exception
     [exec] writing output... [ 13%] conventions/code/javadocutils
     [exec] writing output... [ 15%] conventions/code/log
     [exec] writing output... [ 17%] conventions/code/null
     [exec] writing output... [ 20%] conventions/code/style
     [exec] writing output... [ 22%] conventions/code/url
     [exec] writing output... [ 24%] conventions/index
     [exec] writing output... [ 26%] conventions/module
     [exec] writing output... [ 28%] conventions/name
     [exec] writing output... [ 31%] conventions/profile
     [exec] writing output... [ 33%] conventions/refactor
     [exec] writing output... [ 35%] conventions/test/data
     [exec] writing output... [ 37%] conventions/test/junit
     [exec] writing output... [ 40%] conventions/test/online
     [exec] writing output... [ 42%] conventions/test/test
     [exec] writing output... [ 44%] conventions/version
     [exec] writing output... [ 46%] docs/index
     [exec] writing output... [ 48%] docs/reference
     [exec] writing output... [ 51%] docs/tutorial
     [exec] writing output... [ 53%] docs/welcome
     [exec] writing output... [ 55%] index
     [exec] writing output... [ 57%] introduction
     [exec] writing output... [ 60%] procedures/add
     [exec] writing output... [ 62%] procedures/build_server
     [exec] writing output... [ 64%] procedures/check
     [exec] writing output... [ 66%] procedures/contribute
     [exec] writing output... [ 68%] procedures/contribution_license
     [exec] writing output... [ 71%] procedures/create
     [exec] writing output... [ 73%] procedures/git
     [exec] writing output... [ 75%] procedures/index
     [exec] writing output... [ 77%] procedures/proposal
     [exec] writing output... [ 80%] procedures/pull_requests
     [exec] writing output... [ 82%] procedures/release
     [exec] writing output... [ 84%] procedures/stable
     [exec] writing output... [ 86%] procedures/supported
     [exec] writing output... [ 88%] procedures/website
     [exec] writing output... [ 91%] roles/committee
     [exec] writing output... [ 93%] roles/committer
     [exec] writing output... [ 95%] roles/contributor
     [exec] writing output... [ 97%] roles/index
     [exec] writing output... [100%] roles/maintainer

     [exec] writing additional files... search
     [exec] copying images... [ 16%] images/merge-conflict.png
     [exec] copying images... [ 33%] images/create-pull-request.png
     [exec] copying images... [ 50%] images/close-pull-request.png
     [exec] copying images... [ 66%] images/discuss-pull-request.png
     [exec] copying images... [ 83%] images/automatically-merged.png
     [exec] copying images... [100%] images/ccAttribution.png

     [exec] copying downloadable files... [ 20%] <http://ares.boundlessgeo.com/jenkins/job/geotools-master-online-oracle/ws/docs/developer/artifacts/corporate_contributor.txt>
     [exec] copying downloadable files... [ 40%] <http://ares.boundlessgeo.com/jenkins/job/geotools-master-online-oracle/ws/modules/library/main/src/main/java/org/geotools/feature/type/DateUtil.java>
     [exec] copying downloadable files... [ 60%] <http://ares.boundlessgeo.com/jenkins/job/geotools-master-online-oracle/ws/docs/developer/artifacts/individual_contributor.pdf>
     [exec] copying downloadable files... [ 80%] <http://ares.boundlessgeo.com/jenkins/job/geotools-master-online-oracle/ws/docs/developer/artifacts/corporate_contributor.pdf>
     [exec] copying downloadable files... [100%] <http://ares.boundlessgeo.com/jenkins/job/geotools-master-online-oracle/ws/docs/developer/artifacts/individual_contributor.txt>

     [exec] copying static files... done
     [exec] dumping search index... done
     [exec] dumping object inventory... done
     [exec] build succeeded.

full:
[INFO] Executed tasks
[INFO]
[INFO] --- maven-resources-plugin:2.6:testResources (default-testResources) @ docs ---
[INFO] Using 'UTF-8' encoding to copy filtered resources.
[INFO] skip non existing resourceDirectory <http://ares.boundlessgeo.com/jenkins/job/geotools-master-online-oracle/ws/docs/src/test/resources>
[INFO]
[INFO] --- maven-compiler-plugin:3.1:testCompile (default-testCompile) @ docs ---
[INFO] No sources to compile
[INFO]
[INFO] --- maven-surefire-plugin:2.15:test (default-test) @ docs ---
[INFO] No tests to run.
[INFO]
[INFO] --- maven-jar-plugin:2.4:jar (default-jar) @ docs ---
[INFO] Building jar: <http://ares.boundlessgeo.com/jenkins/job/geotools-master-online-oracle/ws/docs/target/docs-18-SNAPSHOT.jar>
[INFO]
[INFO] >>> maven-source-plugin:2.2.1:jar (attach-sources) > generate-sources @ docs >>>
[INFO]
[INFO] --- git-commit-id-plugin:2.1.2:revision (default) @ docs ---
[INFO]
[INFO] <<< maven-source-plugin:2.2.1:jar (attach-sources) < generate-sources @ docs <<<
[INFO]
[INFO] --- maven-source-plugin:2.2.1:jar (attach-sources) @ docs ---
[INFO] Building jar: <http://ares.boundlessgeo.com/jenkins/job/geotools-master-online-oracle/ws/docs/target/docs-18-SNAPSHOT-sources.jar>
[INFO]
[INFO] --- maven-install-plugin:2.4:install (default-install) @ docs ---
[INFO] Installing <http://ares.boundlessgeo.com/jenkins/job/geotools-master-online-oracle/ws/docs/target/docs-18-SNAPSHOT.jar> to /var/lib/jenkins/.m2/repository/org/geotools/docs/18-SNAPSHOT/docs-18-SNAPSHOT.jar
[INFO] Installing <http://ares.boundlessgeo.com/jenkins/job/geotools-master-online-oracle/ws/docs/pom.xml> to /var/lib/jenkins/.m2/repository/org/geotools/docs/18-SNAPSHOT/docs-18-SNAPSHOT.pom
[INFO] Installing <http://ares.boundlessgeo.com/jenkins/job/geotools-master-online-oracle/ws/docs/target/docs-18-SNAPSHOT-sources.jar> to /var/lib/jenkins/.m2/repository/org/geotools/docs/18-SNAPSHOT/docs-18-SNAPSHOT-sources.jar
[INFO] ------------------------------------------------------------------------
[INFO] Reactor Summary:
[INFO]
[INFO] JDBC DataStore Support ............................. SUCCESS [ 20.035 s]
[INFO] ArcSDE DataStore plugin ............................ SUCCESS [ 13.293 s]
[INFO] JDBC DataStore Plugins ............................. SUCCESS [  0.175 s]
[INFO] H2 DataStore ....................................... SUCCESS [ 41.519 s]
[INFO] Oracle DataStore ................................... FAILURE [08:57 min]
[INFO] PostGIS DataStore .................................. SUCCESS [  6.641 s]
[INFO] imagemosaic datasource module ...................... SKIPPED
[INFO] imagepyramid datasource module ..................... SKIPPED
[INFO] imagemosaic-jdbc module ............................ SUCCESS [ 16.042 s]
[INFO] DB2 DataStore ...................................... SUCCESS [  4.683 s]
[INFO] MySQL DataStore .................................... SUCCESS [  4.033 s]
[INFO] SQL Server DataStore ............................... SUCCESS [  4.703 s]
[INFO] SpatiaLite DataStore ............................... SUCCESS [  4.135 s]
[INFO] Teradata DataStore ................................. SUCCESS [  4.561 s]
[INFO] API interfaces ..................................... SKIPPED
[INFO] NetCDF gridcoverage module ......................... SKIPPED
[INFO] GRIB gridcoverage module ........................... SKIPPED
[INFO] GeoPackage Module .................................. SUCCESS [ 57.644 s]
[INFO] Application Schema DataAccess ...................... SUCCESS [ 49.471 s]
[INFO] Validation Processor and Framework ................. SUCCESS [  9.137 s]
[INFO] MBTiles Module ..................................... SUCCESS [ 16.000 s]
[INFO] Web Processing Service ............................. SUCCESS [  7.073 s]
[INFO] Next Generation JDBC DataStores .................... SUCCESS [  0.121 s]
[INFO] MongoDB DataStore .................................. SUCCESS [  9.080 s]
[INFO] GeoTools Documentation ............................. SUCCESS [01:01 min]
[INFO] ------------------------------------------------------------------------
[INFO] BUILD FAILURE
[INFO] ------------------------------------------------------------------------
[INFO] Total time: 15:00 min
[INFO] Finished at: 2017-08-01T05:47:48+00:00
[INFO] Final Memory: 81M/595M
[INFO] ------------------------------------------------------------------------
[ERROR] Failed to execute goal org.apache.maven.plugins:maven-surefire-plugin:2.15:test (default-test) on project gt-jdbc-oracle: There are test failures.
[ERROR]
[ERROR] Please refer to <http://ares.boundlessgeo.com/jenkins/job/geotools-master-online-oracle/ws/modules/plugin/jdbc/jdbc-oracle/target/surefire-reports> for the individual test results.
[ERROR] -> [Help 1]
[ERROR]
[ERROR] To see the full stack trace of the errors, re-run Maven with the -e switch.
[ERROR] Re-run Maven using the -X switch to enable full debug logging.
[ERROR]
[ERROR] For more information about the errors and possible solutions, please read the following articles:
[ERROR] [Help 1] http://cwiki.apache.org/confluence/display/MAVEN/MojoFailureException
[ERROR]
[ERROR] After correcting the problems, you can resume the build with the command
[ERROR]   mvn <goals> -rf :gt-jdbc-oracle
Build step 'Invoke top-level Maven targets' marked build as failure

------------------------------------------------------------------------------
Check out the vibrant tech community on one of the world's most
engaging tech sites, Slashdot.org! http://sdm.link/slashdot
_______________________________________________
GeoTools-Devel mailing list
[hidden email]
https://lists.sourceforge.net/lists/listinfo/geotools-devel
Reply | Threaded
Open this post in threaded view
|

Build failed in Jenkins: geotools-master-online-oracle #313

monitor
See <http://ares.boundlessgeo.com/jenkins/job/geotools-master-online-oracle/313/changes>

Changes:

[dvick] Squashing two commits fixing failing tests in mbstyle

------------------------------------------
[...truncated 5455 lines...]
     [exec] copying downloadable files... [ 73%] <http://ares.boundlessgeo.com/jenkins/job/geotools-master-online-oracle/ws/docs/user/tutorial/feature/artifacts/locations.csv>
     [exec] copying downloadable files... [ 75%] <http://ares.boundlessgeo.com/jenkins/job/geotools-master-online-oracle/ws/modules/unsupported/csv/src/test/java/org/geotools/data/csv/parse/CSVWriteStrategyTest.java>
     [exec] copying downloadable files... [ 77%] <http://ares.boundlessgeo.com/jenkins/job/geotools-master-online-oracle/ws/docs/user/tutorial/quickstart/artifacts/pom.xml>
     [exec] copying downloadable files... [ 79%] <http://ares.boundlessgeo.com/jenkins/job/geotools-master-online-oracle/ws/modules/plugin/svg/src/test/resources/org/geotools/renderer/lite/test-data/fillHouse.sld>
     [exec] copying downloadable files... [ 81%] <http://ares.boundlessgeo.com/jenkins/job/geotools-master-online-oracle/ws/docs/src/main/java/org/geotools/po/bindings/ItemsBinding.java>
     [exec] copying downloadable files... [ 83%] <http://ares.boundlessgeo.com/jenkins/job/geotools-master-online-oracle/ws/docs/user/artifacts/xml/po.xml>
     [exec] copying downloadable files... [ 85%] <http://ares.boundlessgeo.com/jenkins/job/geotools-master-online-oracle/ws/docs/src/main/java/org/geotools/tutorial/csv2/CSVFeatureStore.java>
     [exec] copying downloadable files... [ 87%] <http://ares.boundlessgeo.com/jenkins/job/geotools-master-online-oracle/ws/docs/src/main/java/org/geotools/swing/JExampleWizard.java>
     [exec] copying downloadable files... [ 89%] <http://ares.boundlessgeo.com/jenkins/job/geotools-master-online-oracle/ws/modules/unsupported/csv/src/main/java/org/geotools/data/csv/CSVFileState.java>
     [exec] copying downloadable files... [ 91%] <http://ares.boundlessgeo.com/jenkins/job/geotools-master-online-oracle/ws/modules/extension/xsd/xsd-kml/src/main/resources/org/geotools/kml/states.kml>
     [exec] copying downloadable files... [ 93%] <http://ares.boundlessgeo.com/jenkins/job/geotools-master-online-oracle/ws/modules/unsupported/csv/src/main/java/org/geotools/data/csv/parse/CSVStrategy.java>
     [exec] copying downloadable files... [ 95%] <http://ares.boundlessgeo.com/jenkins/job/geotools-master-online-oracle/ws/docs/user/tutorial/artifacts/example.properties>
     [exec] copying downloadable files... [ 97%] <http://ares.boundlessgeo.com/jenkins/job/geotools-master-online-oracle/ws/docs/user/artifacts/xml/pom3.xml>
     [exec] copying downloadable files... [100%] <http://ares.boundlessgeo.com/jenkins/job/geotools-master-online-oracle/ws/modules/plugin/charts/src/test/resources/org/geotools/renderer/chart/test-data/cities.properties>

     [exec] copying static files... done
     [exec] dumping search index... done
     [exec] dumping object inventory... done
     [exec] build succeeded.

web:

sphinx:
     [echo] Running sphinx-build -D release=18-SNAPSHOT -W -b html -d "<http://ares.boundlessgeo.com/jenkins/job/geotools-master-online-oracle/ws/docs/target/web/doctrees"> . "<http://ares.boundlessgeo.com/jenkins/job/geotools-master-online-oracle/ws/docs/target/web/html">
     [exec] Making output directory...
     [exec] Running Sphinx v1.2b1
     [exec] loading pickled environment... not yet created
     [exec] building [html]: targets for 3 source files that are out of date
     [exec] updating environment: 3 added, 0 changed, 0 removed
     [exec] reading sources... [ 33%] about
     [exec] reading sources... [ 66%] getinvolved
     [exec] reading sources... [100%] index

     [exec] looking for now-outdated files... none found
     [exec] pickling environment... done
     [exec] checking consistency... done
     [exec] preparing documents... done
     [exec] writing output... [ 33%] about
     [exec] writing output... [ 66%] getinvolved
     [exec] writing output... [100%] index

     [exec] writing additional files... search
     [exec] copying static files... done
     [exec] dumping search index... done
     [exec] dumping object inventory... done
     [exec] build succeeded.

developer:

sphinx:
     [echo] Running sphinx-build -D release=18-SNAPSHOT -W -b html -d "<http://ares.boundlessgeo.com/jenkins/job/geotools-master-online-oracle/ws/docs/target/developer/doctrees"> . "<http://ares.boundlessgeo.com/jenkins/job/geotools-master-online-oracle/ws/docs/target/developer/html">
     [exec] Making output directory...
     [exec] Running Sphinx v1.2b1
     [exec] loading pickled environment... not yet created
     [exec] building [html]: targets for 45 source files that are out of date
     [exec] updating environment: 45 added, 0 changed, 0 removed
     [exec] reading sources... [  2%] communication
     [exec] reading sources... [  4%] conventions/code/assert
     [exec] reading sources... [  6%] conventions/code/assumptions
     [exec] reading sources... [  8%] conventions/code/code
     [exec] reading sources... [ 11%] conventions/code/exception
     [exec] reading sources... [ 13%] conventions/code/javadocutils
     [exec] reading sources... [ 15%] conventions/code/log
     [exec] reading sources... [ 17%] conventions/code/null
     [exec] reading sources... [ 20%] conventions/code/style
     [exec] reading sources... [ 22%] conventions/code/url
     [exec] reading sources... [ 24%] conventions/index
     [exec] reading sources... [ 26%] conventions/module
     [exec] reading sources... [ 28%] conventions/name
     [exec] reading sources... [ 31%] conventions/profile
     [exec] reading sources... [ 33%] conventions/refactor
     [exec] reading sources... [ 35%] conventions/test/data
     [exec] reading sources... [ 37%] conventions/test/junit
     [exec] reading sources... [ 40%] conventions/test/online
     [exec] reading sources... [ 42%] conventions/test/test
     [exec] reading sources... [ 44%] conventions/version
     [exec] reading sources... [ 46%] docs/index
     [exec] reading sources... [ 48%] docs/reference
     [exec] reading sources... [ 51%] docs/tutorial
     [exec] reading sources... [ 53%] docs/welcome
     [exec] reading sources... [ 55%] index
     [exec] reading sources... [ 57%] introduction
     [exec] reading sources... [ 60%] procedures/add
     [exec] reading sources... [ 62%] procedures/build_server
     [exec] reading sources... [ 64%] procedures/check
     [exec] reading sources... [ 66%] procedures/contribute
     [exec] reading sources... [ 68%] procedures/contribution_license
     [exec] reading sources... [ 71%] procedures/create
     [exec] reading sources... [ 73%] procedures/git
     [exec] reading sources... [ 75%] procedures/index
     [exec] reading sources... [ 77%] procedures/proposal
     [exec] reading sources... [ 80%] procedures/pull_requests
     [exec] reading sources... [ 82%] procedures/release
     [exec] reading sources... [ 84%] procedures/stable
     [exec] reading sources... [ 86%] procedures/supported
     [exec] reading sources... [ 88%] procedures/website
     [exec] reading sources... [ 91%] roles/committee
     [exec] reading sources... [ 93%] roles/committer
     [exec] reading sources... [ 95%] roles/contributor
     [exec] reading sources... [ 97%] roles/index
     [exec] reading sources... [100%] roles/maintainer

     [exec] looking for now-outdated files... none found
     [exec] pickling environment... done
     [exec] checking consistency... done
     [exec] preparing documents... done
     [exec] writing output... [  2%] communication
     [exec] writing output... [  4%] conventions/code/assert
     [exec] writing output... [  6%] conventions/code/assumptions
     [exec] writing output... [  8%] conventions/code/code
     [exec] writing output... [ 11%] conventions/code/exception
     [exec] writing output... [ 13%] conventions/code/javadocutils
     [exec] writing output... [ 15%] conventions/code/log
     [exec] writing output... [ 17%] conventions/code/null
     [exec] writing output... [ 20%] conventions/code/style
     [exec] writing output... [ 22%] conventions/code/url
     [exec] writing output... [ 24%] conventions/index
     [exec] writing output... [ 26%] conventions/module
     [exec] writing output... [ 28%] conventions/name
     [exec] writing output... [ 31%] conventions/profile
     [exec] writing output... [ 33%] conventions/refactor
     [exec] writing output... [ 35%] conventions/test/data
     [exec] writing output... [ 37%] conventions/test/junit
     [exec] writing output... [ 40%] conventions/test/online
     [exec] writing output... [ 42%] conventions/test/test
     [exec] writing output... [ 44%] conventions/version
     [exec] writing output... [ 46%] docs/index
     [exec] writing output... [ 48%] docs/reference
     [exec] writing output... [ 51%] docs/tutorial
     [exec] writing output... [ 53%] docs/welcome
     [exec] writing output... [ 55%] index
     [exec] writing output... [ 57%] introduction
     [exec] writing output... [ 60%] procedures/add
     [exec] writing output... [ 62%] procedures/build_server
     [exec] writing output... [ 64%] procedures/check
     [exec] writing output... [ 66%] procedures/contribute
     [exec] writing output... [ 68%] procedures/contribution_license
     [exec] writing output... [ 71%] procedures/create
     [exec] writing output... [ 73%] procedures/git
     [exec] writing output... [ 75%] procedures/index
     [exec] writing output... [ 77%] procedures/proposal
     [exec] writing output... [ 80%] procedures/pull_requests
     [exec] writing output... [ 82%] procedures/release
     [exec] writing output... [ 84%] procedures/stable
     [exec] writing output... [ 86%] procedures/supported
     [exec] writing output... [ 88%] procedures/website
     [exec] writing output... [ 91%] roles/committee
     [exec] writing output... [ 93%] roles/committer
     [exec] writing output... [ 95%] roles/contributor
     [exec] writing output... [ 97%] roles/index
     [exec] writing output... [100%] roles/maintainer

     [exec] writing additional files... search
     [exec] copying images... [ 16%] images/merge-conflict.png
     [exec] copying images... [ 33%] images/create-pull-request.png
     [exec] copying images... [ 50%] images/close-pull-request.png
     [exec] copying images... [ 66%] images/discuss-pull-request.png
     [exec] copying images... [ 83%] images/automatically-merged.png
     [exec] copying images... [100%] images/ccAttribution.png

     [exec] copying downloadable files... [ 20%] <http://ares.boundlessgeo.com/jenkins/job/geotools-master-online-oracle/ws/docs/developer/artifacts/corporate_contributor.txt>
     [exec] copying downloadable files... [ 40%] <http://ares.boundlessgeo.com/jenkins/job/geotools-master-online-oracle/ws/modules/library/main/src/main/java/org/geotools/feature/type/DateUtil.java>
     [exec] copying downloadable files... [ 60%] <http://ares.boundlessgeo.com/jenkins/job/geotools-master-online-oracle/ws/docs/developer/artifacts/individual_contributor.pdf>
     [exec] copying downloadable files... [ 80%] <http://ares.boundlessgeo.com/jenkins/job/geotools-master-online-oracle/ws/docs/developer/artifacts/corporate_contributor.pdf>
     [exec] copying downloadable files... [100%] <http://ares.boundlessgeo.com/jenkins/job/geotools-master-online-oracle/ws/docs/developer/artifacts/individual_contributor.txt>

     [exec] copying static files... done
     [exec] dumping search index... done
     [exec] dumping object inventory... done
     [exec] build succeeded.

full:
[INFO] Executed tasks
[INFO]
[INFO] --- maven-resources-plugin:2.6:testResources (default-testResources) @ docs ---
[INFO] Using 'UTF-8' encoding to copy filtered resources.
[INFO] skip non existing resourceDirectory <http://ares.boundlessgeo.com/jenkins/job/geotools-master-online-oracle/ws/docs/src/test/resources>
[INFO]
[INFO] --- maven-compiler-plugin:3.1:testCompile (default-testCompile) @ docs ---
[INFO] No sources to compile
[INFO]
[INFO] --- maven-surefire-plugin:2.15:test (default-test) @ docs ---
[INFO] No tests to run.
[INFO]
[INFO] --- maven-jar-plugin:2.4:jar (default-jar) @ docs ---
[INFO] Building jar: <http://ares.boundlessgeo.com/jenkins/job/geotools-master-online-oracle/ws/docs/target/docs-18-SNAPSHOT.jar>
[INFO]
[INFO] >>> maven-source-plugin:2.2.1:jar (attach-sources) > generate-sources @ docs >>>
[INFO]
[INFO] --- git-commit-id-plugin:2.1.2:revision (default) @ docs ---
[INFO]
[INFO] <<< maven-source-plugin:2.2.1:jar (attach-sources) < generate-sources @ docs <<<
[INFO]
[INFO] --- maven-source-plugin:2.2.1:jar (attach-sources) @ docs ---
[INFO] Building jar: <http://ares.boundlessgeo.com/jenkins/job/geotools-master-online-oracle/ws/docs/target/docs-18-SNAPSHOT-sources.jar>
[INFO]
[INFO] --- maven-install-plugin:2.4:install (default-install) @ docs ---
[INFO] Installing <http://ares.boundlessgeo.com/jenkins/job/geotools-master-online-oracle/ws/docs/target/docs-18-SNAPSHOT.jar> to /var/lib/jenkins/.m2/repository/org/geotools/docs/18-SNAPSHOT/docs-18-SNAPSHOT.jar
[INFO] Installing <http://ares.boundlessgeo.com/jenkins/job/geotools-master-online-oracle/ws/docs/pom.xml> to /var/lib/jenkins/.m2/repository/org/geotools/docs/18-SNAPSHOT/docs-18-SNAPSHOT.pom
[INFO] Installing <http://ares.boundlessgeo.com/jenkins/job/geotools-master-online-oracle/ws/docs/target/docs-18-SNAPSHOT-sources.jar> to /var/lib/jenkins/.m2/repository/org/geotools/docs/18-SNAPSHOT/docs-18-SNAPSHOT-sources.jar
[INFO] ------------------------------------------------------------------------
[INFO] Reactor Summary:
[INFO]
[INFO] JDBC DataStore Support ............................. SUCCESS [ 19.577 s]
[INFO] ArcSDE DataStore plugin ............................ SUCCESS [ 14.370 s]
[INFO] JDBC DataStore Plugins ............................. SUCCESS [  0.155 s]
[INFO] H2 DataStore ....................................... SUCCESS [ 41.662 s]
[INFO] Oracle DataStore ................................... FAILURE [10:43 min]
[INFO] PostGIS DataStore .................................. SUCCESS [  7.258 s]
[INFO] imagemosaic datasource module ...................... SKIPPED
[INFO] imagepyramid datasource module ..................... SKIPPED
[INFO] imagemosaic-jdbc module ............................ SUCCESS [ 15.806 s]
[INFO] DB2 DataStore ...................................... SUCCESS [  4.725 s]
[INFO] MySQL DataStore .................................... SUCCESS [  3.853 s]
[INFO] SQL Server DataStore ............................... SUCCESS [  5.120 s]
[INFO] SpatiaLite DataStore ............................... SUCCESS [  4.395 s]
[INFO] Teradata DataStore ................................. SUCCESS [  4.356 s]
[INFO] API interfaces ..................................... SKIPPED
[INFO] NetCDF gridcoverage module ......................... SKIPPED
[INFO] GRIB gridcoverage module ........................... SKIPPED
[INFO] GeoPackage Module .................................. SUCCESS [01:20 min]
[INFO] Application Schema DataAccess ...................... SUCCESS [ 49.856 s]
[INFO] Validation Processor and Framework ................. SUCCESS [  8.638 s]
[INFO] MBTiles Module ..................................... SUCCESS [ 19.388 s]
[INFO] Web Processing Service ............................. SUCCESS [  6.903 s]
[INFO] Next Generation JDBC DataStores .................... SUCCESS [  0.145 s]
[INFO] MongoDB DataStore .................................. SUCCESS [  9.466 s]
[INFO] GeoTools Documentation ............................. SUCCESS [01:05 min]
[INFO] ------------------------------------------------------------------------
[INFO] BUILD FAILURE
[INFO] ------------------------------------------------------------------------
[INFO] Total time: 17:20 min
[INFO] Finished at: 2017-08-02T05:50:07+00:00
[INFO] Final Memory: 78M/588M
[INFO] ------------------------------------------------------------------------
[ERROR] Failed to execute goal org.apache.maven.plugins:maven-surefire-plugin:2.15:test (default-test) on project gt-jdbc-oracle: There are test failures.
[ERROR]
[ERROR] Please refer to <http://ares.boundlessgeo.com/jenkins/job/geotools-master-online-oracle/ws/modules/plugin/jdbc/jdbc-oracle/target/surefire-reports> for the individual test results.
[ERROR] -> [Help 1]
[ERROR]
[ERROR] To see the full stack trace of the errors, re-run Maven with the -e switch.
[ERROR] Re-run Maven using the -X switch to enable full debug logging.
[ERROR]
[ERROR] For more information about the errors and possible solutions, please read the following articles:
[ERROR] [Help 1] http://cwiki.apache.org/confluence/display/MAVEN/MojoFailureException
[ERROR]
[ERROR] After correcting the problems, you can resume the build with the command
[ERROR]   mvn <goals> -rf :gt-jdbc-oracle
Build step 'Invoke top-level Maven targets' marked build as failure

------------------------------------------------------------------------------
Check out the vibrant tech community on one of the world's most
engaging tech sites, Slashdot.org! http://sdm.link/slashdot
_______________________________________________
GeoTools-Devel mailing list
[hidden email]
https://lists.sourceforge.net/lists/listinfo/geotools-devel