Build failed in Jenkins: geotools-master-online-mysql #285

Previous Topic Next Topic
 
classic Classic list List threaded Threaded
2 messages Options
Reply | Threaded
Open this post in threaded view
|  
Report Content as Inappropriate

Build failed in Jenkins: geotools-master-online-mysql #285

monitor
See <http://ares.boundlessgeo.com/jenkins/job/geotools-master-online-mysql/285/changes>

Changes:

[github] fix issue with Schema not being set (#1645)

------------------------------------------
[...truncated 5131 lines...]
     [exec] reading sources... [ 97%] roles/index
     [exec] reading sources... [100%] roles/maintainer

     [exec] looking for now-outdated files... none found
     [exec] pickling environment... done
     [exec] checking consistency... done
     [exec] preparing documents... done
     [exec] writing output... [  2%] communication
     [exec] writing output... [  4%] conventions/code/assert
     [exec] writing output... [  6%] conventions/code/assumptions
     [exec] writing output... [  8%] conventions/code/code
     [exec] writing output... [ 11%] conventions/code/exception
     [exec] writing output... [ 13%] conventions/code/javadocutils
     [exec] writing output... [ 15%] conventions/code/log
     [exec] writing output... [ 17%] conventions/code/null
     [exec] writing output... [ 20%] conventions/code/style
     [exec] writing output... [ 22%] conventions/code/url
     [exec] writing output... [ 24%] conventions/index
     [exec] writing output... [ 26%] conventions/module
     [exec] writing output... [ 28%] conventions/name
     [exec] writing output... [ 31%] conventions/profile
     [exec] writing output... [ 33%] conventions/refactor
     [exec] writing output... [ 35%] conventions/test/data
     [exec] writing output... [ 37%] conventions/test/junit
     [exec] writing output... [ 40%] conventions/test/online
     [exec] writing output... [ 42%] conventions/test/test
     [exec] writing output... [ 44%] conventions/version
     [exec] writing output... [ 46%] docs/index
     [exec] writing output... [ 48%] docs/reference
     [exec] writing output... [ 51%] docs/tutorial
     [exec] writing output... [ 53%] docs/welcome
     [exec] writing output... [ 55%] index
     [exec] writing output... [ 57%] introduction
     [exec] writing output... [ 60%] procedures/add
     [exec] writing output... [ 62%] procedures/build_server
     [exec] writing output... [ 64%] procedures/check
     [exec] writing output... [ 66%] procedures/contribute
     [exec] writing output... [ 68%] procedures/contribution_license
     [exec] writing output... [ 71%] procedures/create
     [exec] writing output... [ 73%] procedures/git
     [exec] writing output... [ 75%] procedures/index
     [exec] writing output... [ 77%] procedures/proposal
     [exec] writing output... [ 80%] procedures/pull_requests
     [exec] writing output... [ 82%] procedures/release
     [exec] writing output... [ 84%] procedures/stable
     [exec] writing output... [ 86%] procedures/supported
     [exec] writing output... [ 88%] procedures/website
     [exec] writing output... [ 91%] roles/committee
     [exec] writing output... [ 93%] roles/committer
     [exec] writing output... [ 95%] roles/contributor
     [exec] writing output... [ 97%] roles/index
     [exec] writing output... [100%] roles/maintainer

     [exec] writing additional files... search
     [exec] copying images... [ 16%] images/merge-conflict.png
     [exec] copying images... [ 33%] images/create-pull-request.png
     [exec] copying images... [ 50%] images/close-pull-request.png
     [exec] copying images... [ 66%] images/discuss-pull-request.png
     [exec] copying images... [ 83%] images/automatically-merged.png
     [exec] copying images... [100%] images/ccAttribution.png

     [exec] copying downloadable files... [ 20%] <http://ares.boundlessgeo.com/jenkins/job/geotools-master-online-mysql/ws/modules/library/main/src/main/java/org/geotools/feature/type/DateUtil.java>
     [exec] copying downloadable files... [ 40%] <http://ares.boundlessgeo.com/jenkins/job/geotools-master-online-mysql/ws/docs/developer/artifacts/corporate_contributor.pdf>
     [exec] copying downloadable files... [ 60%] <http://ares.boundlessgeo.com/jenkins/job/geotools-master-online-mysql/ws/docs/developer/artifacts/individual_contributor.txt>
     [exec] copying downloadable files... [ 80%] <http://ares.boundlessgeo.com/jenkins/job/geotools-master-online-mysql/ws/docs/developer/artifacts/individual_contributor.pdf>
     [exec] copying downloadable files... [100%] <http://ares.boundlessgeo.com/jenkins/job/geotools-master-online-mysql/ws/docs/developer/artifacts/corporate_contributor.txt>

     [exec] copying static files... done
     [exec] dumping search index... done
     [exec] dumping object inventory... done
     [exec] build succeeded.

full:
[INFO] Executed tasks
[INFO]
[INFO] --- maven-resources-plugin:2.6:testResources (default-testResources) @ docs ---
[INFO] Using 'UTF-8' encoding to copy filtered resources.
[INFO] skip non existing resourceDirectory <http://ares.boundlessgeo.com/jenkins/job/geotools-master-online-mysql/ws/docs/src/test/resources>
[INFO]
[INFO] --- maven-compiler-plugin:3.1:testCompile (default-testCompile) @ docs ---
[INFO] No sources to compile
[INFO]
[INFO] --- maven-surefire-plugin:2.15:test (default-test) @ docs ---
[INFO] No tests to run.
[INFO]
[INFO] --- maven-jar-plugin:2.4:jar (default-jar) @ docs ---
[INFO] Building jar: <http://ares.boundlessgeo.com/jenkins/job/geotools-master-online-mysql/ws/docs/target/docs-18-SNAPSHOT.jar>
[INFO]
[INFO] >>> maven-source-plugin:2.2.1:jar (attach-sources) > generate-sources @ docs >>>
[INFO]
[INFO] --- git-commit-id-plugin:2.1.2:revision (default) @ docs ---
[INFO]
[INFO] <<< maven-source-plugin:2.2.1:jar (attach-sources) < generate-sources @ docs <<<
[INFO]
[INFO] --- maven-source-plugin:2.2.1:jar (attach-sources) @ docs ---
[INFO] Building jar: <http://ares.boundlessgeo.com/jenkins/job/geotools-master-online-mysql/ws/docs/target/docs-18-SNAPSHOT-sources.jar>
[INFO]
[INFO] --- maven-install-plugin:2.4:install (default-install) @ docs ---
[INFO] Installing <http://ares.boundlessgeo.com/jenkins/job/geotools-master-online-mysql/ws/docs/target/docs-18-SNAPSHOT.jar> to /var/lib/jenkins/.m2/repository/org/geotools/docs/18-SNAPSHOT/docs-18-SNAPSHOT.jar
[INFO] Installing <http://ares.boundlessgeo.com/jenkins/job/geotools-master-online-mysql/ws/docs/pom.xml> to /var/lib/jenkins/.m2/repository/org/geotools/docs/18-SNAPSHOT/docs-18-SNAPSHOT.pom
[INFO] Installing <http://ares.boundlessgeo.com/jenkins/job/geotools-master-online-mysql/ws/docs/target/docs-18-SNAPSHOT-sources.jar> to /var/lib/jenkins/.m2/repository/org/geotools/docs/18-SNAPSHOT/docs-18-SNAPSHOT-sources.jar
[INFO] ------------------------------------------------------------------------
[INFO] Reactor Summary:
[INFO]
[INFO] JDBC DataStore Support ............................. SUCCESS [10:42 min]
[INFO] ArcSDE DataStore plugin ............................ FAILURE [07:21 min]
[INFO] JDBC DataStore Plugins ............................. SUCCESS [  0.107 s]
[INFO] H2 DataStore ....................................... SUCCESS [ 41.447 s]
[INFO] Oracle DataStore ................................... SUCCESS [  4.816 s]
[INFO] PostGIS DataStore .................................. SUCCESS [  6.605 s]
[INFO] imagemosaic datasource module ...................... FAILURE [  5.770 s]
[INFO] imagepyramid datasource module ..................... SKIPPED
[INFO] imagemosaic-jdbc module ............................ FAILURE [ 12.455 s]
[INFO] DB2 DataStore ...................................... SUCCESS [  5.131 s]
[INFO] MySQL DataStore .................................... SUCCESS [01:44 min]
[INFO] SQL Server DataStore ............................... SUCCESS [  5.059 s]
[INFO] SpatiaLite DataStore ............................... SUCCESS [  4.073 s]
[INFO] Teradata DataStore ................................. SUCCESS [  4.203 s]
[INFO] API interfaces ..................................... SKIPPED
[INFO] NetCDF gridcoverage module ......................... SKIPPED
[INFO] GRIB gridcoverage module ........................... SKIPPED
[INFO] GeoPackage Module .................................. FAILURE [ 52.005 s]
[INFO] Application Schema DataAccess ...................... SUCCESS [ 45.671 s]
[INFO] Validation Processor and Framework ................. SUCCESS [  8.972 s]
[INFO] MBTiles Module ..................................... FAILURE [  3.380 s]
[INFO] Web Processing Service ............................. SUCCESS [  5.333 s]
[INFO] Next Generation JDBC DataStores .................... SUCCESS [  0.079 s]
[INFO] MongoDB DataStore .................................. SUCCESS [  9.233 s]
[INFO] GeoTools Documentation ............................. SUCCESS [01:01 min]
[INFO] ------------------------------------------------------------------------
[INFO] BUILD FAILURE
[INFO] ------------------------------------------------------------------------
[INFO] Total time: 24:50 min
[INFO] Finished at: 2017-07-08T10:22:36+00:00
[INFO] Final Memory: 78M/534M
[INFO] ------------------------------------------------------------------------
[ERROR] Failed to execute goal on project gt-arcsde: Could not resolve dependencies for project org.geotools:gt-arcsde:jar:18-SNAPSHOT: Failed to collect dependencies at org.geotools:gt-coverage:jar:18-SNAPSHOT: Failed to read artifact descriptor for org.geotools:gt-coverage:jar:18-SNAPSHOT: Could not transfer artifact org.geotools:gt-coverage:pom:18-20170707.195218-207 from/to boundless (https://repo.boundlessgeo.com/main/): Connect to repo.boundlessgeo.com:443 [repo.boundlessgeo.com/52.22.156.115] failed: Connection timed out -> [Help 1]
[ERROR] Failed to execute goal org.apache.maven.plugins:maven-compiler-plugin:3.1:compile (default-compile) on project gt-imagemosaic: Compilation failure: Compilation failure:
[ERROR] <http://ares.boundlessgeo.com/jenkins/job/geotools-master-online-mysql/ws/modules/plugin/imagemosaic/src/main/java/org/geotools/gce/imagemosaic/RasterLayerResponse.java>:[118,35] error: package it.geosolutions.jaiext.range does not exist
[ERROR] <http://ares.boundlessgeo.com/jenkins/job/geotools-master-online-mysql/ws/modules/plugin/imagemosaic/src/main/java/org/geotools/gce/imagemosaic/RasterLayerResponse.java>:[119,35] error: package it.geosolutions.jaiext.range does not exist
[ERROR] <http://ares.boundlessgeo.com/jenkins/job/geotools-master-online-mysql/ws/modules/plugin/imagemosaic/src/main/java/org/geotools/gce/imagemosaic/RasterLayerResponse.java>:[120,35] error: package it.geosolutions.jaiext.range does not exist
[ERROR] <http://ares.boundlessgeo.com/jenkins/job/geotools-master-online-mysql/ws/modules/plugin/imagemosaic/src/main/java/org/geotools/gce/imagemosaic/RasterLayerResponse.java>:[121,39] error: package it.geosolutions.jaiext.utilities does not exist
[ERROR] <http://ares.boundlessgeo.com/jenkins/job/geotools-master-online-mysql/ws/modules/plugin/imagemosaic/src/main/java/org/geotools/gce/imagemosaic/MergeBehavior.java>:[33,39] error: package it.geosolutions.jaiext.utilities does not exist
[ERROR] <http://ares.boundlessgeo.com/jenkins/job/geotools-master-online-mysql/ws/modules/plugin/imagemosaic/src/main/java/org/geotools/gce/imagemosaic/GranuleDescriptor.java>:[100,39] error: package it.geosolutions.jaiext.vectorbin does not exist
[ERROR] <http://ares.boundlessgeo.com/jenkins/job/geotools-master-online-mysql/ws/modules/plugin/imagemosaic/src/main/java/org/geotools/gce/imagemosaic/GranuleDescriptor.java>:[101,39] error: package it.geosolutions.jaiext.vectorbin does not exist
[ERROR] <http://ares.boundlessgeo.com/jenkins/job/geotools-master-online-mysql/ws/modules/plugin/imagemosaic/src/main/java/org/geotools/gce/imagemosaic/GranuleDescriptor.java>:[102,39] error: package it.geosolutions.jaiext.vectorbin does not exist
[ERROR] <http://ares.boundlessgeo.com/jenkins/job/geotools-master-online-mysql/ws/modules/plugin/imagemosaic/src/main/java/org/geotools/gce/imagemosaic/egr/Binarizator.java>:[49,39] error: package it.geosolutions.jaiext.vectorbin does not exist
[ERROR] <http://ares.boundlessgeo.com/jenkins/job/geotools-master-online-mysql/ws/modules/plugin/imagemosaic/src/main/java/org/geotools/gce/imagemosaic/egr/Tile.java>:[53,39] error: package it.geosolutions.jaiext.iterators does not exist
[ERROR] <http://ares.boundlessgeo.com/jenkins/job/geotools-master-online-mysql/ws/modules/plugin/imagemosaic/src/main/java/org/geotools/gce/imagemosaic/granulecollector/BaseSubmosaicProducer.java>:[62,39] error: package it.geosolutions.jaiext.vectorbin does not exist
[ERROR] <http://ares.boundlessgeo.com/jenkins/job/geotools-master-online-mysql/ws/modules/plugin/imagemosaic/src/main/java/org/geotools/gce/imagemosaic/Mosaicker.java>:[47,39] error: package it.geosolutions.jaiext.vectorbin does not exist
[ERROR] <http://ares.boundlessgeo.com/jenkins/job/geotools-master-online-mysql/ws/modules/plugin/imagemosaic/src/main/java/org/geotools/gce/imagemosaic/RasterLayerResponse.java>:[1051,14] error: cannot find symbol
[ERROR] symbol:   class ImageLayout2
[ERROR] location: class RasterLayerResponse
[ERROR] <http://ares.boundlessgeo.com/jenkins/job/geotools-master-online-mysql/ws/modules/plugin/imagemosaic/src/main/java/org/geotools/gce/imagemosaic/RasterLayerResponse.java>:[1051,36] error: cannot find symbol
[ERROR] symbol:   class ImageLayout2
[ERROR] location: class RasterLayerResponse
[ERROR] <http://ares.boundlessgeo.com/jenkins/job/geotools-master-online-mysql/ws/modules/plugin/imagemosaic/src/main/java/org/geotools/gce/imagemosaic/RasterLayerResponse.java>:[1113,24] error: cannot find symbol
[ERROR] symbol:   class Range
[ERROR] location: class RasterLayerResponse
[ERROR] <http://ares.boundlessgeo.com/jenkins/job/geotools-master-online-mysql/ws/modules/plugin/imagemosaic/src/main/java/org/geotools/gce/imagemosaic/RasterLayerResponse.java>:[1113,34] error: cannot find symbol
[ERROR] symbol:   variable RangeFactory
[ERROR] location: class RasterLayerResponse
[ERROR] <http://ares.boundlessgeo.com/jenkins/job/geotools-master-online-mysql/ws/modules/plugin/imagemosaic/src/main/java/org/geotools/gce/imagemosaic/RasterLayerResponse.java>:[1294,43] error: cannot find symbol
[ERROR] symbol:   variable NoDataContainer
[ERROR] location: class RasterLayerResponse
[ERROR] <http://ares.boundlessgeo.com/jenkins/job/geotools-master-online-mysql/ws/modules/plugin/imagemosaic/src/main/java/org/geotools/gce/imagemosaic/RasterLayerResponse.java>:[1296,35] error: cannot find symbol
[ERROR] symbol:   class NoDataContainer
[ERROR] location: class RasterLayerResponse
[ERROR] <http://ares.boundlessgeo.com/jenkins/job/geotools-master-online-mysql/ws/modules/plugin/imagemosaic/src/main/java/org/geotools/gce/imagemosaic/RasterLayerResponse.java>:[1297,29] error: cannot find symbol
[ERROR] symbol:   class NoDataContainer
[ERROR] location: class RasterLayerResponse
[ERROR] <http://ares.boundlessgeo.com/jenkins/job/geotools-master-online-mysql/ws/modules/plugin/imagemosaic/src/main/java/org/geotools/gce/imagemosaic/MergeBehavior.java>:[107,72] error: cannot find symbol
[ERROR] symbol: class ImageLayout2
[ERROR] <http://ares.boundlessgeo.com/jenkins/job/geotools-master-online-mysql/ws/modules/plugin/imagemosaic/src/main/java/org/geotools/gce/imagemosaic/GranuleDescriptor.java>:[135,63] error: cannot find symbol
[ERROR] symbol:   class VectorBinarizeDescriptor
[ERROR] location: class GranuleDescriptor
[ERROR] <http://ares.boundlessgeo.com/jenkins/job/geotools-master-online-mysql/ws/modules/plugin/imagemosaic/src/main/java/org/geotools/gce/imagemosaic/GranuleDescriptor.java>:[136,24] error: cannot find symbol
[ERROR] symbol:   class VectorBinarizeRIF
[ERROR] location: class GranuleDescriptor
[ERROR] <http://ares.boundlessgeo.com/jenkins/job/geotools-master-online-mysql/ws/modules/plugin/imagemosaic/src/main/java/org/geotools/gce/imagemosaic/GranuleDescriptor.java>:[1038,47] error: cannot find symbol
[ERROR] symbol:   class ROIGeometry
[ERROR] location: class GranuleDescriptor
[ERROR] <http://ares.boundlessgeo.com/jenkins/job/geotools-master-online-mysql/ws/modules/plugin/imagemosaic/src/main/java/org/geotools/gce/imagemosaic/GranuleDescriptor.java>:[1039,33] error: cannot find symbol
[ERROR] symbol:   class ROIGeometry
[ERROR] location: class GranuleDescriptor
[ERROR] <http://ares.boundlessgeo.com/jenkins/job/geotools-master-online-mysql/ws/modules/plugin/imagemosaic/src/main/java/org/geotools/gce/imagemosaic/GranuleDescriptor.java>:[1140,43] error: cannot find symbol
[ERROR] symbol:   class ROIGeometry
[ERROR] location: class GranuleDescriptor
[ERROR] <http://ares.boundlessgeo.com/jenkins/job/geotools-master-online-mysql/ws/modules/plugin/imagemosaic/src/main/java/org/geotools/gce/imagemosaic/GranuleDescriptor.java>:[1141,37] error: cannot find symbol
[ERROR] symbol:   class ROIGeometry
[ERROR] location: class GranuleDescriptor
[ERROR] <http://ares.boundlessgeo.com/jenkins/job/geotools-master-online-mysql/ws/modules/plugin/imagemosaic/src/main/java/org/geotools/gce/imagemosaic/GranuleDescriptor.java>:[1150,34] error: cannot find symbol
[ERROR] symbol:   variable NoDataContainer
[ERROR] location: class GranuleDescriptor
[ERROR] <http://ares.boundlessgeo.com/jenkins/job/geotools-master-online-mysql/ws/modules/plugin/imagemosaic/src/main/java/org/geotools/gce/imagemosaic/GranuleDescriptor.java>:[1150,65] error: cannot find symbol
[ERROR] symbol:   class NoDataContainer
[ERROR] location: class GranuleDescriptor
[ERROR] <http://ares.boundlessgeo.com/jenkins/job/geotools-master-online-mysql/ws/modules/plugin/imagemosaic/src/main/java/org/geotools/gce/imagemosaic/egr/Binarizator.java>:[165,27] error: cannot find symbol
[ERROR] symbol:   class ROIGeometry
[ERROR] location: class Binarizator
[ERROR] <http://ares.boundlessgeo.com/jenkins/job/geotools-master-online-mysql/ws/modules/plugin/imagemosaic/src/main/java/org/geotools/gce/imagemosaic/egr/Binarizator.java>:[166,34] error: cannot find symbol
[ERROR] symbol:   class ROIGeometry
[ERROR] location: class Binarizator
[ERROR] <http://ares.boundlessgeo.com/jenkins/job/geotools-master-online-mysql/ws/modules/plugin/imagemosaic/src/main/java/org/geotools/gce/imagemosaic/egr/Tile.java>:[272,32] error: cannot find symbol
[ERROR] symbol:   variable RandomIterFactory
[ERROR] location: class Tile
[ERROR] <http://ares.boundlessgeo.com/jenkins/job/geotools-master-online-mysql/ws/modules/plugin/imagemosaic/src/main/java/org/geotools/gce/imagemosaic/egr/Tile.java>:[273,40] error: cannot find symbol
[ERROR] symbol:   variable RandomIterFactory
[ERROR] location: class Tile
[ERROR] <http://ares.boundlessgeo.com/jenkins/job/geotools-master-online-mysql/ws/modules/plugin/imagemosaic/src/main/java/org/geotools/gce/imagemosaic/granulecollector/BaseSubmosaicProducer.java>:[310,27] error: cannot find symbol
[ERROR] symbol:   class ROIGeometry
[ERROR] location: class BaseSubmosaicProducer
[ERROR] <http://ares.boundlessgeo.com/jenkins/job/geotools-master-online-mysql/ws/modules/plugin/imagemosaic/src/main/java/org/geotools/gce/imagemosaic/Mosaicker.java>:[217,46] error: cannot find symbol
[ERROR] symbol:   variable NoDataContainer
[ERROR] location: class Mosaicker
[ERROR] <http://ares.boundlessgeo.com/jenkins/job/geotools-master-online-mysql/ws/modules/plugin/imagemosaic/src/main/java/org/geotools/gce/imagemosaic/Mosaicker.java>:[218,44] error: cannot find symbol
[ERROR] symbol:   class NoDataContainer
[ERROR] location: class Mosaicker
[ERROR] <http://ares.boundlessgeo.com/jenkins/job/geotools-master-online-mysql/ws/modules/plugin/imagemosaic/src/main/java/org/geotools/gce/imagemosaic/Mosaicker.java>:[236,46] error: cannot find symbol
[ERROR] symbol:   class ROIGeometry
[ERROR] location: class Mosaicker
[ERROR] <http://ares.boundlessgeo.com/jenkins/job/geotools-master-online-mysql/ws/modules/plugin/imagemosaic/src/main/java/org/geotools/gce/imagemosaic/granulecollector/ReprojectingSubmosaicProducer.java>:[292,30] error: cannot find symbol
[ERROR] symbol:   variable NoDataContainer
[ERROR] location: class ReprojectingSubmosaicProducer
[ERROR] <http://ares.boundlessgeo.com/jenkins/job/geotools-master-online-mysql/ws/modules/plugin/imagemosaic/src/main/java/org/geotools/gce/imagemosaic/granulecollector/ReprojectingSubmosaicProducer.java>:[292,61] error: cannot find symbol
[ERROR] -> [Help 2]
[ERROR] Failed to execute goal org.apache.maven.plugins:maven-surefire-plugin:2.15:test (default-test) on project gt-imagemosaic-jdbc: There are test failures.
[ERROR]
[ERROR] Please refer to <http://ares.boundlessgeo.com/jenkins/job/geotools-master-online-mysql/ws/modules/plugin/imagemosaic-jdbc/target/surefire-reports> for the individual test results.
[ERROR] -> [Help 2]
[ERROR] Failed to execute goal org.apache.maven.plugins:maven-surefire-plugin:2.15:test (default-test) on project gt-geopkg: There are test failures.
[ERROR]
[ERROR] Please refer to <http://ares.boundlessgeo.com/jenkins/job/geotools-master-online-mysql/ws/modules/plugin/geopkg/target/surefire-reports> for the individual test results.
[ERROR] -> [Help 2]
[ERROR] Failed to execute goal org.apache.maven.plugins:maven-compiler-plugin:3.1:testCompile (default-testCompile) on project gt-mbtiles: Compilation failure: Compilation failure:
[ERROR] <http://ares.boundlessgeo.com/jenkins/job/geotools-master-online-mysql/ws/modules/unsupported/mbtiles/src/test/java/org/geotools/mbtiles/MBTilesFileVectorTileTest.java>:[11,28] error: package org.apache.commons.io does not exist
[ERROR] <http://ares.boundlessgeo.com/jenkins/job/geotools-master-online-mysql/ws/modules/unsupported/mbtiles/src/test/java/org/geotools/mbtiles/MBTilesFileVectorTileTest.java>:[57,23] error: cannot find symbol
[ERROR] -> [Help 2]
[ERROR]
[ERROR] To see the full stack trace of the errors, re-run Maven with the -e switch.
[ERROR] Re-run Maven using the -X switch to enable full debug logging.
[ERROR]
[ERROR] For more information about the errors and possible solutions, please read the following articles:
[ERROR] [Help 1] http://cwiki.apache.org/confluence/display/MAVEN/DependencyResolutionException
[ERROR] [Help 2] http://cwiki.apache.org/confluence/display/MAVEN/MojoFailureException
[ERROR]
[ERROR] After correcting the problems, you can resume the build with the command
[ERROR]   mvn <goals> -rf :gt-arcsde
Build step 'Invoke top-level Maven targets' marked build as failure

------------------------------------------------------------------------------
Check out the vibrant tech community on one of the world's most
engaging tech sites, Slashdot.org! http://sdm.link/slashdot
_______________________________________________
GeoTools-Devel mailing list
[hidden email]
https://lists.sourceforge.net/lists/listinfo/geotools-devel
Reply | Threaded
Open this post in threaded view
|  
Report Content as Inappropriate

Jenkins build is back to normal : geotools-master-online-mysql #286

monitor
See <http://ares.boundlessgeo.com/jenkins/job/geotools-master-online-mysql/286/changes>


------------------------------------------------------------------------------
Check out the vibrant tech community on one of the world's most
engaging tech sites, Slashdot.org! http://sdm.link/slashdot
_______________________________________________
GeoTools-Devel mailing list
[hidden email]
https://lists.sourceforge.net/lists/listinfo/geotools-devel
Loading...