Build failed in Jenkins: geotools-17.x #58

Previous Topic Next Topic
 
classic Classic list List threaded Threaded
3 messages Options
Reply | Threaded
Open this post in threaded view
|  
Report Content as Inappropriate

Build failed in Jenkins: geotools-17.x #58

monitor
See <http://ares.boundlessgeo.com/jenkins/job/geotools-17.x/58/changes>

Changes:

[ben] Configure Travis CI to use Ubuntu Trusty with parallel builds to avoid

------------------------------------------
[...truncated 8645 lines...]
Skipping test BridjGeometryMapperTest testPolygon since GDAL is not available
Tests run: 0, Failures: 0, Errors: 0, Skipped: 0, Time elapsed: 1.291 sec - in org.geotools.data.ogr.bridj.BridjGeometryMapperTest
Running org.geotools.data.ogr.bridj.BridjOGRDataStoreFactoryTest
Skipping test BridjOGRDataStoreFactoryTest testNames since GDAL is not available
Skipping test BridjOGRDataStoreFactoryTest testLookup since GDAL is not available
Skipping test BridjOGRDataStoreFactoryTest testNamespace since GDAL is not available
Tests run: 0, Failures: 0, Errors: 0, Skipped: 0, Time elapsed: 0.002 sec - in org.geotools.data.ogr.bridj.BridjOGRDataStoreFactoryTest
Running org.geotools.data.ogr.bridj.BridjOGRDataStoreTest
Skipping test BridjOGRDataStoreTest testVersion since GDAL is not available
Skipping test BridjOGRDataStoreTest testCreateSchema since GDAL is not available
Skipping test BridjOGRDataStoreTest testShapefileComparison since GDAL is not available
Skipping test BridjOGRDataStoreTest testAttributesWritingSqliteFromUpperCaseAttributes since GDAL is not available
Skipping test BridjOGRDataStoreTest testAttributeFilters since GDAL is not available
Skipping test BridjOGRDataStoreTest testGeometryFilters since GDAL is not available
Skipping test BridjOGRDataStoreTest testAttributesWritingGeoJSON since GDAL is not available
Skipping test BridjOGRDataStoreTest testLoadAndVerify since GDAL is not available
Skipping test BridjOGRDataStoreTest testRemoveFromBackAndClose since GDAL is not available
Skipping test BridjOGRDataStoreTest testLoadGeometry since GDAL is not available
Skipping test BridjOGRDataStoreTest testAttributesWritingSqliteWithSorting since GDAL is not available
Skipping test BridjOGRDataStoreTest testOptimizedEnvelope since GDAL is not available
Skipping test BridjOGRDataStoreTest testAttributesWritingGeoRSS since GDAL is not available
Skipping test BridjOGRDataStoreTest testRemoveFromFrontAndClose since GDAL is not available
Skipping test BridjOGRDataStoreTest testAttributesWritingSqlite since GDAL is not available
Skipping test BridjOGRDataStoreTest testAttributesWritingCsv since GDAL is not available
Skipping test BridjOGRDataStoreTest testAttributesWritingGML since GDAL is not available
Skipping test BridjOGRDataStoreTest testAttributesWritingGmt since GDAL is not available
Skipping test BridjOGRDataStoreTest testAttributesWritingGpx since GDAL is not available
Skipping test BridjOGRDataStoreTest testAttributesWritingKML since GDAL is not available
Skipping test BridjOGRDataStoreTest testAttributesWritingShapefile since GDAL is not available
Skipping test BridjOGRDataStoreTest testSchemaMix since GDAL is not available
Skipping test BridjOGRDataStoreTest testSchemaPop since GDAL is not available
Skipping test BridjOGRDataStoreTest testCountWithOffsetLimit since GDAL is not available
Skipping test BridjOGRDataStoreTest testCreateWriteRead since GDAL is not available
Skipping test BridjOGRDataStoreTest testLoadAndCheckParentTypeIsPolygon since GDAL is not available
Skipping test BridjOGRDataStoreTest testGetTypeNames since GDAL is not available
Skipping test BridjOGRDataStoreTest testOptimizedCount since GDAL is not available
Tests run: 0, Failures: 0, Errors: 0, Skipped: 0, Time elapsed: 0.016 sec - in org.geotools.data.ogr.bridj.BridjOGRDataStoreTest
Running org.geotools.data.ogr.bridj.BridjOGRPerformanceTest
Skipping test BridjOGRPerformanceTest testOGRShapePerformance since GDAL is not available
Skipping test BridjOGRPerformanceTest testShapefilePerformance since GDAL is not available
Tests run: 0, Failures: 0, Errors: 0, Skipped: 0, Time elapsed: 0.002 sec - in org.geotools.data.ogr.bridj.BridjOGRPerformanceTest

Results :

Tests run: 0, Failures: 0, Errors: 0, Skipped: 0

[INFO]
[INFO] --- maven-jar-plugin:2.4:jar (default-jar) @ gt-ogr-bridj ---
[INFO] Building jar: <http://ares.boundlessgeo.com/jenkins/job/geotools-17.x/ws/modules/plugin/ogr/ogr-bridj/target/gt-ogr-bridj-17-SNAPSHOT.jar>
[INFO]
[INFO] >>> maven-source-plugin:2.2.1:jar (attach-sources) > generate-sources @ gt-ogr-bridj >>>
[INFO]
[INFO] --- git-commit-id-plugin:2.1.2:revision (default) @ gt-ogr-bridj ---
Tests run: 5, Failures: 0, Errors: 0, Skipped: 0, Time elapsed: 1.029 sec - in org.geotools.image.palette.QuantizerTest
Running org.geotools.image.test.ImageComparatorTest
[INFO]
[INFO] <<< maven-source-plugin:2.2.1:jar (attach-sources) < generate-sources @ gt-ogr-bridj <<<
[INFO]
[INFO] --- maven-source-plugin:2.2.1:jar (attach-sources) @ gt-ogr-bridj ---
[INFO] Building jar: <http://ares.boundlessgeo.com/jenkins/job/geotools-17.x/ws/modules/plugin/ogr/ogr-bridj/target/gt-ogr-bridj-17-SNAPSHOT-sources.jar>
[INFO]
[INFO] --- maven-install-plugin:2.4:install (default-install) @ gt-ogr-bridj ---
[INFO] Installing <http://ares.boundlessgeo.com/jenkins/job/geotools-17.x/ws/modules/plugin/ogr/ogr-bridj/target/gt-ogr-bridj-17-SNAPSHOT.jar> to /var/lib/jenkins/.m2/repository/org/geotools/gt-ogr-bridj/17-SNAPSHOT/gt-ogr-bridj-17-SNAPSHOT.jar
Tests run: 4, Failures: 0, Errors: 0, Skipped: 0, Time elapsed: 0.242 sec - in org.geotools.image.test.ImageComparatorTest
Running org.geotools.referencing.operation.builder.GridToEnvelopeMapperTest
Tests run: 1, Failures: 0, Errors: 0, Skipped: 0, Time elapsed: 0 sec - in org.geotools.referencing.operation.builder.GridToEnvelopeMapperTest
Running org.geotools.resources.coverage.CoverageUtilitiesTest
Tests run: 3, Failures: 0, Errors: 0, Skipped: 0, Time elapsed: 0.017 sec - in org.geotools.resources.coverage.CoverageUtilitiesTest
Running org.geotools.resources.coverage.IsCoverageTest
[INFO] Installing <http://ares.boundlessgeo.com/jenkins/job/geotools-17.x/ws/modules/plugin/ogr/ogr-bridj/pom.xml> to /var/lib/jenkins/.m2/repository/org/geotools/gt-ogr-bridj/17-SNAPSHOT/gt-ogr-bridj-17-SNAPSHOT.pom
[INFO] Installing <http://ares.boundlessgeo.com/jenkins/job/geotools-17.x/ws/modules/plugin/ogr/ogr-bridj/target/gt-ogr-bridj-17-SNAPSHOT-sources.jar> to /var/lib/jenkins/.m2/repository/org/geotools/gt-ogr-bridj/17-SNAPSHOT/gt-ogr-bridj-17-SNAPSHOT-sources.jar
[INFO]                                                                        
[INFO] ------------------------------------------------------------------------
[INFO] Building JNI OGR DataStore Module 17-SNAPSHOT
[INFO] ------------------------------------------------------------------------
[INFO]
[INFO] --- maven-clean-plugin:2.5:clean (default-clean) @ gt-ogr-jni ---
[INFO] Deleting <http://ares.boundlessgeo.com/jenkins/job/geotools-17.x/ws/modules/plugin/ogr/ogr-jni/target>
Tests run: 2, Failures: 0, Errors: 0, Skipped: 0, Time elapsed: 0.06 sec - in org.geotools.resources.coverage.IsCoverageTest
[INFO]
[INFO] --- git-commit-id-plugin:2.1.2:revision (default) @ gt-ogr-jni ---
[INFO]
[INFO] --- maven-resources-plugin:2.6:resources (default-resources) @ gt-ogr-jni ---
[INFO] Using 'UTF-8' encoding to copy filtered resources.
[INFO] Copying 1 resource
[INFO]
[INFO] --- maven-compiler-plugin:3.1:compile (default-compile) @ gt-ogr-jni ---
[INFO] Changes detected - recompiling the module!
[INFO] Compiling 2 source files to <http://ares.boundlessgeo.com/jenkins/job/geotools-17.x/ws/modules/plugin/ogr/ogr-jni/target/classes>

Results :

Failed tests:
  ImageWorkerTest.rescaleToBytesNoData:868 expected:<255.0> but was:<254.0>

Tests run: 190, Failures: 1, Errors: 0, Skipped: 0

[INFO] ------------------------------------------------------------------------
[INFO] Reactor Summary:
[INFO]
[INFO] GeoTools ........................................... SUCCESS [  1.050 s]
[INFO] Build tools for Geotools 2 ......................... SUCCESS [  0.112 s]
[INFO] Maven plugins for Geotools 2 ....................... SUCCESS [  0.110 s]
[INFO] JAR files collector ................................ SUCCESS [  4.286 s]
[INFO] Cross-modules javadoc .............................. SUCCESS [  2.782 s]
[INFO] JJTree and JavaCC compilers plugin ................. SUCCESS [  1.348 s]
[INFO] Geotools modules ................................... SUCCESS [ 10.478 s]
[INFO] Geotools libraries ................................. SUCCESS [  0.070 s]
[INFO] Sample data module ................................. SUCCESS [  5.288 s]
[INFO] Open GIS Interfaces ................................ SUCCESS [ 10.685 s]
[INFO] Metadata ........................................... SUCCESS [ 13.076 s]
[INFO] Referencing services ............................... SUCCESS [ 17.376 s]
[INFO] API interfaces ..................................... SUCCESS [  9.072 s]
[INFO] Geotools plugins ................................... SUCCESS [  0.119 s]
[INFO] EPSG Authority Service using HSQL database ......... SUCCESS [ 32.294 s]
[INFO] Main module ........................................ SUCCESS [ 36.434 s]
[INFO] Geotools extensions ................................ SUCCESS [  0.054 s]
[INFO] Feature Based Graphs and Networks .................. SUCCESS [ 43.227 s]
[INFO] XML Parsing ........................................ SUCCESS [  0.087 s]
[INFO] XML Parsing ........................................ SUCCESS [ 10.820 s]
[INFO] XML Code Generation Support ........................ SUCCESS [  3.667 s]
[INFO] EPSG Authority Service using WKT file .............. SUCCESS [  5.280 s]
[INFO] OGC CQL to Filter parser ........................... SUCCESS [ 44.647 s]
[INFO] DataStore Support .................................. SUCCESS [ 21.543 s]
[INFO] Property File DataStore ............................ SUCCESS [  6.528 s]
[INFO] Shapefile module ................................... SUCCESS [07:36 min]
[INFO] Grid Coverage module ............................... FAILURE [ 41.211 s]
[INFO] GeoTIFF grid coverage exchange module .............. SKIPPED
[INFO] ArcGrid datasource module .......................... SKIPPED
[INFO] GML2 XML Support ................................... SKIPPED
[INFO] GML3 XML Support ................................... SKIPPED
[INFO] Filter XML Support ................................. SKIPPED
[INFO] SLD XML Support .................................... SKIPPED
[INFO] WorldImage datasource module ....................... SKIPPED
[INFO] Render ............................................. SKIPPED
[INFO] OGC Web Service Models ............................. SUCCESS [  0.066 s]
[INFO] Xlink Model ........................................ SUCCESS [  2.375 s]
[INFO] Open Web Services Model ............................ SUCCESS [  7.985 s]
[INFO] Filter Encoding Specification Model ................ SUCCESS [  5.463 s]
[INFO] Web Feature Service Model .......................... SUCCESS [  7.814 s]
[INFO] OWS XML Support .................................... SKIPPED
[INFO] Filter Encoding Specification XML Support .......... SKIPPED
[INFO] WFS XML Support .................................... SKIPPED
[INFO] XML Parsing Support ................................ SKIPPED
[INFO] JDBC DataStore Support ............................. SUCCESS [ 11.618 s]
[INFO] Web Processing Service Model ....................... SUCCESS [  4.409 s]
[INFO] Web Coverage Service Model ......................... SUCCESS [  8.275 s]
[INFO] Catalog Services for the Web Model ................. SUCCESS [  4.107 s]
[INFO] ArcSDE plugin ...................................... SUCCESS [  0.063 s]
[INFO] ArcSDE dummy api ................................... SUCCESS [  2.101 s]
[INFO] ArcSDE support classes ............................. SUCCESS [  6.970 s]
[INFO] ArcSDE DataStore plugin ............................ SKIPPED
[INFO] Dynamic symbolizer module based on JFreeChart and Eastwood SKIPPED
[INFO] Extensions to EPSG authority factory ............... SUCCESS [  6.923 s]
[INFO] EPSG Authority Service using PostgreSQL database ... SUCCESS [  1.393 s]
[INFO] Feature-Pregeneralized ............................. SUCCESS [  7.911 s]
[INFO] grass raster datasource module ..................... SKIPPED
[INFO] GTopo30 datasource module .......................... SKIPPED
[INFO] JDBC DataStore Plugins ............................. SUCCESS [  0.062 s]
[INFO] H2 DataStore ....................................... SUCCESS [ 42.899 s]
[INFO] Oracle DataStore ................................... SUCCESS [  5.553 s]
[INFO] PostGIS DataStore .................................. SUCCESS [  6.841 s]
[INFO] Feature transforming feature source wrapper ........ SUCCESS [  7.344 s]
[INFO] imagemosaic datasource module ...................... SKIPPED
[INFO] ImageI/O-Ext based grid coverage readers ........... SKIPPED
[INFO] imagepyramid datasource module ..................... SKIPPED
[INFO] imagemosaic-jdbc module ............................ SKIPPED
[INFO] DB2 DataStore ...................................... SUCCESS [  4.542 s]
[INFO] MySQL DataStore .................................... SUCCESS [  3.700 s]
[INFO] SQL Server DataStore ............................... SUCCESS [  4.638 s]
[INFO] SpatiaLite DataStore ............................... SUCCESS [  4.721 s]
[INFO] Teradata DataStore ................................. SUCCESS [  5.086 s]
[INFO] JP2K based grid coverage readers ................... SKIPPED
[INFO] OGR DataStore Module ............................... SUCCESS [  0.089 s]
[INFO] Core OGR DataStore Module .......................... SUCCESS [  4.953 s]
[INFO] Bridj OGR DataStore Module ......................... SUCCESS [  5.008 s]
[INFO] JNI OGR DataStore Module ........................... SKIPPED
[INFO] Vertical coordinate transformations ................ SUCCESS [  4.475 s]
[INFO] Dynamic symbolizers for SVG symbols ................ SKIPPED
[INFO] Coverage Multidimensional Module ................... SUCCESS [  0.084 s]
[INFO] API interfaces ..................................... SKIPPED
[INFO] NetCDF gridcoverage module ......................... SKIPPED
[INFO] GRIB gridcoverage module ........................... SKIPPED
[INFO] GeoPackage Module .................................. SKIPPED
[INFO] Application Schema Support ......................... SUCCESS [  0.133 s]
[INFO] Application Schema Resolver ........................ SKIPPED
[INFO] Complex Features Support ........................... SKIPPED
[INFO] Application Schema DataAccess ...................... SKIPPED
[INFO] Sample DataAccess .................................. SKIPPED
[INFO] Brewer module ...................................... SUCCESS [  7.459 s]
[INFO] Vector grids ....................................... SUCCESS [ 16.941 s]
[INFO] Validation Processor and Framework ................. SUCCESS [  9.155 s]
[INFO] Web Map Server client .............................. SKIPPED
[INFO] KML XML Support .................................... SUCCESS [  8.068 s]
[INFO] WCS XML Support .................................... SKIPPED
[INFO] WPS XML Support .................................... SKIPPED
[INFO] WMS XML Support .................................... SUCCESS [  4.542 s]
[INFO] CSW XML Support .................................... SKIPPED
[INFO] Geotools unsupported ............................... SUCCESS [  0.121 s]
[INFO] Process ............................................ SKIPPED
[INFO] Process Feature .................................... SKIPPED
[INFO] Process Raster ..................................... SKIPPED
[INFO] YSLD Parser/Encoder ................................ SKIPPED
[INFO] Swing widgets ...................................... SKIPPED
[INFO] SWT widgets ........................................ SKIPPED
[INFO] Process Geometry ................................... SKIPPED
[INFO] GeoJSON Support .................................... SUCCESS [  6.449 s]
[INFO] MBTiles Module ..................................... SKIPPED
[INFO] WFS client module (NG) ............................. SKIPPED
[INFO] polylabel .......................................... SKIPPED
[INFO] ISO 19107 implementation using JTS ................. SUCCESS [  2.586 s]
[INFO] Geometries ......................................... SUCCESS [ 13.387 s]
[INFO] Web Processing Service ............................. SKIPPED
[INFO] Application Schema Support (Unsupported Modules) ... SUCCESS [  0.113 s]
[INFO] SOLR module ........................................ SKIPPED
[INFO] Geobuf DataStore ................................... SUCCESS [  6.312 s]
[INFO] Cartographic CSS parser ............................ SKIPPED
[INFO] GeoJSON Datastore .................................. SUCCESS [  5.152 s]
[INFO] CSVDataStore ....................................... SUCCESS [  6.031 s]
[INFO] EPSG Authority Factory for Oracle .................. SUCCESS [  1.473 s]
[INFO] Next Generation JDBC DataStores .................... SUCCESS [  0.093 s]
[INFO] SAS Matlab grid coverage readers ................... SKIPPED
[INFO] Simple Feature Service store ....................... SUCCESS [  6.231 s]
[INFO] Aggregating DataStore .............................. SUCCESS [  5.833 s]
[INFO] MongoDB DataStore .................................. SUCCESS [  7.357 s]
[INFO] GeoTools Documentation ............................. SKIPPED
[INFO] ------------------------------------------------------------------------
[INFO] BUILD FAILURE
[INFO] ------------------------------------------------------------------------
[INFO] Total time: 12:35 min (Wall Clock)
[INFO] Finished at: 2017-07-15T23:33:02+00:00
[INFO] Final Memory: 85M/597M
[INFO] ------------------------------------------------------------------------
[INFO]
[INFO] --- maven-resources-plugin:2.6:testResources (default-testResources) @ gt-ogr-jni ---
[ERROR] Failed to execute goal org.apache.maven.plugins:maven-surefire-plugin:2.15:test (default-test) on project gt-coverage: There are test failures.
[ERROR]
[ERROR] Please refer to <http://ares.boundlessgeo.com/jenkins/job/geotools-17.x/ws/modules/library/coverage/target/surefire-reports> for the individual test results.
[ERROR] -> [Help 1]
[ERROR]
[ERROR] To see the full stack trace of the errors, re-run Maven with the -e switch.
[ERROR] Re-run Maven using the -X switch to enable full debug logging.
[ERROR]
[ERROR] For more information about the errors and possible solutions, please read the following articles:
[ERROR] [Help 1] http://cwiki.apache.org/confluence/display/MAVEN/MojoFailureException
[ERROR]
[ERROR] After correcting the problems, you can resume the build with the command
[ERROR]   mvn <goals> -rf :gt-coverage
Build step 'Invoke top-level Maven targets' marked build as failure

------------------------------------------------------------------------------
Check out the vibrant tech community on one of the world's most
engaging tech sites, Slashdot.org! http://sdm.link/slashdot
_______________________________________________
GeoTools-Devel mailing list
[hidden email]
https://lists.sourceforge.net/lists/listinfo/geotools-devel
Reply | Threaded
Open this post in threaded view
|  
Report Content as Inappropriate

Jenkins build is back to normal : geotools-17.x #59

monitor
See <http://ares.boundlessgeo.com/jenkins/job/geotools-17.x/59/>


------------------------------------------------------------------------------
Check out the vibrant tech community on one of the world's most
engaging tech sites, Slashdot.org! http://sdm.link/slashdot
_______________________________________________
GeoTools-Devel mailing list
[hidden email]
https://lists.sourceforge.net/lists/listinfo/geotools-devel
Reply | Threaded
Open this post in threaded view
|  
Report Content as Inappropriate

Re: Build failed in Jenkins: geotools-17.x #58

Ben Caradoc-Davies-2
In reply to this post by monitor
[GEOT-5784] Intermittent failure of ImageWorkerTest.rescaleToBytesNoData
https://osgeo-org.atlassian.net/browse/GEOT-5784

I kicked the build and it recovered.

Kind regards,
Ben.

On 16/07/17 11:33, [hidden email] wrote:
> See <http://ares.boundlessgeo.com/jenkins/job/geotools-17.x/58/changes>
[...]
> [ERROR] Failed to execute goal org.apache.maven.plugins:maven-surefire-plugin:2.15:test (default-test) on project gt-coverage: There are test failures.
> [ERROR]
> [ERROR] Please refer to <http://ares.boundlessgeo.com/jenkins/job/geotools-17.x/ws/modules/library/coverage/target/surefire-reports> for the individual test results.

--
Ben Caradoc-Davies <[hidden email]>
Director
Transient Software Limited <http://transient.nz/>
New Zealand

------------------------------------------------------------------------------
Check out the vibrant tech community on one of the world's most
engaging tech sites, Slashdot.org! http://sdm.link/slashdot
_______________________________________________
GeoTools-Devel mailing list
[hidden email]
https://lists.sourceforge.net/lists/listinfo/geotools-devel
Loading...