Build failed in Jenkins: geoserver-master #6730

classic Classic list List threaded Threaded
5 messages Options
Reply | Threaded
Open this post in threaded view
|

Build failed in Jenkins: geoserver-master #6730

Jenkins-2
See <http://build.geoserver.org/job/geoserver-master/6730/display/redirect>

------------------------------------------
[...truncated 1.11 MB...]
[INFO] Copying 1 resource
[INFO]
[INFO] --- maven-compiler-plugin:3.8.0:testCompile (default-testCompile) @ gs-importer-web ---
[INFO] Changes detected - recompiling the module!
[INFO] Compiling 2 source files to <http://build.geoserver.org/job/geoserver-master/ws/src/extension/importer/web/target/test-classes>
[INFO]
[INFO] --- maven-surefire-plugin:2.12.3:test (default-test) @ gs-importer-web ---
[INFO] Surefire report directory: <http://build.geoserver.org/job/geoserver-master/ws/src/extension/importer/web/target/surefire-reports>

-------------------------------------------------------
 T E S T S
-------------------------------------------------------
Running org.geoserver.importer.web.AbstractDBPanelTest
Tests run: 1, Failures: 0, Errors: 0, Skipped: 0, Time elapsed: 1.161 sec
Running org.geoserver.importer.web.ImportTaskTableTest
Tests run: 2, Failures: 0, Errors: 0, Skipped: 0, Time elapsed: 6.723 sec

Results :

Tests run: 3, Failures: 0, Errors: 0, Skipped: 0

[INFO]
[INFO] --- maven-jar-plugin:2.4:jar (default-jar) @ gs-importer-web ---
[INFO] Building jar: <http://build.geoserver.org/job/geoserver-master/ws/src/extension/importer/web/target/gs-importer-web-2.16-SNAPSHOT.jar>
[INFO]
[INFO] --- maven-jar-plugin:2.4:test-jar (default) @ gs-importer-web ---
[INFO] Building jar: <http://build.geoserver.org/job/geoserver-master/ws/src/extension/importer/web/target/gs-importer-web-2.16-SNAPSHOT-tests.jar>
[INFO]
[INFO] --- maven-source-plugin:2.2.1:jar-no-fork (attach-sources) @ gs-importer-web ---
[INFO] Building jar: <http://build.geoserver.org/job/geoserver-master/ws/src/extension/importer/web/target/gs-importer-web-2.16-SNAPSHOT-sources.jar>
[INFO]
[INFO] --- maven-source-plugin:2.2.1:test-jar-no-fork (attach-sources) @ gs-importer-web ---
[INFO] Building jar: <http://build.geoserver.org/job/geoserver-master/ws/src/extension/importer/web/target/gs-importer-web-2.16-SNAPSHOT-test-sources.jar>
[INFO]
[INFO] --- maven-install-plugin:2.4:install (default-install) @ gs-importer-web ---
[INFO] Installing <http://build.geoserver.org/job/geoserver-master/ws/src/extension/importer/web/target/gs-importer-web-2.16-SNAPSHOT.jar> to /home/ubuntu/.m2/repository/org/geoserver/importer/gs-importer-web/2.16-SNAPSHOT/gs-importer-web-2.16-SNAPSHOT.jar
[INFO] Installing <http://build.geoserver.org/job/geoserver-master/ws/src/extension/importer/web/pom.xml> to /home/ubuntu/.m2/repository/org/geoserver/importer/gs-importer-web/2.16-SNAPSHOT/gs-importer-web-2.16-SNAPSHOT.pom
[INFO] Installing <http://build.geoserver.org/job/geoserver-master/ws/src/extension/importer/web/target/gs-importer-web-2.16-SNAPSHOT-tests.jar> to /home/ubuntu/.m2/repository/org/geoserver/importer/gs-importer-web/2.16-SNAPSHOT/gs-importer-web-2.16-SNAPSHOT-tests.jar
[INFO] Installing <http://build.geoserver.org/job/geoserver-master/ws/src/extension/importer/web/target/gs-importer-web-2.16-SNAPSHOT-sources.jar> to /home/ubuntu/.m2/repository/org/geoserver/importer/gs-importer-web/2.16-SNAPSHOT/gs-importer-web-2.16-SNAPSHOT-sources.jar
[INFO] Installing <http://build.geoserver.org/job/geoserver-master/ws/src/extension/importer/web/target/gs-importer-web-2.16-SNAPSHOT-test-sources.jar> to /home/ubuntu/.m2/repository/org/geoserver/importer/gs-importer-web/2.16-SNAPSHOT/gs-importer-web-2.16-SNAPSHOT-test-sources.jar
[INFO]
[INFO] ------------------------------------------------------------------------
[INFO] Skipping GeoServer Web Application
[INFO] This project has been banned from the build due to previous failures.
[INFO] ------------------------------------------------------------------------
[INFO]
[INFO] ---------------< org.geoserver.security:gs-web-sec-cas >----------------
[INFO] Building GeoServer CAS Security Web Module 2.16-SNAPSHOT         [94/99]
[INFO] --------------------------------[ jar ]---------------------------------
[INFO]
[INFO] --- maven-clean-plugin:2.5:clean (default-clean) @ gs-web-sec-cas ---
[INFO]
[INFO] --- git-commit-id-plugin:2.1.15:revision (default) @ gs-web-sec-cas ---
[INFO]
[INFO] --- directory-maven-plugin:0.3.1:highest-basedir (directories) @ gs-web-sec-cas ---
[INFO] Highest basedir set to: <http://build.geoserver.org/job/geoserver-master/ws/src>
[INFO]
[INFO] --- fmt-maven-plugin:2.4.0:format (default) @ gs-web-sec-cas ---
[info] Skipping format check
[INFO]
[INFO] --- maven-resources-plugin:2.6:resources (default-resources) @ gs-web-sec-cas ---
[INFO] Using 'UTF-8' encoding to copy filtered resources.
[INFO] Copying 2 resources
[INFO] skip non existing resourceDirectory <http://build.geoserver.org/job/geoserver-master/ws/src/extension/security/web/web-cas/src/main/resources>
[INFO]
[INFO] --- maven-compiler-plugin:3.8.0:compile (default-compile) @ gs-web-sec-cas ---
[INFO] Changes detected - recompiling the module!
[INFO] Compiling 2 source files to <http://build.geoserver.org/job/geoserver-master/ws/src/extension/security/web/web-cas/target/classes>
[INFO]
[INFO] --- maven-resources-plugin:2.6:testResources (default-testResources) @ gs-web-sec-cas ---
[INFO] Using 'UTF-8' encoding to copy filtered resources.
[INFO] skip non existing resourceDirectory <http://build.geoserver.org/job/geoserver-master/ws/src/extension/security/web/web-cas/src/test/java>
[INFO] skip non existing resourceDirectory <http://build.geoserver.org/job/geoserver-master/ws/src/extension/security/web/web-cas/src/test/resources>
[INFO]
[INFO] --- maven-compiler-plugin:3.8.0:testCompile (default-testCompile) @ gs-web-sec-cas ---
[INFO] No sources to compile
[INFO]
[INFO] --- maven-surefire-plugin:2.12.3:test (default-test) @ gs-web-sec-cas ---
[INFO] No tests to run.
[INFO]
[INFO] --- maven-jar-plugin:2.4:jar (default-jar) @ gs-web-sec-cas ---
[INFO] Building jar: <http://build.geoserver.org/job/geoserver-master/ws/src/extension/security/web/web-cas/target/gs-web-sec-cas-2.16-SNAPSHOT.jar>
[INFO]
[INFO] --- maven-jar-plugin:2.4:test-jar (default) @ gs-web-sec-cas ---
[WARNING] JAR will be empty - no content was marked for inclusion!
[INFO] Building jar: <http://build.geoserver.org/job/geoserver-master/ws/src/extension/security/web/web-cas/target/gs-web-sec-cas-2.16-SNAPSHOT-tests.jar>
[INFO]
[INFO] --- maven-source-plugin:2.2.1:jar-no-fork (attach-sources) @ gs-web-sec-cas ---
[INFO] Building jar: <http://build.geoserver.org/job/geoserver-master/ws/src/extension/security/web/web-cas/target/gs-web-sec-cas-2.16-SNAPSHOT-sources.jar>
[INFO]
[INFO] --- maven-source-plugin:2.2.1:test-jar-no-fork (attach-sources) @ gs-web-sec-cas ---
[INFO] No sources in project. Archive not created.
[INFO]
[INFO] --- maven-install-plugin:2.4:install (default-install) @ gs-web-sec-cas ---
[INFO] Installing <http://build.geoserver.org/job/geoserver-master/ws/src/extension/security/web/web-cas/target/gs-web-sec-cas-2.16-SNAPSHOT.jar> to /home/ubuntu/.m2/repository/org/geoserver/security/gs-web-sec-cas/2.16-SNAPSHOT/gs-web-sec-cas-2.16-SNAPSHOT.jar
[INFO] Installing <http://build.geoserver.org/job/geoserver-master/ws/src/extension/security/web/web-cas/pom.xml> to /home/ubuntu/.m2/repository/org/geoserver/security/gs-web-sec-cas/2.16-SNAPSHOT/gs-web-sec-cas-2.16-SNAPSHOT.pom
[INFO] Installing <http://build.geoserver.org/job/geoserver-master/ws/src/extension/security/web/web-cas/target/gs-web-sec-cas-2.16-SNAPSHOT-tests.jar> to /home/ubuntu/.m2/repository/org/geoserver/security/gs-web-sec-cas/2.16-SNAPSHOT/gs-web-sec-cas-2.16-SNAPSHOT-tests.jar
[INFO] Installing <http://build.geoserver.org/job/geoserver-master/ws/src/extension/security/web/web-cas/target/gs-web-sec-cas-2.16-SNAPSHOT-sources.jar> to /home/ubuntu/.m2/repository/org/geoserver/security/gs-web-sec-cas/2.16-SNAPSHOT/gs-web-sec-cas-2.16-SNAPSHOT-sources.jar
Tests run: 12, Failures: 0, Errors: 0, Skipped: 0, Time elapsed: 300.988 sec
Running org.geoserver.importer.bdb.SerialVersionSafeSerialBindingTest
Tests run: 1, Failures: 0, Errors: 0, Skipped: 0, Time elapsed: 0.316 sec
Running org.geoserver.importer.bdb.XStreamInfoSerialBindingTest
Tests run: 2, Failures: 0, Errors: 0, Skipped: 0, Time elapsed: 2.303 sec

Results :

Tests run: 15, Failures: 0, Errors: 0, Skipped: 0

[INFO]
[INFO] --- maven-jar-plugin:2.4:jar (default-jar) @ gs-importer-bdb ---
[INFO] Building jar: <http://build.geoserver.org/job/geoserver-master/ws/src/extension/importer/bdb/target/gs-importer-bdb-2.16-SNAPSHOT.jar>
[INFO]
[INFO] --- maven-jar-plugin:2.4:test-jar (default) @ gs-importer-bdb ---
[INFO] Building jar: <http://build.geoserver.org/job/geoserver-master/ws/src/extension/importer/bdb/target/gs-importer-bdb-2.16-SNAPSHOT-tests.jar>
[INFO]
[INFO] --- maven-source-plugin:2.2.1:jar-no-fork (attach-sources) @ gs-importer-bdb ---
[INFO] Building jar: <http://build.geoserver.org/job/geoserver-master/ws/src/extension/importer/bdb/target/gs-importer-bdb-2.16-SNAPSHOT-sources.jar>
[INFO]
[INFO] --- maven-source-plugin:2.2.1:test-jar-no-fork (attach-sources) @ gs-importer-bdb ---
[INFO] Building jar: <http://build.geoserver.org/job/geoserver-master/ws/src/extension/importer/bdb/target/gs-importer-bdb-2.16-SNAPSHOT-test-sources.jar>
[INFO]
[INFO] --- maven-install-plugin:2.4:install (default-install) @ gs-importer-bdb ---
[INFO] Installing <http://build.geoserver.org/job/geoserver-master/ws/src/extension/importer/bdb/target/gs-importer-bdb-2.16-SNAPSHOT.jar> to /home/ubuntu/.m2/repository/org/geoserver/importer/gs-importer-bdb/2.16-SNAPSHOT/gs-importer-bdb-2.16-SNAPSHOT.jar
[INFO] Installing <http://build.geoserver.org/job/geoserver-master/ws/src/extension/importer/bdb/pom.xml> to /home/ubuntu/.m2/repository/org/geoserver/importer/gs-importer-bdb/2.16-SNAPSHOT/gs-importer-bdb-2.16-SNAPSHOT.pom
[INFO] Installing <http://build.geoserver.org/job/geoserver-master/ws/src/extension/importer/bdb/target/gs-importer-bdb-2.16-SNAPSHOT-tests.jar> to /home/ubuntu/.m2/repository/org/geoserver/importer/gs-importer-bdb/2.16-SNAPSHOT/gs-importer-bdb-2.16-SNAPSHOT-tests.jar
[INFO] Installing <http://build.geoserver.org/job/geoserver-master/ws/src/extension/importer/bdb/target/gs-importer-bdb-2.16-SNAPSHOT-sources.jar> to /home/ubuntu/.m2/repository/org/geoserver/importer/gs-importer-bdb/2.16-SNAPSHOT/gs-importer-bdb-2.16-SNAPSHOT-sources.jar
[INFO] Installing <http://build.geoserver.org/job/geoserver-master/ws/src/extension/importer/bdb/target/gs-importer-bdb-2.16-SNAPSHOT-test-sources.jar> to /home/ubuntu/.m2/repository/org/geoserver/importer/gs-importer-bdb/2.16-SNAPSHOT/gs-importer-bdb-2.16-SNAPSHOT-test-sources.jar
[INFO] ------------------------------------------------------------------------
[INFO] Reactor Summary for GeoServer 2.16-SNAPSHOT:
[INFO]
[INFO] GeoServer .......................................... SUCCESS [  4.606 s]
[INFO] Core Platform Module ............................... SUCCESS [  8.840 s]
[INFO] Open Web Service Module ............................ SUCCESS [  4.858 s]
[INFO] Main Module ........................................ SUCCESS [ 48.264 s]
[INFO] GeoServer Security Modules ......................... SUCCESS [  0.048 s]
[INFO] GeoServer Security Tests Module .................... SUCCESS [01:28 min]
[INFO] GeoServer JDBC Security Module ..................... SUCCESS [ 37.897 s]
[INFO] GeoServer LDAP Security Module ..................... SUCCESS [ 15.142 s]
[INFO] Web Coverage Service Module ........................ SUCCESS [  0.442 s]
[INFO] Web Coverage Service 1.0 Module .................... SUCCESS [ 10.487 s]
[INFO] Web Coverage Service 1.1 Module .................... SUCCESS [ 11.970 s]
[INFO] Web Coverage Service 2.0 Module .................... SUCCESS [ 52.676 s]
[INFO] Web Feature Service Module ......................... SUCCESS [ 59.826 s]
[INFO] Web Map Service Module ............................. SUCCESS [01:34 min]
[INFO] KML support for GeoServer .......................... SUCCESS [ 15.067 s]
[INFO] gs-rest ............................................ SUCCESS [  6.366 s]
[INFO] GeoWebCache (GWC) Module ........................... FAILURE [ 44.069 s]
[INFO] gs-restconfig ...................................... SUCCESS [ 51.044 s]
[INFO] gs-restconfig-wcs .................................. SUCCESS [  9.223 s]
[INFO] gs-restconfig-wfs .................................. SUCCESS [ 10.528 s]
[INFO] gs-restconfig-wms .................................. SUCCESS [  8.219 s]
[INFO] GeoServer Web Modules .............................. SUCCESS [  0.141 s]
[INFO] Core UI Module ..................................... SUCCESS [ 43.970 s]
[INFO] WMS UI Module ...................................... SUCCESS [ 47.318 s]
[INFO] GWC UI Module ...................................... SKIPPED
[INFO] WFS UI Module ...................................... SUCCESS [  5.798 s]
[INFO] Demos Module ....................................... SUCCESS [09:27 min]
[INFO] WCS UI Module ...................................... SUCCESS [  7.562 s]
[INFO] Security UI Modules ................................ SUCCESS [  0.037 s]
[INFO] Security UI Core Module ............................ SUCCESS [ 56.551 s]
[INFO] Security UI JDBC Module ............................ SUCCESS [01:02 min]
[INFO] Security UI LDAP Module ............................ SUCCESS [ 15.854 s]
[INFO] REST UI Module ..................................... SUCCESS [  5.749 s]
[INFO] GeoServer Extensions ............................... SUCCESS [  0.028 s]
[INFO] Printing Module .................................... SUCCESS [  6.256 s]
[INFO] GeoServer Web Application .......................... SKIPPED
[INFO] Community Space .................................... SUCCESS [  0.024 s]
[INFO] Application Schema Support ......................... SUCCESS [  0.021 s]
[INFO] Application Schema Integration Test ................ SUCCESS [06:10 min]
[INFO] Sample DataAccess Integration Test ................. SUCCESS [  6.513 s]
[INFO] ArcSDE DataStore Extension ......................... SUCCESS [  5.800 s]
[INFO] H2 DataStore Extension ............................. SUCCESS [  6.228 s]
[INFO] SQL Server DataStore Extension ..................... SUCCESS [  0.741 s]
[INFO] Oracle DataStore Extension ......................... SUCCESS [  0.542 s]
[INFO] MySQL DataStore Extension .......................... SUCCESS [  0.223 s]
[INFO] DB2 DataStore Extension ............................ SUCCESS [  0.202 s]
[INFO] ImageMap Output Format ............................. SUCCESS [  3.008 s]
[INFO] ImageI/O-Ext GDAL Coverage Extension ............... SUCCESS [  1.217 s]
[INFO] JP2K Coverage Extension ............................ SUCCESS [  0.201 s]
[INFO] OGR parent ......................................... SUCCESS [  0.019 s]
[INFO] OGR CORE ........................................... SUCCESS [  0.230 s]
[INFO] OGR WFS ............................................ SUCCESS [  4.041 s]
[INFO] Web Processing Service parent ...................... SUCCESS [  0.022 s]
[INFO] Web Processing Service Module ...................... SUCCESS [04:59 min]
[INFO] OGR WPS ............................................ SUCCESS [  6.158 s]
[INFO] Excel Output Format ................................ SUCCESS [  7.152 s]
[INFO] Chart external graphics support .................... SUCCESS [  0.388 s]
[INFO] Feature Generalization Extension ................... SUCCESS [  0.377 s]
[INFO] Image Mosaic JDBC Extension ........................ SUCCESS [  0.408 s]
[INFO] OWS request flow controller ........................ SUCCESS [ 10.232 s]
[INFO] Web process status sharing with Hazelcast .......... SUCCESS [  8.119 s]
[INFO] Web Processing Service GUI ......................... SUCCESS [ 17.669 s]
[INFO] GeoServer Layer Querying filter functions .......... SUCCESS [  8.243 s]
[INFO] Teradata DataStore Extension ....................... SUCCESS [  0.545 s]
[INFO] GeoServer Monitor Extensions ....................... SUCCESS [  0.024 s]
[INFO] Core Monitor Extension ............................. SKIPPED
[INFO] GeoServer Security Extension Modules ............... SUCCESS [  0.030 s]
[INFO] GeoServer CAS Security Module ...................... SUCCESS [  1.709 s]
[INFO] GeoServer Security Extension Web Modules ........... SUCCESS [  0.026 s]
[INFO] GeoServer CAS Security Web Module .................. SUCCESS [  0.425 s]
[INFO] XLST based WFS output format ....................... SUCCESS [ 10.984 s]
[INFO] GeoServer INSPIRE Extensions ....................... SKIPPED
[INFO] GeoServer CSS Styling .............................. SUCCESS [ 11.978 s]
[INFO] Catalog Services for the Web parent ................ SUCCESS [  0.031 s]
[INFO] Catalog Services for the Web interfaces ............ SUCCESS [  4.036 s]
[INFO] Catalog Services for the Web - Simple CatalogStore implementation SUCCESS [  4.191 s]
[INFO] Catalog Services for the Web core module ........... SUCCESS [04:18 min]
[INFO] CSW UI Module ...................................... SUCCESS [  5.800 s]
[INFO] DXF WFS output format and WPS PPIO ................. SUCCESS [  0.022 s]
[INFO] DXF WFS output format .............................. SUCCESS [  6.325 s]
[INFO] DXF WPS PPIO ....................................... SUCCESS [  5.400 s]
[INFO] GeoServer WCS 2.0 Earth Observation Extensions ..... SUCCESS [  0.023 s]
[INFO] Web Coverage Service 2.0 Earth Observation extensions SUCCESS [ 11.676 s]
[INFO] Web Coverage Service 2.0 Earth Observation GUI extension SUCCESS [05:15 min]
[INFO] GeoServer libjpeg-turbo Module ..................... SUCCESS [  4.741 s]
[INFO] GeoServer Data Importer ............................ SUCCESS [  0.046 s]
[INFO] Importer Core Module ............................... SUCCESS [ 26.184 s]
[INFO] Importer REST Api Module-ng ........................ SUCCESS [ 28.861 s]
[INFO] Importer Berkley DB Persistence Module ............. SUCCESS [05:04 min]
[INFO] Importer Web UI Module ............................. SUCCESS [  9.779 s]
[INFO] GRIB Coverage Format ............................... SUCCESS [  9.434 s]
[INFO] NetCDF Coverage format ............................. SUCCESS [04:01 min]
[INFO] WCS NetCDF output Module ........................... SUCCESS [01:27 min]
[INFO] Vector Tiles ....................................... SUCCESS [ 11.897 s]
[INFO] Ysld GeoServer Plugin .............................. SKIPPED
[INFO] MongoDB Data Store ................................. SUCCESS [  1.230 s]
[INFO] REST SLD service ................................... SUCCESS [04:40 min]
[INFO] GeoFence security integration ...................... SUCCESS [09:19 min]
[INFO] GeoFence Server .................................... SUCCESS [04:37 min]
[INFO] ------------------------------------------------------------------------
[INFO] BUILD FAILURE
[INFO] ------------------------------------------------------------------------
[INFO] Total time:  39:39 min (Wall Clock)
[INFO] Finished at: 2019-06-02T08:53:45Z
[INFO] ------------------------------------------------------------------------
[ERROR] Failed to execute goal org.apache.maven.plugins:maven-surefire-plugin:2.12.3:test (default-test) on project gs-gwc: There are test failures.
[ERROR]
[ERROR] Please refer to <http://build.geoserver.org/job/geoserver-master/ws/src/gwc/target/surefire-reports> for the individual test results.
[ERROR] -> [Help 1]
[ERROR]
[ERROR] To see the full stack trace of the errors, re-run Maven with the -e switch.
[ERROR] Re-run Maven using the -X switch to enable full debug logging.
[ERROR]
[ERROR] For more information about the errors and possible solutions, please read the following articles:
[ERROR] [Help 1] http://cwiki.apache.org/confluence/display/MAVEN/MojoFailureException
[ERROR]
[ERROR] After correcting the problems, you can resume the build with the command
[ERROR]   mvn <goals> -rf :gs-gwc
Build step 'Invoke top-level Maven targets' marked build as failure


_______________________________________________
Geoserver-devel mailing list
[hidden email]
https://lists.sourceforge.net/lists/listinfo/geoserver-devel
Reply | Threaded
Open this post in threaded view
|

Build failed in Jenkins: geoserver-master #6731

Jenkins-2
See <http://build.geoserver.org/job/geoserver-master/6731/display/redirect>

------------------------------------------
[...truncated 1.10 MB...]
[INFO] <http://build.geoserver.org/job/geoserver-master/ws/src/extension/importer/web/src/main/java/org/geoserver/importer/web/AdvancedDbParamPanel.java>: Recompile with -Xlint:unchecked for details.
[INFO]
[INFO] --- maven-resources-plugin:2.6:testResources (default-testResources) @ gs-importer-web ---
[INFO] Using 'UTF-8' encoding to copy filtered resources.
[INFO] Copying 1 resource
[INFO]
[INFO] --- maven-compiler-plugin:3.8.0:testCompile (default-testCompile) @ gs-importer-web ---
[INFO] Changes detected - recompiling the module!
[INFO] Compiling 2 source files to <http://build.geoserver.org/job/geoserver-master/ws/src/extension/importer/web/target/test-classes>
[INFO]
[INFO] --- maven-surefire-plugin:2.12.3:test (default-test) @ gs-importer-web ---
[INFO] Surefire report directory: <http://build.geoserver.org/job/geoserver-master/ws/src/extension/importer/web/target/surefire-reports>

-------------------------------------------------------
 T E S T S
-------------------------------------------------------
Running org.geoserver.importer.web.AbstractDBPanelTest
Tests run: 1, Failures: 0, Errors: 0, Skipped: 0, Time elapsed: 1.307 sec
Running org.geoserver.importer.web.ImportTaskTableTest
Tests run: 2, Failures: 0, Errors: 0, Skipped: 0, Time elapsed: 8.376 sec

Results :

Tests run: 3, Failures: 0, Errors: 0, Skipped: 0

[INFO]
[INFO] --- maven-jar-plugin:2.4:jar (default-jar) @ gs-importer-web ---
[INFO] Building jar: <http://build.geoserver.org/job/geoserver-master/ws/src/extension/importer/web/target/gs-importer-web-2.16-SNAPSHOT.jar>
[INFO]
[INFO] --- maven-jar-plugin:2.4:test-jar (default) @ gs-importer-web ---
[INFO] Building jar: <http://build.geoserver.org/job/geoserver-master/ws/src/extension/importer/web/target/gs-importer-web-2.16-SNAPSHOT-tests.jar>
[INFO]
[INFO] --- maven-source-plugin:2.2.1:jar-no-fork (attach-sources) @ gs-importer-web ---
[INFO] Building jar: <http://build.geoserver.org/job/geoserver-master/ws/src/extension/importer/web/target/gs-importer-web-2.16-SNAPSHOT-sources.jar>
[INFO]
[INFO] --- maven-source-plugin:2.2.1:test-jar-no-fork (attach-sources) @ gs-importer-web ---
[INFO] Building jar: <http://build.geoserver.org/job/geoserver-master/ws/src/extension/importer/web/target/gs-importer-web-2.16-SNAPSHOT-test-sources.jar>
[INFO]
[INFO] --- maven-install-plugin:2.4:install (default-install) @ gs-importer-web ---
[INFO] Installing <http://build.geoserver.org/job/geoserver-master/ws/src/extension/importer/web/target/gs-importer-web-2.16-SNAPSHOT.jar> to /home/ubuntu/.m2/repository/org/geoserver/importer/gs-importer-web/2.16-SNAPSHOT/gs-importer-web-2.16-SNAPSHOT.jar
[INFO] Installing <http://build.geoserver.org/job/geoserver-master/ws/src/extension/importer/web/pom.xml> to /home/ubuntu/.m2/repository/org/geoserver/importer/gs-importer-web/2.16-SNAPSHOT/gs-importer-web-2.16-SNAPSHOT.pom
[INFO] Installing <http://build.geoserver.org/job/geoserver-master/ws/src/extension/importer/web/target/gs-importer-web-2.16-SNAPSHOT-tests.jar> to /home/ubuntu/.m2/repository/org/geoserver/importer/gs-importer-web/2.16-SNAPSHOT/gs-importer-web-2.16-SNAPSHOT-tests.jar
[INFO] Installing <http://build.geoserver.org/job/geoserver-master/ws/src/extension/importer/web/target/gs-importer-web-2.16-SNAPSHOT-sources.jar> to /home/ubuntu/.m2/repository/org/geoserver/importer/gs-importer-web/2.16-SNAPSHOT/gs-importer-web-2.16-SNAPSHOT-sources.jar
[INFO] Installing <http://build.geoserver.org/job/geoserver-master/ws/src/extension/importer/web/target/gs-importer-web-2.16-SNAPSHOT-test-sources.jar> to /home/ubuntu/.m2/repository/org/geoserver/importer/gs-importer-web/2.16-SNAPSHOT/gs-importer-web-2.16-SNAPSHOT-test-sources.jar
[INFO]
[INFO] ---------------< org.geoserver.security:gs-web-sec-cas >----------------
[INFO] Building GeoServer CAS Security Web Module 2.16-SNAPSHOT         [94/99]
[INFO] --------------------------------[ jar ]---------------------------------
[INFO]
[INFO] --- maven-clean-plugin:2.5:clean (default-clean) @ gs-web-sec-cas ---
[INFO] Deleting <http://build.geoserver.org/job/geoserver-master/ws/src/extension/security/web/web-cas/target>
[INFO]
[INFO] --- git-commit-id-plugin:2.1.15:revision (default) @ gs-web-sec-cas ---
[INFO]
[INFO] --- directory-maven-plugin:0.3.1:highest-basedir (directories) @ gs-web-sec-cas ---
[INFO] Highest basedir set to: <http://build.geoserver.org/job/geoserver-master/ws/src>
[INFO]
[INFO] --- fmt-maven-plugin:2.4.0:format (default) @ gs-web-sec-cas ---
[info] Skipping format check
[INFO]
[INFO] --- maven-resources-plugin:2.6:resources (default-resources) @ gs-web-sec-cas ---
[INFO] Using 'UTF-8' encoding to copy filtered resources.
[INFO] Copying 2 resources
[INFO] skip non existing resourceDirectory <http://build.geoserver.org/job/geoserver-master/ws/src/extension/security/web/web-cas/src/main/resources>
[INFO]
[INFO] --- maven-compiler-plugin:3.8.0:compile (default-compile) @ gs-web-sec-cas ---
[INFO] Changes detected - recompiling the module!
[INFO] Compiling 2 source files to <http://build.geoserver.org/job/geoserver-master/ws/src/extension/security/web/web-cas/target/classes>
[INFO]
[INFO] --- maven-resources-plugin:2.6:testResources (default-testResources) @ gs-web-sec-cas ---
[INFO] Using 'UTF-8' encoding to copy filtered resources.
[INFO] skip non existing resourceDirectory <http://build.geoserver.org/job/geoserver-master/ws/src/extension/security/web/web-cas/src/test/java>
[INFO] skip non existing resourceDirectory <http://build.geoserver.org/job/geoserver-master/ws/src/extension/security/web/web-cas/src/test/resources>
[INFO]
[INFO] --- maven-compiler-plugin:3.8.0:testCompile (default-testCompile) @ gs-web-sec-cas ---
[INFO] No sources to compile
[INFO]
[INFO] --- maven-surefire-plugin:2.12.3:test (default-test) @ gs-web-sec-cas ---
[INFO] No tests to run.
[INFO]
[INFO] --- maven-jar-plugin:2.4:jar (default-jar) @ gs-web-sec-cas ---
[INFO] Building jar: <http://build.geoserver.org/job/geoserver-master/ws/src/extension/security/web/web-cas/target/gs-web-sec-cas-2.16-SNAPSHOT.jar>
[INFO]
[INFO] --- maven-jar-plugin:2.4:test-jar (default) @ gs-web-sec-cas ---
[WARNING] JAR will be empty - no content was marked for inclusion!
[INFO] Building jar: <http://build.geoserver.org/job/geoserver-master/ws/src/extension/security/web/web-cas/target/gs-web-sec-cas-2.16-SNAPSHOT-tests.jar>
[INFO]
[INFO] --- maven-source-plugin:2.2.1:jar-no-fork (attach-sources) @ gs-web-sec-cas ---
[INFO] Building jar: <http://build.geoserver.org/job/geoserver-master/ws/src/extension/security/web/web-cas/target/gs-web-sec-cas-2.16-SNAPSHOT-sources.jar>
[INFO]
[INFO] --- maven-source-plugin:2.2.1:test-jar-no-fork (attach-sources) @ gs-web-sec-cas ---
[INFO] No sources in project. Archive not created.
[INFO]
[INFO] --- maven-install-plugin:2.4:install (default-install) @ gs-web-sec-cas ---
[INFO] Installing <http://build.geoserver.org/job/geoserver-master/ws/src/extension/security/web/web-cas/target/gs-web-sec-cas-2.16-SNAPSHOT.jar> to /home/ubuntu/.m2/repository/org/geoserver/security/gs-web-sec-cas/2.16-SNAPSHOT/gs-web-sec-cas-2.16-SNAPSHOT.jar
[INFO] Installing <http://build.geoserver.org/job/geoserver-master/ws/src/extension/security/web/web-cas/pom.xml> to /home/ubuntu/.m2/repository/org/geoserver/security/gs-web-sec-cas/2.16-SNAPSHOT/gs-web-sec-cas-2.16-SNAPSHOT.pom
[INFO] Installing <http://build.geoserver.org/job/geoserver-master/ws/src/extension/security/web/web-cas/target/gs-web-sec-cas-2.16-SNAPSHOT-tests.jar> to /home/ubuntu/.m2/repository/org/geoserver/security/gs-web-sec-cas/2.16-SNAPSHOT/gs-web-sec-cas-2.16-SNAPSHOT-tests.jar
[INFO] Installing <http://build.geoserver.org/job/geoserver-master/ws/src/extension/security/web/web-cas/target/gs-web-sec-cas-2.16-SNAPSHOT-sources.jar> to /home/ubuntu/.m2/repository/org/geoserver/security/gs-web-sec-cas/2.16-SNAPSHOT/gs-web-sec-cas-2.16-SNAPSHOT-sources.jar
Tests run: 12, Failures: 0, Errors: 0, Skipped: 0, Time elapsed: 204.072 sec
Running org.geoserver.importer.bdb.SerialVersionSafeSerialBindingTest
Tests run: 1, Failures: 0, Errors: 0, Skipped: 0, Time elapsed: 0.469 sec
Running org.geoserver.importer.bdb.XStreamInfoSerialBindingTest
Tests run: 2, Failures: 0, Errors: 0, Skipped: 0, Time elapsed: 3.284 sec

Results :

Tests run: 15, Failures: 0, Errors: 0, Skipped: 0

[INFO]
[INFO] --- maven-jar-plugin:2.4:jar (default-jar) @ gs-importer-bdb ---
[INFO] Building jar: <http://build.geoserver.org/job/geoserver-master/ws/src/extension/importer/bdb/target/gs-importer-bdb-2.16-SNAPSHOT.jar>
[INFO]
[INFO] --- maven-jar-plugin:2.4:test-jar (default) @ gs-importer-bdb ---
[INFO] Building jar: <http://build.geoserver.org/job/geoserver-master/ws/src/extension/importer/bdb/target/gs-importer-bdb-2.16-SNAPSHOT-tests.jar>
[INFO]
[INFO] --- maven-source-plugin:2.2.1:jar-no-fork (attach-sources) @ gs-importer-bdb ---
[INFO] Building jar: <http://build.geoserver.org/job/geoserver-master/ws/src/extension/importer/bdb/target/gs-importer-bdb-2.16-SNAPSHOT-sources.jar>
[INFO]
[INFO] --- maven-source-plugin:2.2.1:test-jar-no-fork (attach-sources) @ gs-importer-bdb ---
[INFO] Building jar: <http://build.geoserver.org/job/geoserver-master/ws/src/extension/importer/bdb/target/gs-importer-bdb-2.16-SNAPSHOT-test-sources.jar>
[INFO]
[INFO] --- maven-install-plugin:2.4:install (default-install) @ gs-importer-bdb ---
[INFO] Installing <http://build.geoserver.org/job/geoserver-master/ws/src/extension/importer/bdb/target/gs-importer-bdb-2.16-SNAPSHOT.jar> to /home/ubuntu/.m2/repository/org/geoserver/importer/gs-importer-bdb/2.16-SNAPSHOT/gs-importer-bdb-2.16-SNAPSHOT.jar
[INFO] Installing <http://build.geoserver.org/job/geoserver-master/ws/src/extension/importer/bdb/pom.xml> to /home/ubuntu/.m2/repository/org/geoserver/importer/gs-importer-bdb/2.16-SNAPSHOT/gs-importer-bdb-2.16-SNAPSHOT.pom
[INFO] Installing <http://build.geoserver.org/job/geoserver-master/ws/src/extension/importer/bdb/target/gs-importer-bdb-2.16-SNAPSHOT-tests.jar> to /home/ubuntu/.m2/repository/org/geoserver/importer/gs-importer-bdb/2.16-SNAPSHOT/gs-importer-bdb-2.16-SNAPSHOT-tests.jar
[INFO] Installing <http://build.geoserver.org/job/geoserver-master/ws/src/extension/importer/bdb/target/gs-importer-bdb-2.16-SNAPSHOT-sources.jar> to /home/ubuntu/.m2/repository/org/geoserver/importer/gs-importer-bdb/2.16-SNAPSHOT/gs-importer-bdb-2.16-SNAPSHOT-sources.jar
[INFO] Installing <http://build.geoserver.org/job/geoserver-master/ws/src/extension/importer/bdb/target/gs-importer-bdb-2.16-SNAPSHOT-test-sources.jar> to /home/ubuntu/.m2/repository/org/geoserver/importer/gs-importer-bdb/2.16-SNAPSHOT/gs-importer-bdb-2.16-SNAPSHOT-test-sources.jar
[INFO] ------------------------------------------------------------------------
[INFO] Reactor Summary for GeoServer 2.16-SNAPSHOT:
[INFO]
[INFO] GeoServer .......................................... SUCCESS [  4.459 s]
[INFO] Core Platform Module ............................... SUCCESS [ 10.262 s]
[INFO] Open Web Service Module ............................ SUCCESS [  6.479 s]
[INFO] Main Module ........................................ SUCCESS [ 56.480 s]
[INFO] GeoServer Security Modules ......................... SUCCESS [  0.082 s]
[INFO] GeoServer Security Tests Module .................... SUCCESS [01:31 min]
[INFO] GeoServer JDBC Security Module ..................... SUCCESS [ 42.031 s]
[INFO] GeoServer LDAP Security Module ..................... SUCCESS [ 23.098 s]
[INFO] Web Coverage Service Module ........................ SUCCESS [  0.523 s]
[INFO] Web Coverage Service 1.0 Module .................... SUCCESS [ 11.228 s]
[INFO] Web Coverage Service 1.1 Module .................... SUCCESS [ 14.282 s]
[INFO] Web Coverage Service 2.0 Module .................... SUCCESS [01:01 min]
[INFO] Web Feature Service Module ......................... SUCCESS [01:22 min]
[INFO] Web Map Service Module ............................. SUCCESS [01:57 min]
[INFO] KML support for GeoServer .......................... SUCCESS [ 19.360 s]
[INFO] gs-rest ............................................ SUCCESS [  7.584 s]
[INFO] GeoWebCache (GWC) Module ........................... FAILURE [ 57.051 s]
[INFO] gs-restconfig ...................................... SUCCESS [01:01 min]
[INFO] gs-restconfig-wcs .................................. SUCCESS [ 11.057 s]
[INFO] gs-restconfig-wfs .................................. SUCCESS [ 13.769 s]
[INFO] gs-restconfig-wms .................................. SUCCESS [ 11.057 s]
[INFO] GeoServer Web Modules .............................. SUCCESS [  0.063 s]
[INFO] Core UI Module ..................................... SUCCESS [01:02 min]
[INFO] WMS UI Module ...................................... SUCCESS [ 39.152 s]
[INFO] GWC UI Module ...................................... SKIPPED
[INFO] WFS UI Module ...................................... SUCCESS [  6.851 s]
[INFO] Demos Module ....................................... SUCCESS [04:15 min]
[INFO] WCS UI Module ...................................... SUCCESS [ 10.699 s]
[INFO] Security UI Modules ................................ SUCCESS [  0.037 s]
[INFO] Security UI Core Module ............................ SUCCESS [01:05 min]
[INFO] Security UI JDBC Module ............................ SUCCESS [07:09 min]
[INFO] Security UI LDAP Module ............................ SUCCESS [ 21.264 s]
[INFO] REST UI Module ..................................... SUCCESS [  6.431 s]
[INFO] GeoServer Extensions ............................... SUCCESS [  0.104 s]
[INFO] Printing Module .................................... SUCCESS [  8.523 s]
[INFO] GeoServer Web Application .......................... SKIPPED
[INFO] Community Space .................................... SUCCESS [  0.079 s]
[INFO] Application Schema Support ......................... SUCCESS [  0.039 s]
[INFO] Application Schema Integration Test ................ SUCCESS [02:05 min]
[INFO] Sample DataAccess Integration Test ................. SUCCESS [  7.614 s]
[INFO] ArcSDE DataStore Extension ......................... SUCCESS [  6.871 s]
[INFO] H2 DataStore Extension ............................. SUCCESS [  6.832 s]
[INFO] SQL Server DataStore Extension ..................... SUCCESS [  0.741 s]
[INFO] Oracle DataStore Extension ......................... SUCCESS [  0.577 s]
[INFO] MySQL DataStore Extension .......................... SUCCESS [  0.229 s]
[INFO] DB2 DataStore Extension ............................ SUCCESS [  0.247 s]
[INFO] ImageMap Output Format ............................. SUCCESS [  3.765 s]
[INFO] ImageI/O-Ext GDAL Coverage Extension ............... SUCCESS [  1.533 s]
[INFO] JP2K Coverage Extension ............................ SUCCESS [  0.253 s]
[INFO] OGR parent ......................................... SUCCESS [  0.023 s]
[INFO] OGR CORE ........................................... SUCCESS [  0.386 s]
[INFO] OGR WFS ............................................ SUCCESS [  5.067 s]
[INFO] Web Processing Service parent ...................... SUCCESS [  0.027 s]
[INFO] Web Processing Service Module ...................... SUCCESS [06:50 min]
[INFO] OGR WPS ............................................ SUCCESS [  6.914 s]
[INFO] Excel Output Format ................................ SUCCESS [  9.323 s]
[INFO] Chart external graphics support .................... SUCCESS [  0.422 s]
[INFO] Feature Generalization Extension ................... SUCCESS [  0.588 s]
[INFO] Image Mosaic JDBC Extension ........................ SUCCESS [  0.466 s]
[INFO] OWS request flow controller ........................ SUCCESS [ 11.026 s]
[INFO] Web process status sharing with Hazelcast .......... SUCCESS [ 14.677 s]
[INFO] Web Processing Service GUI ......................... SUCCESS [ 19.530 s]
[INFO] GeoServer Layer Querying filter functions .......... SUCCESS [ 10.257 s]
[INFO] Teradata DataStore Extension ....................... SUCCESS [  0.421 s]
[INFO] GeoServer Monitor Extensions ....................... SUCCESS [  0.028 s]
[INFO] Core Monitor Extension ............................. SKIPPED
[INFO] GeoServer Security Extension Modules ............... SUCCESS [  0.040 s]
[INFO] GeoServer CAS Security Module ...................... SUCCESS [  2.751 s]
[INFO] GeoServer Security Extension Web Modules ........... SUCCESS [  0.032 s]
[INFO] GeoServer CAS Security Web Module .................. SUCCESS [  0.366 s]
[INFO] XLST based WFS output format ....................... SUCCESS [ 12.798 s]
[INFO] GeoServer INSPIRE Extensions ....................... SKIPPED
[INFO] GeoServer CSS Styling .............................. SUCCESS [ 14.233 s]
[INFO] Catalog Services for the Web parent ................ SUCCESS [  0.034 s]
[INFO] Catalog Services for the Web interfaces ............ SUCCESS [  4.924 s]
[INFO] Catalog Services for the Web - Simple CatalogStore implementation SUCCESS [  5.296 s]
[INFO] Catalog Services for the Web core module ........... SUCCESS [01:04 min]
[INFO] CSW UI Module ...................................... SUCCESS [  7.698 s]
[INFO] DXF WFS output format and WPS PPIO ................. SUCCESS [  0.024 s]
[INFO] DXF WFS output format .............................. SUCCESS [  8.664 s]
[INFO] DXF WPS PPIO ....................................... SUCCESS [  6.057 s]
[INFO] GeoServer WCS 2.0 Earth Observation Extensions ..... SUCCESS [  0.025 s]
[INFO] Web Coverage Service 2.0 Earth Observation extensions SUCCESS [ 14.239 s]
[INFO] Web Coverage Service 2.0 Earth Observation GUI extension SUCCESS [  9.817 s]
[INFO] GeoServer libjpeg-turbo Module ..................... SUCCESS [  5.335 s]
[INFO] GeoServer Data Importer ............................ SUCCESS [  0.042 s]
[INFO] Importer Core Module ............................... SUCCESS [ 35.498 s]
[INFO] Importer REST Api Module-ng ........................ SUCCESS [ 37.673 s]
[INFO] Importer Berkley DB Persistence Module ............. SUCCESS [03:29 min]
[INFO] Importer Web UI Module ............................. SUCCESS [ 11.893 s]
[INFO] GRIB Coverage Format ............................... SUCCESS [ 12.010 s]
[INFO] NetCDF Coverage format ............................. SUCCESS [04:34 min]
[INFO] WCS NetCDF output Module ........................... SUCCESS [ 34.349 s]
[INFO] Vector Tiles ....................................... SUCCESS [ 12.115 s]
[INFO] Ysld GeoServer Plugin .............................. SKIPPED
[INFO] MongoDB Data Store ................................. SUCCESS [  1.289 s]
[INFO] REST SLD service ................................... SUCCESS [01:06 min]
[INFO] GeoFence security integration ...................... SUCCESS [ 27.641 s]
[INFO] GeoFence Server .................................... SUCCESS [ 30.914 s]
[INFO] ------------------------------------------------------------------------
[INFO] BUILD FAILURE
[INFO] ------------------------------------------------------------------------
[INFO] Total time:  28:22 min (Wall Clock)
[INFO] Finished at: 2019-06-03T15:49:39Z
[INFO] ------------------------------------------------------------------------
[ERROR] Failed to execute goal org.apache.maven.plugins:maven-surefire-plugin:2.12.3:test (default-test) on project gs-gwc: There are test failures.
[ERROR]
[ERROR] Please refer to <http://build.geoserver.org/job/geoserver-master/ws/src/gwc/target/surefire-reports> for the individual test results.
[ERROR] -> [Help 1]
[ERROR]
[ERROR] To see the full stack trace of the errors, re-run Maven with the -e switch.
[ERROR] Re-run Maven using the -X switch to enable full debug logging.
[ERROR]
[ERROR] For more information about the errors and possible solutions, please read the following articles:
[ERROR] [Help 1] http://cwiki.apache.org/confluence/display/MAVEN/MojoFailureException
[ERROR]
[ERROR] After correcting the problems, you can resume the build with the command
[ERROR]   mvn <goals> -rf :gs-gwc
Build step 'Invoke top-level Maven targets' marked build as failure


_______________________________________________
Geoserver-devel mailing list
[hidden email]
https://lists.sourceforge.net/lists/listinfo/geoserver-devel
Reply | Threaded
Open this post in threaded view
|

Re: Build failed in Jenkins: geoserver-master #6731

GeoServer - Dev mailing list
I'm able to reproduce this failure locally. I'm not sure if it was caused by the recent Depreciation removal PR or some other version change, but it looks like an old Spring MVC anomaly was recently fixed; the test cases that are failing were rewritten to work around the anomaly; I've got a fix that returns them back to normal and should fix the test failures here: https://github.com/geoserver/geoserver/pull/3545

Torben

On Mon, Jun 3, 2019 at 8:50 AM Jenkins <[hidden email]> wrote:
See <http://build.geoserver.org/job/geoserver-master/6731/display/redirect>

------------------------------------------
[...truncated 1.10 MB...]
[INFO] <http://build.geoserver.org/job/geoserver-master/ws/src/extension/importer/web/src/main/java/org/geoserver/importer/web/AdvancedDbParamPanel.java>: Recompile with -Xlint:unchecked for details.
[INFO]
[INFO] --- maven-resources-plugin:2.6:testResources (default-testResources) @ gs-importer-web ---
[INFO] Using 'UTF-8' encoding to copy filtered resources.
[INFO] Copying 1 resource
[INFO]
[INFO] --- maven-compiler-plugin:3.8.0:testCompile (default-testCompile) @ gs-importer-web ---
[INFO] Changes detected - recompiling the module!
[INFO] Compiling 2 source files to <http://build.geoserver.org/job/geoserver-master/ws/src/extension/importer/web/target/test-classes>
[INFO]
[INFO] --- maven-surefire-plugin:2.12.3:test (default-test) @ gs-importer-web ---
[INFO] Surefire report directory: <http://build.geoserver.org/job/geoserver-master/ws/src/extension/importer/web/target/surefire-reports>

-------------------------------------------------------
 T E S T S
-------------------------------------------------------
Running org.geoserver.importer.web.AbstractDBPanelTest
Tests run: 1, Failures: 0, Errors: 0, Skipped: 0, Time elapsed: 1.307 sec
Running org.geoserver.importer.web.ImportTaskTableTest
Tests run: 2, Failures: 0, Errors: 0, Skipped: 0, Time elapsed: 8.376 sec

Results :

Tests run: 3, Failures: 0, Errors: 0, Skipped: 0

[INFO]
[INFO] --- maven-jar-plugin:2.4:jar (default-jar) @ gs-importer-web ---
[INFO] Building jar: <http://build.geoserver.org/job/geoserver-master/ws/src/extension/importer/web/target/gs-importer-web-2.16-SNAPSHOT.jar>
[INFO]
[INFO] --- maven-jar-plugin:2.4:test-jar (default) @ gs-importer-web ---
[INFO] Building jar: <http://build.geoserver.org/job/geoserver-master/ws/src/extension/importer/web/target/gs-importer-web-2.16-SNAPSHOT-tests.jar>
[INFO]
[INFO] --- maven-source-plugin:2.2.1:jar-no-fork (attach-sources) @ gs-importer-web ---
[INFO] Building jar: <http://build.geoserver.org/job/geoserver-master/ws/src/extension/importer/web/target/gs-importer-web-2.16-SNAPSHOT-sources.jar>
[INFO]
[INFO] --- maven-source-plugin:2.2.1:test-jar-no-fork (attach-sources) @ gs-importer-web ---
[INFO] Building jar: <http://build.geoserver.org/job/geoserver-master/ws/src/extension/importer/web/target/gs-importer-web-2.16-SNAPSHOT-test-sources.jar>
[INFO]
[INFO] --- maven-install-plugin:2.4:install (default-install) @ gs-importer-web ---
[INFO] Installing <http://build.geoserver.org/job/geoserver-master/ws/src/extension/importer/web/target/gs-importer-web-2.16-SNAPSHOT.jar> to /home/ubuntu/.m2/repository/org/geoserver/importer/gs-importer-web/2.16-SNAPSHOT/gs-importer-web-2.16-SNAPSHOT.jar
[INFO] Installing <http://build.geoserver.org/job/geoserver-master/ws/src/extension/importer/web/pom.xml> to /home/ubuntu/.m2/repository/org/geoserver/importer/gs-importer-web/2.16-SNAPSHOT/gs-importer-web-2.16-SNAPSHOT.pom
[INFO] Installing <http://build.geoserver.org/job/geoserver-master/ws/src/extension/importer/web/target/gs-importer-web-2.16-SNAPSHOT-tests.jar> to /home/ubuntu/.m2/repository/org/geoserver/importer/gs-importer-web/2.16-SNAPSHOT/gs-importer-web-2.16-SNAPSHOT-tests.jar
[INFO] Installing <http://build.geoserver.org/job/geoserver-master/ws/src/extension/importer/web/target/gs-importer-web-2.16-SNAPSHOT-sources.jar> to /home/ubuntu/.m2/repository/org/geoserver/importer/gs-importer-web/2.16-SNAPSHOT/gs-importer-web-2.16-SNAPSHOT-sources.jar
[INFO] Installing <http://build.geoserver.org/job/geoserver-master/ws/src/extension/importer/web/target/gs-importer-web-2.16-SNAPSHOT-test-sources.jar> to /home/ubuntu/.m2/repository/org/geoserver/importer/gs-importer-web/2.16-SNAPSHOT/gs-importer-web-2.16-SNAPSHOT-test-sources.jar
[INFO]
[INFO] ---------------< org.geoserver.security:gs-web-sec-cas >----------------
[INFO] Building GeoServer CAS Security Web Module 2.16-SNAPSHOT         [94/99]
[INFO] --------------------------------[ jar ]---------------------------------
[INFO]
[INFO] --- maven-clean-plugin:2.5:clean (default-clean) @ gs-web-sec-cas ---
[INFO] Deleting <http://build.geoserver.org/job/geoserver-master/ws/src/extension/security/web/web-cas/target>
[INFO]
[INFO] --- git-commit-id-plugin:2.1.15:revision (default) @ gs-web-sec-cas ---
[INFO]
[INFO] --- directory-maven-plugin:0.3.1:highest-basedir (directories) @ gs-web-sec-cas ---
[INFO] Highest basedir set to: <http://build.geoserver.org/job/geoserver-master/ws/src>
[INFO]
[INFO] --- fmt-maven-plugin:2.4.0:format (default) @ gs-web-sec-cas ---
[info] Skipping format check
[INFO]
[INFO] --- maven-resources-plugin:2.6:resources (default-resources) @ gs-web-sec-cas ---
[INFO] Using 'UTF-8' encoding to copy filtered resources.
[INFO] Copying 2 resources
[INFO] skip non existing resourceDirectory <http://build.geoserver.org/job/geoserver-master/ws/src/extension/security/web/web-cas/src/main/resources>
[INFO]
[INFO] --- maven-compiler-plugin:3.8.0:compile (default-compile) @ gs-web-sec-cas ---
[INFO] Changes detected - recompiling the module!
[INFO] Compiling 2 source files to <http://build.geoserver.org/job/geoserver-master/ws/src/extension/security/web/web-cas/target/classes>
[INFO]
[INFO] --- maven-resources-plugin:2.6:testResources (default-testResources) @ gs-web-sec-cas ---
[INFO] Using 'UTF-8' encoding to copy filtered resources.
[INFO] skip non existing resourceDirectory <http://build.geoserver.org/job/geoserver-master/ws/src/extension/security/web/web-cas/src/test/java>
[INFO] skip non existing resourceDirectory <http://build.geoserver.org/job/geoserver-master/ws/src/extension/security/web/web-cas/src/test/resources>
[INFO]
[INFO] --- maven-compiler-plugin:3.8.0:testCompile (default-testCompile) @ gs-web-sec-cas ---
[INFO] No sources to compile
[INFO]
[INFO] --- maven-surefire-plugin:2.12.3:test (default-test) @ gs-web-sec-cas ---
[INFO] No tests to run.
[INFO]
[INFO] --- maven-jar-plugin:2.4:jar (default-jar) @ gs-web-sec-cas ---
[INFO] Building jar: <http://build.geoserver.org/job/geoserver-master/ws/src/extension/security/web/web-cas/target/gs-web-sec-cas-2.16-SNAPSHOT.jar>
[INFO]
[INFO] --- maven-jar-plugin:2.4:test-jar (default) @ gs-web-sec-cas ---
[WARNING] JAR will be empty - no content was marked for inclusion!
[INFO] Building jar: <http://build.geoserver.org/job/geoserver-master/ws/src/extension/security/web/web-cas/target/gs-web-sec-cas-2.16-SNAPSHOT-tests.jar>
[INFO]
[INFO] --- maven-source-plugin:2.2.1:jar-no-fork (attach-sources) @ gs-web-sec-cas ---
[INFO] Building jar: <http://build.geoserver.org/job/geoserver-master/ws/src/extension/security/web/web-cas/target/gs-web-sec-cas-2.16-SNAPSHOT-sources.jar>
[INFO]
[INFO] --- maven-source-plugin:2.2.1:test-jar-no-fork (attach-sources) @ gs-web-sec-cas ---
[INFO] No sources in project. Archive not created.
[INFO]
[INFO] --- maven-install-plugin:2.4:install (default-install) @ gs-web-sec-cas ---
[INFO] Installing <http://build.geoserver.org/job/geoserver-master/ws/src/extension/security/web/web-cas/target/gs-web-sec-cas-2.16-SNAPSHOT.jar> to /home/ubuntu/.m2/repository/org/geoserver/security/gs-web-sec-cas/2.16-SNAPSHOT/gs-web-sec-cas-2.16-SNAPSHOT.jar
[INFO] Installing <http://build.geoserver.org/job/geoserver-master/ws/src/extension/security/web/web-cas/pom.xml> to /home/ubuntu/.m2/repository/org/geoserver/security/gs-web-sec-cas/2.16-SNAPSHOT/gs-web-sec-cas-2.16-SNAPSHOT.pom
[INFO] Installing <http://build.geoserver.org/job/geoserver-master/ws/src/extension/security/web/web-cas/target/gs-web-sec-cas-2.16-SNAPSHOT-tests.jar> to /home/ubuntu/.m2/repository/org/geoserver/security/gs-web-sec-cas/2.16-SNAPSHOT/gs-web-sec-cas-2.16-SNAPSHOT-tests.jar
[INFO] Installing <http://build.geoserver.org/job/geoserver-master/ws/src/extension/security/web/web-cas/target/gs-web-sec-cas-2.16-SNAPSHOT-sources.jar> to /home/ubuntu/.m2/repository/org/geoserver/security/gs-web-sec-cas/2.16-SNAPSHOT/gs-web-sec-cas-2.16-SNAPSHOT-sources.jar
Tests run: 12, Failures: 0, Errors: 0, Skipped: 0, Time elapsed: 204.072 sec
Running org.geoserver.importer.bdb.SerialVersionSafeSerialBindingTest
Tests run: 1, Failures: 0, Errors: 0, Skipped: 0, Time elapsed: 0.469 sec
Running org.geoserver.importer.bdb.XStreamInfoSerialBindingTest
Tests run: 2, Failures: 0, Errors: 0, Skipped: 0, Time elapsed: 3.284 sec

Results :

Tests run: 15, Failures: 0, Errors: 0, Skipped: 0

[INFO]
[INFO] --- maven-jar-plugin:2.4:jar (default-jar) @ gs-importer-bdb ---
[INFO] Building jar: <http://build.geoserver.org/job/geoserver-master/ws/src/extension/importer/bdb/target/gs-importer-bdb-2.16-SNAPSHOT.jar>
[INFO]
[INFO] --- maven-jar-plugin:2.4:test-jar (default) @ gs-importer-bdb ---
[INFO] Building jar: <http://build.geoserver.org/job/geoserver-master/ws/src/extension/importer/bdb/target/gs-importer-bdb-2.16-SNAPSHOT-tests.jar>
[INFO]
[INFO] --- maven-source-plugin:2.2.1:jar-no-fork (attach-sources) @ gs-importer-bdb ---
[INFO] Building jar: <http://build.geoserver.org/job/geoserver-master/ws/src/extension/importer/bdb/target/gs-importer-bdb-2.16-SNAPSHOT-sources.jar>
[INFO]
[INFO] --- maven-source-plugin:2.2.1:test-jar-no-fork (attach-sources) @ gs-importer-bdb ---
[INFO] Building jar: <http://build.geoserver.org/job/geoserver-master/ws/src/extension/importer/bdb/target/gs-importer-bdb-2.16-SNAPSHOT-test-sources.jar>
[INFO]
[INFO] --- maven-install-plugin:2.4:install (default-install) @ gs-importer-bdb ---
[INFO] Installing <http://build.geoserver.org/job/geoserver-master/ws/src/extension/importer/bdb/target/gs-importer-bdb-2.16-SNAPSHOT.jar> to /home/ubuntu/.m2/repository/org/geoserver/importer/gs-importer-bdb/2.16-SNAPSHOT/gs-importer-bdb-2.16-SNAPSHOT.jar
[INFO] Installing <http://build.geoserver.org/job/geoserver-master/ws/src/extension/importer/bdb/pom.xml> to /home/ubuntu/.m2/repository/org/geoserver/importer/gs-importer-bdb/2.16-SNAPSHOT/gs-importer-bdb-2.16-SNAPSHOT.pom
[INFO] Installing <http://build.geoserver.org/job/geoserver-master/ws/src/extension/importer/bdb/target/gs-importer-bdb-2.16-SNAPSHOT-tests.jar> to /home/ubuntu/.m2/repository/org/geoserver/importer/gs-importer-bdb/2.16-SNAPSHOT/gs-importer-bdb-2.16-SNAPSHOT-tests.jar
[INFO] Installing <http://build.geoserver.org/job/geoserver-master/ws/src/extension/importer/bdb/target/gs-importer-bdb-2.16-SNAPSHOT-sources.jar> to /home/ubuntu/.m2/repository/org/geoserver/importer/gs-importer-bdb/2.16-SNAPSHOT/gs-importer-bdb-2.16-SNAPSHOT-sources.jar
[INFO] Installing <http://build.geoserver.org/job/geoserver-master/ws/src/extension/importer/bdb/target/gs-importer-bdb-2.16-SNAPSHOT-test-sources.jar> to /home/ubuntu/.m2/repository/org/geoserver/importer/gs-importer-bdb/2.16-SNAPSHOT/gs-importer-bdb-2.16-SNAPSHOT-test-sources.jar
[INFO] ------------------------------------------------------------------------
[INFO] Reactor Summary for GeoServer 2.16-SNAPSHOT:
[INFO]
[INFO] GeoServer .......................................... SUCCESS [  4.459 s]
[INFO] Core Platform Module ............................... SUCCESS [ 10.262 s]
[INFO] Open Web Service Module ............................ SUCCESS [  6.479 s]
[INFO] Main Module ........................................ SUCCESS [ 56.480 s]
[INFO] GeoServer Security Modules ......................... SUCCESS [  0.082 s]
[INFO] GeoServer Security Tests Module .................... SUCCESS [01:31 min]
[INFO] GeoServer JDBC Security Module ..................... SUCCESS [ 42.031 s]
[INFO] GeoServer LDAP Security Module ..................... SUCCESS [ 23.098 s]
[INFO] Web Coverage Service Module ........................ SUCCESS [  0.523 s]
[INFO] Web Coverage Service 1.0 Module .................... SUCCESS [ 11.228 s]
[INFO] Web Coverage Service 1.1 Module .................... SUCCESS [ 14.282 s]
[INFO] Web Coverage Service 2.0 Module .................... SUCCESS [01:01 min]
[INFO] Web Feature Service Module ......................... SUCCESS [01:22 min]
[INFO] Web Map Service Module ............................. SUCCESS [01:57 min]
[INFO] KML support for GeoServer .......................... SUCCESS [ 19.360 s]
[INFO] gs-rest ............................................ SUCCESS [  7.584 s]
[INFO] GeoWebCache (GWC) Module ........................... FAILURE [ 57.051 s]
[INFO] gs-restconfig ...................................... SUCCESS [01:01 min]
[INFO] gs-restconfig-wcs .................................. SUCCESS [ 11.057 s]
[INFO] gs-restconfig-wfs .................................. SUCCESS [ 13.769 s]
[INFO] gs-restconfig-wms .................................. SUCCESS [ 11.057 s]
[INFO] GeoServer Web Modules .............................. SUCCESS [  0.063 s]
[INFO] Core UI Module ..................................... SUCCESS [01:02 min]
[INFO] WMS UI Module ...................................... SUCCESS [ 39.152 s]
[INFO] GWC UI Module ...................................... SKIPPED
[INFO] WFS UI Module ...................................... SUCCESS [  6.851 s]
[INFO] Demos Module ....................................... SUCCESS [04:15 min]
[INFO] WCS UI Module ...................................... SUCCESS [ 10.699 s]
[INFO] Security UI Modules ................................ SUCCESS [  0.037 s]
[INFO] Security UI Core Module ............................ SUCCESS [01:05 min]
[INFO] Security UI JDBC Module ............................ SUCCESS [07:09 min]
[INFO] Security UI LDAP Module ............................ SUCCESS [ 21.264 s]
[INFO] REST UI Module ..................................... SUCCESS [  6.431 s]
[INFO] GeoServer Extensions ............................... SUCCESS [  0.104 s]
[INFO] Printing Module .................................... SUCCESS [  8.523 s]
[INFO] GeoServer Web Application .......................... SKIPPED
[INFO] Community Space .................................... SUCCESS [  0.079 s]
[INFO] Application Schema Support ......................... SUCCESS [  0.039 s]
[INFO] Application Schema Integration Test ................ SUCCESS [02:05 min]
[INFO] Sample DataAccess Integration Test ................. SUCCESS [  7.614 s]
[INFO] ArcSDE DataStore Extension ......................... SUCCESS [  6.871 s]
[INFO] H2 DataStore Extension ............................. SUCCESS [  6.832 s]
[INFO] SQL Server DataStore Extension ..................... SUCCESS [  0.741 s]
[INFO] Oracle DataStore Extension ......................... SUCCESS [  0.577 s]
[INFO] MySQL DataStore Extension .......................... SUCCESS [  0.229 s]
[INFO] DB2 DataStore Extension ............................ SUCCESS [  0.247 s]
[INFO] ImageMap Output Format ............................. SUCCESS [  3.765 s]
[INFO] ImageI/O-Ext GDAL Coverage Extension ............... SUCCESS [  1.533 s]
[INFO] JP2K Coverage Extension ............................ SUCCESS [  0.253 s]
[INFO] OGR parent ......................................... SUCCESS [  0.023 s]
[INFO] OGR CORE ........................................... SUCCESS [  0.386 s]
[INFO] OGR WFS ............................................ SUCCESS [  5.067 s]
[INFO] Web Processing Service parent ...................... SUCCESS [  0.027 s]
[INFO] Web Processing Service Module ...................... SUCCESS [06:50 min]
[INFO] OGR WPS ............................................ SUCCESS [  6.914 s]
[INFO] Excel Output Format ................................ SUCCESS [  9.323 s]
[INFO] Chart external graphics support .................... SUCCESS [  0.422 s]
[INFO] Feature Generalization Extension ................... SUCCESS [  0.588 s]
[INFO] Image Mosaic JDBC Extension ........................ SUCCESS [  0.466 s]
[INFO] OWS request flow controller ........................ SUCCESS [ 11.026 s]
[INFO] Web process status sharing with Hazelcast .......... SUCCESS [ 14.677 s]
[INFO] Web Processing Service GUI ......................... SUCCESS [ 19.530 s]
[INFO] GeoServer Layer Querying filter functions .......... SUCCESS [ 10.257 s]
[INFO] Teradata DataStore Extension ....................... SUCCESS [  0.421 s]
[INFO] GeoServer Monitor Extensions ....................... SUCCESS [  0.028 s]
[INFO] Core Monitor Extension ............................. SKIPPED
[INFO] GeoServer Security Extension Modules ............... SUCCESS [  0.040 s]
[INFO] GeoServer CAS Security Module ...................... SUCCESS [  2.751 s]
[INFO] GeoServer Security Extension Web Modules ........... SUCCESS [  0.032 s]
[INFO] GeoServer CAS Security Web Module .................. SUCCESS [  0.366 s]
[INFO] XLST based WFS output format ....................... SUCCESS [ 12.798 s]
[INFO] GeoServer INSPIRE Extensions ....................... SKIPPED
[INFO] GeoServer CSS Styling .............................. SUCCESS [ 14.233 s]
[INFO] Catalog Services for the Web parent ................ SUCCESS [  0.034 s]
[INFO] Catalog Services for the Web interfaces ............ SUCCESS [  4.924 s]
[INFO] Catalog Services for the Web - Simple CatalogStore implementation SUCCESS [  5.296 s]
[INFO] Catalog Services for the Web core module ........... SUCCESS [01:04 min]
[INFO] CSW UI Module ...................................... SUCCESS [  7.698 s]
[INFO] DXF WFS output format and WPS PPIO ................. SUCCESS [  0.024 s]
[INFO] DXF WFS output format .............................. SUCCESS [  8.664 s]
[INFO] DXF WPS PPIO ....................................... SUCCESS [  6.057 s]
[INFO] GeoServer WCS 2.0 Earth Observation Extensions ..... SUCCESS [  0.025 s]
[INFO] Web Coverage Service 2.0 Earth Observation extensions SUCCESS [ 14.239 s]
[INFO] Web Coverage Service 2.0 Earth Observation GUI extension SUCCESS [  9.817 s]
[INFO] GeoServer libjpeg-turbo Module ..................... SUCCESS [  5.335 s]
[INFO] GeoServer Data Importer ............................ SUCCESS [  0.042 s]
[INFO] Importer Core Module ............................... SUCCESS [ 35.498 s]
[INFO] Importer REST Api Module-ng ........................ SUCCESS [ 37.673 s]
[INFO] Importer Berkley DB Persistence Module ............. SUCCESS [03:29 min]
[INFO] Importer Web UI Module ............................. SUCCESS [ 11.893 s]
[INFO] GRIB Coverage Format ............................... SUCCESS [ 12.010 s]
[INFO] NetCDF Coverage format ............................. SUCCESS [04:34 min]
[INFO] WCS NetCDF output Module ........................... SUCCESS [ 34.349 s]
[INFO] Vector Tiles ....................................... SUCCESS [ 12.115 s]
[INFO] Ysld GeoServer Plugin .............................. SKIPPED
[INFO] MongoDB Data Store ................................. SUCCESS [  1.289 s]
[INFO] REST SLD service ................................... SUCCESS [01:06 min]
[INFO] GeoFence security integration ...................... SUCCESS [ 27.641 s]
[INFO] GeoFence Server .................................... SUCCESS [ 30.914 s]
[INFO] ------------------------------------------------------------------------
[INFO] BUILD FAILURE
[INFO] ------------------------------------------------------------------------
[INFO] Total time:  28:22 min (Wall Clock)
[INFO] Finished at: 2019-06-03T15:49:39Z
[INFO] ------------------------------------------------------------------------
[ERROR] Failed to execute goal org.apache.maven.plugins:maven-surefire-plugin:2.12.3:test (default-test) on project gs-gwc: There are test failures.
[ERROR]
[ERROR] Please refer to <http://build.geoserver.org/job/geoserver-master/ws/src/gwc/target/surefire-reports> for the individual test results.
[ERROR] -> [Help 1]
[ERROR]
[ERROR] To see the full stack trace of the errors, re-run Maven with the -e switch.
[ERROR] Re-run Maven using the -X switch to enable full debug logging.
[ERROR]
[ERROR] For more information about the errors and possible solutions, please read the following articles:
[ERROR] [Help 1] http://cwiki.apache.org/confluence/display/MAVEN/MojoFailureException
[ERROR]
[ERROR] After correcting the problems, you can resume the build with the command
[ERROR]   mvn <goals> -rf :gs-gwc
Build step 'Invoke top-level Maven targets' marked build as failure


_______________________________________________
Geoserver-devel mailing list
[hidden email]
https://lists.sourceforge.net/lists/listinfo/geoserver-devel


_______________________________________________
Geoserver-devel mailing list
[hidden email]
https://lists.sourceforge.net/lists/listinfo/geoserver-devel
Reply | Threaded
Open this post in threaded view
|

Build failed in Jenkins: geoserver-master #6732

Jenkins-2
In reply to this post by Jenkins-2
See <http://build.geoserver.org/job/geoserver-master/6732/display/redirect?page=changes>

Changes:

[Torben Barsballe] [GEOS-8752] Allow integrated GWC to seed secured layers - Add regression

------------------------------------------
[...truncated 1.08 MB...]
[INFO] <http://build.geoserver.org/job/geoserver-master/ws/src/extension/importer/web/src/main/java/org/geoserver/importer/web/AdvancedDbParamPanel.java>: Recompile with -Xlint:unchecked for details.
[INFO]
[INFO] --- maven-resources-plugin:2.6:testResources (default-testResources) @ gs-importer-web ---
[INFO] Using 'UTF-8' encoding to copy filtered resources.
[INFO] Copying 1 resource
[INFO]
[INFO] --- maven-compiler-plugin:3.8.0:testCompile (default-testCompile) @ gs-importer-web ---
[INFO] Changes detected - recompiling the module!
[INFO] Compiling 2 source files to <http://build.geoserver.org/job/geoserver-master/ws/src/extension/importer/web/target/test-classes>
[INFO]
[INFO] --- maven-surefire-plugin:2.12.3:test (default-test) @ gs-importer-web ---
[INFO] Surefire report directory: <http://build.geoserver.org/job/geoserver-master/ws/src/extension/importer/web/target/surefire-reports>

-------------------------------------------------------
 T E S T S
-------------------------------------------------------
Running org.geoserver.importer.web.AbstractDBPanelTest
Tests run: 1, Failures: 0, Errors: 0, Skipped: 0, Time elapsed: 0.916 sec
Running org.geoserver.importer.web.ImportTaskTableTest
Tests run: 2, Failures: 0, Errors: 0, Skipped: 0, Time elapsed: 7.139 sec

Results :

Tests run: 3, Failures: 0, Errors: 0, Skipped: 0

[INFO]
[INFO] --- maven-jar-plugin:2.4:jar (default-jar) @ gs-importer-web ---
[INFO] Building jar: <http://build.geoserver.org/job/geoserver-master/ws/src/extension/importer/web/target/gs-importer-web-2.16-SNAPSHOT.jar>
[INFO]
[INFO] --- maven-jar-plugin:2.4:test-jar (default) @ gs-importer-web ---
[INFO] Building jar: <http://build.geoserver.org/job/geoserver-master/ws/src/extension/importer/web/target/gs-importer-web-2.16-SNAPSHOT-tests.jar>
[INFO]
[INFO] --- maven-source-plugin:2.2.1:jar-no-fork (attach-sources) @ gs-importer-web ---
[INFO] Building jar: <http://build.geoserver.org/job/geoserver-master/ws/src/extension/importer/web/target/gs-importer-web-2.16-SNAPSHOT-sources.jar>
[INFO]
[INFO] --- maven-source-plugin:2.2.1:test-jar-no-fork (attach-sources) @ gs-importer-web ---
[INFO] Building jar: <http://build.geoserver.org/job/geoserver-master/ws/src/extension/importer/web/target/gs-importer-web-2.16-SNAPSHOT-test-sources.jar>
[INFO]
[INFO] --- maven-install-plugin:2.4:install (default-install) @ gs-importer-web ---
[INFO] Installing <http://build.geoserver.org/job/geoserver-master/ws/src/extension/importer/web/target/gs-importer-web-2.16-SNAPSHOT.jar> to /home/ubuntu/.m2/repository/org/geoserver/importer/gs-importer-web/2.16-SNAPSHOT/gs-importer-web-2.16-SNAPSHOT.jar
[INFO] Installing <http://build.geoserver.org/job/geoserver-master/ws/src/extension/importer/web/pom.xml> to /home/ubuntu/.m2/repository/org/geoserver/importer/gs-importer-web/2.16-SNAPSHOT/gs-importer-web-2.16-SNAPSHOT.pom
[INFO] Installing <http://build.geoserver.org/job/geoserver-master/ws/src/extension/importer/web/target/gs-importer-web-2.16-SNAPSHOT-tests.jar> to /home/ubuntu/.m2/repository/org/geoserver/importer/gs-importer-web/2.16-SNAPSHOT/gs-importer-web-2.16-SNAPSHOT-tests.jar
[INFO] Installing <http://build.geoserver.org/job/geoserver-master/ws/src/extension/importer/web/target/gs-importer-web-2.16-SNAPSHOT-sources.jar> to /home/ubuntu/.m2/repository/org/geoserver/importer/gs-importer-web/2.16-SNAPSHOT/gs-importer-web-2.16-SNAPSHOT-sources.jar
[INFO] Installing <http://build.geoserver.org/job/geoserver-master/ws/src/extension/importer/web/target/gs-importer-web-2.16-SNAPSHOT-test-sources.jar> to /home/ubuntu/.m2/repository/org/geoserver/importer/gs-importer-web/2.16-SNAPSHOT/gs-importer-web-2.16-SNAPSHOT-test-sources.jar
[INFO]
[INFO] ---------------< org.geoserver.security:gs-web-sec-cas >----------------
[INFO] Building GeoServer CAS Security Web Module 2.16-SNAPSHOT         [94/99]
[INFO] --------------------------------[ jar ]---------------------------------
[INFO]
[INFO] --- maven-clean-plugin:2.5:clean (default-clean) @ gs-web-sec-cas ---
[INFO] Deleting <http://build.geoserver.org/job/geoserver-master/ws/src/extension/security/web/web-cas/target>
[INFO]
[INFO] --- git-commit-id-plugin:2.1.15:revision (default) @ gs-web-sec-cas ---
[INFO]
[INFO] --- directory-maven-plugin:0.3.1:highest-basedir (directories) @ gs-web-sec-cas ---
[INFO] Highest basedir set to: <http://build.geoserver.org/job/geoserver-master/ws/src>
[INFO]
[INFO] --- fmt-maven-plugin:2.4.0:format (default) @ gs-web-sec-cas ---
[info] Skipping format check
[INFO]
[INFO] --- maven-resources-plugin:2.6:resources (default-resources) @ gs-web-sec-cas ---
[INFO] Using 'UTF-8' encoding to copy filtered resources.
[INFO] Copying 2 resources
[INFO] skip non existing resourceDirectory <http://build.geoserver.org/job/geoserver-master/ws/src/extension/security/web/web-cas/src/main/resources>
[INFO]
[INFO] --- maven-compiler-plugin:3.8.0:compile (default-compile) @ gs-web-sec-cas ---
[INFO] Changes detected - recompiling the module!
[INFO] Compiling 2 source files to <http://build.geoserver.org/job/geoserver-master/ws/src/extension/security/web/web-cas/target/classes>
[INFO]
[INFO] --- maven-resources-plugin:2.6:testResources (default-testResources) @ gs-web-sec-cas ---
[INFO] Using 'UTF-8' encoding to copy filtered resources.
[INFO] skip non existing resourceDirectory <http://build.geoserver.org/job/geoserver-master/ws/src/extension/security/web/web-cas/src/test/java>
[INFO] skip non existing resourceDirectory <http://build.geoserver.org/job/geoserver-master/ws/src/extension/security/web/web-cas/src/test/resources>
[INFO]
[INFO] --- maven-compiler-plugin:3.8.0:testCompile (default-testCompile) @ gs-web-sec-cas ---
[INFO] No sources to compile
[INFO]
[INFO] --- maven-surefire-plugin:2.12.3:test (default-test) @ gs-web-sec-cas ---
[INFO] No tests to run.
[INFO]
[INFO] --- maven-jar-plugin:2.4:jar (default-jar) @ gs-web-sec-cas ---
[INFO] Building jar: <http://build.geoserver.org/job/geoserver-master/ws/src/extension/security/web/web-cas/target/gs-web-sec-cas-2.16-SNAPSHOT.jar>
[INFO]
[INFO] --- maven-jar-plugin:2.4:test-jar (default) @ gs-web-sec-cas ---
[WARNING] JAR will be empty - no content was marked for inclusion!
[INFO] Building jar: <http://build.geoserver.org/job/geoserver-master/ws/src/extension/security/web/web-cas/target/gs-web-sec-cas-2.16-SNAPSHOT-tests.jar>
[INFO]
[INFO] --- maven-source-plugin:2.2.1:jar-no-fork (attach-sources) @ gs-web-sec-cas ---
[INFO] Building jar: <http://build.geoserver.org/job/geoserver-master/ws/src/extension/security/web/web-cas/target/gs-web-sec-cas-2.16-SNAPSHOT-sources.jar>
[INFO]
[INFO] --- maven-source-plugin:2.2.1:test-jar-no-fork (attach-sources) @ gs-web-sec-cas ---
[INFO] No sources in project. Archive not created.
[INFO]
[INFO] --- maven-install-plugin:2.4:install (default-install) @ gs-web-sec-cas ---
[INFO] Installing <http://build.geoserver.org/job/geoserver-master/ws/src/extension/security/web/web-cas/target/gs-web-sec-cas-2.16-SNAPSHOT.jar> to /home/ubuntu/.m2/repository/org/geoserver/security/gs-web-sec-cas/2.16-SNAPSHOT/gs-web-sec-cas-2.16-SNAPSHOT.jar
[INFO] Installing <http://build.geoserver.org/job/geoserver-master/ws/src/extension/security/web/web-cas/pom.xml> to /home/ubuntu/.m2/repository/org/geoserver/security/gs-web-sec-cas/2.16-SNAPSHOT/gs-web-sec-cas-2.16-SNAPSHOT.pom
[INFO] Installing <http://build.geoserver.org/job/geoserver-master/ws/src/extension/security/web/web-cas/target/gs-web-sec-cas-2.16-SNAPSHOT-tests.jar> to /home/ubuntu/.m2/repository/org/geoserver/security/gs-web-sec-cas/2.16-SNAPSHOT/gs-web-sec-cas-2.16-SNAPSHOT-tests.jar
[INFO] Installing <http://build.geoserver.org/job/geoserver-master/ws/src/extension/security/web/web-cas/target/gs-web-sec-cas-2.16-SNAPSHOT-sources.jar> to /home/ubuntu/.m2/repository/org/geoserver/security/gs-web-sec-cas/2.16-SNAPSHOT/gs-web-sec-cas-2.16-SNAPSHOT-sources.jar
Tests run: 12, Failures: 0, Errors: 0, Skipped: 0, Time elapsed: 164.769 sec
Running org.geoserver.importer.bdb.SerialVersionSafeSerialBindingTest
Tests run: 1, Failures: 0, Errors: 0, Skipped: 0, Time elapsed: 0.378 sec
Running org.geoserver.importer.bdb.XStreamInfoSerialBindingTest
Tests run: 2, Failures: 0, Errors: 0, Skipped: 0, Time elapsed: 2.586 sec

Results :

Tests run: 15, Failures: 0, Errors: 0, Skipped: 0

[INFO]
[INFO] --- maven-jar-plugin:2.4:jar (default-jar) @ gs-importer-bdb ---
[INFO] Building jar: <http://build.geoserver.org/job/geoserver-master/ws/src/extension/importer/bdb/target/gs-importer-bdb-2.16-SNAPSHOT.jar>
[INFO]
[INFO] --- maven-jar-plugin:2.4:test-jar (default) @ gs-importer-bdb ---
[INFO] Building jar: <http://build.geoserver.org/job/geoserver-master/ws/src/extension/importer/bdb/target/gs-importer-bdb-2.16-SNAPSHOT-tests.jar>
[INFO]
[INFO] --- maven-source-plugin:2.2.1:jar-no-fork (attach-sources) @ gs-importer-bdb ---
[INFO] Building jar: <http://build.geoserver.org/job/geoserver-master/ws/src/extension/importer/bdb/target/gs-importer-bdb-2.16-SNAPSHOT-sources.jar>
[INFO]
[INFO] --- maven-source-plugin:2.2.1:test-jar-no-fork (attach-sources) @ gs-importer-bdb ---
[INFO] Building jar: <http://build.geoserver.org/job/geoserver-master/ws/src/extension/importer/bdb/target/gs-importer-bdb-2.16-SNAPSHOT-test-sources.jar>
[INFO]
[INFO] --- maven-install-plugin:2.4:install (default-install) @ gs-importer-bdb ---
[INFO] Installing <http://build.geoserver.org/job/geoserver-master/ws/src/extension/importer/bdb/target/gs-importer-bdb-2.16-SNAPSHOT.jar> to /home/ubuntu/.m2/repository/org/geoserver/importer/gs-importer-bdb/2.16-SNAPSHOT/gs-importer-bdb-2.16-SNAPSHOT.jar
[INFO] Installing <http://build.geoserver.org/job/geoserver-master/ws/src/extension/importer/bdb/pom.xml> to /home/ubuntu/.m2/repository/org/geoserver/importer/gs-importer-bdb/2.16-SNAPSHOT/gs-importer-bdb-2.16-SNAPSHOT.pom
[INFO] Installing <http://build.geoserver.org/job/geoserver-master/ws/src/extension/importer/bdb/target/gs-importer-bdb-2.16-SNAPSHOT-tests.jar> to /home/ubuntu/.m2/repository/org/geoserver/importer/gs-importer-bdb/2.16-SNAPSHOT/gs-importer-bdb-2.16-SNAPSHOT-tests.jar
[INFO] Installing <http://build.geoserver.org/job/geoserver-master/ws/src/extension/importer/bdb/target/gs-importer-bdb-2.16-SNAPSHOT-sources.jar> to /home/ubuntu/.m2/repository/org/geoserver/importer/gs-importer-bdb/2.16-SNAPSHOT/gs-importer-bdb-2.16-SNAPSHOT-sources.jar
[INFO] Installing <http://build.geoserver.org/job/geoserver-master/ws/src/extension/importer/bdb/target/gs-importer-bdb-2.16-SNAPSHOT-test-sources.jar> to /home/ubuntu/.m2/repository/org/geoserver/importer/gs-importer-bdb/2.16-SNAPSHOT/gs-importer-bdb-2.16-SNAPSHOT-test-sources.jar
[INFO] ------------------------------------------------------------------------
[INFO] Reactor Summary for GeoServer 2.16-SNAPSHOT:
[INFO]
[INFO] GeoServer .......................................... SUCCESS [  7.115 s]
[INFO] Core Platform Module ............................... SUCCESS [ 10.865 s]
[INFO] Open Web Service Module ............................ SUCCESS [  7.698 s]
[INFO] Main Module ........................................ SUCCESS [01:08 min]
[INFO] GeoServer Security Modules ......................... SUCCESS [  0.056 s]
[INFO] GeoServer Security Tests Module .................... SUCCESS [01:30 min]
[INFO] GeoServer JDBC Security Module ..................... SUCCESS [ 43.311 s]
[INFO] GeoServer LDAP Security Module ..................... SUCCESS [ 17.014 s]
[INFO] Web Coverage Service Module ........................ SUCCESS [  0.540 s]
[INFO] Web Coverage Service 1.0 Module .................... SUCCESS [ 11.028 s]
[INFO] Web Coverage Service 1.1 Module .................... SUCCESS [ 13.185 s]
[INFO] Web Coverage Service 2.0 Module .................... SUCCESS [01:05 min]
[INFO] Web Feature Service Module ......................... SUCCESS [01:17 min]
[INFO] Web Map Service Module ............................. SUCCESS [02:02 min]
[INFO] KML support for GeoServer .......................... SUCCESS [ 20.704 s]
[INFO] gs-rest ............................................ SUCCESS [  8.834 s]
[INFO] GeoWebCache (GWC) Module ........................... FAILURE [ 59.944 s]
[INFO] gs-restconfig ...................................... SUCCESS [01:02 min]
[INFO] gs-restconfig-wcs .................................. SUCCESS [ 13.490 s]
[INFO] gs-restconfig-wfs .................................. SUCCESS [ 13.212 s]
[INFO] gs-restconfig-wms .................................. SUCCESS [  9.942 s]
[INFO] GeoServer Web Modules .............................. SUCCESS [  0.135 s]
[INFO] Core UI Module ..................................... SUCCESS [ 59.104 s]
[INFO] WMS UI Module ...................................... SUCCESS [06:04 min]
[INFO] GWC UI Module ...................................... SKIPPED
[INFO] WFS UI Module ...................................... SUCCESS [  8.428 s]
[INFO] Demos Module ....................................... SUCCESS [04:03 min]
[INFO] WCS UI Module ...................................... SUCCESS [  9.535 s]
[INFO] Security UI Modules ................................ SUCCESS [  0.040 s]
[INFO] Security UI Core Module ............................ SUCCESS [01:09 min]
[INFO] Security UI JDBC Module ............................ SUCCESS [06:49 min]
[INFO] Security UI LDAP Module ............................ SUCCESS [ 18.601 s]
[INFO] REST UI Module ..................................... SUCCESS [  7.245 s]
[INFO] GeoServer Extensions ............................... SUCCESS [  0.155 s]
[INFO] Printing Module .................................... SUCCESS [  8.328 s]
[INFO] GeoServer Web Application .......................... SKIPPED
[INFO] Community Space .................................... SUCCESS [  0.098 s]
[INFO] Application Schema Support ......................... SUCCESS [  0.063 s]
[INFO] Application Schema Integration Test ................ SUCCESS [05:09 min]
[INFO] Sample DataAccess Integration Test ................. SUCCESS [  7.886 s]
[INFO] ArcSDE DataStore Extension ......................... SUCCESS [  7.599 s]
[INFO] H2 DataStore Extension ............................. SUCCESS [  7.036 s]
[INFO] SQL Server DataStore Extension ..................... SUCCESS [  0.918 s]
[INFO] Oracle DataStore Extension ......................... SUCCESS [  0.755 s]
[INFO] MySQL DataStore Extension .......................... SUCCESS [  0.325 s]
[INFO] DB2 DataStore Extension ............................ SUCCESS [  0.331 s]
[INFO] ImageMap Output Format ............................. SUCCESS [  3.894 s]
[INFO] ImageI/O-Ext GDAL Coverage Extension ............... SUCCESS [  2.413 s]
[INFO] JP2K Coverage Extension ............................ SUCCESS [  0.307 s]
[INFO] OGR parent ......................................... SUCCESS [  0.032 s]
[INFO] OGR CORE ........................................... SUCCESS [  0.257 s]
[INFO] OGR WFS ............................................ SUCCESS [  5.478 s]
[INFO] Web Processing Service parent ...................... SUCCESS [  0.033 s]
[INFO] Web Processing Service Module ...................... SUCCESS [07:32 min]
[INFO] OGR WPS ............................................ SUCCESS [  5.181 s]
[INFO] Excel Output Format ................................ SUCCESS [  9.457 s]
[INFO] Chart external graphics support .................... SUCCESS [  0.454 s]
[INFO] Feature Generalization Extension ................... SUCCESS [  0.407 s]
[INFO] Image Mosaic JDBC Extension ........................ SUCCESS [  0.504 s]
[INFO] OWS request flow controller ........................ SUCCESS [ 10.398 s]
[INFO] Web process status sharing with Hazelcast .......... SUCCESS [  7.893 s]
[INFO] Web Processing Service GUI ......................... SUCCESS [ 18.251 s]
[INFO] GeoServer Layer Querying filter functions .......... SUCCESS [ 10.666 s]
[INFO] Teradata DataStore Extension ....................... SUCCESS [  0.675 s]
[INFO] GeoServer Monitor Extensions ....................... SUCCESS [  0.030 s]
[INFO] Core Monitor Extension ............................. SKIPPED
[INFO] GeoServer Security Extension Modules ............... SUCCESS [  0.030 s]
[INFO] GeoServer CAS Security Module ...................... SUCCESS [  2.087 s]
[INFO] GeoServer Security Extension Web Modules ........... SUCCESS [  0.030 s]
[INFO] GeoServer CAS Security Web Module .................. SUCCESS [  0.483 s]
[INFO] XLST based WFS output format ....................... SUCCESS [ 14.145 s]
[INFO] GeoServer INSPIRE Extensions ....................... SKIPPED
[INFO] GeoServer CSS Styling .............................. SUCCESS [ 11.902 s]
[INFO] Catalog Services for the Web parent ................ SUCCESS [  0.031 s]
[INFO] Catalog Services for the Web interfaces ............ SUCCESS [  5.306 s]
[INFO] Catalog Services for the Web - Simple CatalogStore implementation SUCCESS [  4.984 s]
[INFO] Catalog Services for the Web core module ........... SUCCESS [03:59 min]
[INFO] CSW UI Module ...................................... SUCCESS [  6.743 s]
[INFO] DXF WFS output format and WPS PPIO ................. SUCCESS [  0.055 s]
[INFO] DXF WFS output format .............................. SUCCESS [  7.985 s]
[INFO] DXF WPS PPIO ....................................... SUCCESS [  5.532 s]
[INFO] GeoServer WCS 2.0 Earth Observation Extensions ..... SUCCESS [  0.027 s]
[INFO] Web Coverage Service 2.0 Earth Observation extensions SUCCESS [ 11.994 s]
[INFO] Web Coverage Service 2.0 Earth Observation GUI extension SUCCESS [05:17 min]
[INFO] GeoServer libjpeg-turbo Module ..................... SUCCESS [  6.369 s]
[INFO] GeoServer Data Importer ............................ SUCCESS [  0.063 s]
[INFO] Importer Core Module ............................... SUCCESS [ 31.136 s]
[INFO] Importer REST Api Module-ng ........................ SUCCESS [ 35.226 s]
[INFO] Importer Berkley DB Persistence Module ............. SUCCESS [02:48 min]
[INFO] Importer Web UI Module ............................. SUCCESS [  9.728 s]
[INFO] GRIB Coverage Format ............................... SUCCESS [ 12.317 s]
[INFO] NetCDF Coverage format ............................. SUCCESS [01:50 min]
[INFO] WCS NetCDF output Module ........................... SUCCESS [04:09 min]
[INFO] Vector Tiles ....................................... SUCCESS [ 10.914 s]
[INFO] Ysld GeoServer Plugin .............................. SKIPPED
[INFO] MongoDB Data Store ................................. SUCCESS [  1.302 s]
[INFO] REST SLD service ................................... SUCCESS [04:47 min]
[INFO] GeoFence security integration ...................... SUCCESS [ 18.943 s]
[INFO] GeoFence Server .................................... SUCCESS [04:15 min]
[INFO] ------------------------------------------------------------------------
[INFO] BUILD FAILURE
[INFO] ------------------------------------------------------------------------
[INFO] Total time:  40:15 min (Wall Clock)
[INFO] Finished at: 2019-06-03T19:09:00Z
[INFO] ------------------------------------------------------------------------
[ERROR] Failed to execute goal org.apache.maven.plugins:maven-surefire-plugin:2.12.3:test (default-test) on project gs-gwc: There are test failures.
[ERROR]
[ERROR] Please refer to <http://build.geoserver.org/job/geoserver-master/ws/src/gwc/target/surefire-reports> for the individual test results.
[ERROR] -> [Help 1]
[ERROR]
[ERROR] To see the full stack trace of the errors, re-run Maven with the -e switch.
[ERROR] Re-run Maven using the -X switch to enable full debug logging.
[ERROR]
[ERROR] For more information about the errors and possible solutions, please read the following articles:
[ERROR] [Help 1] http://cwiki.apache.org/confluence/display/MAVEN/MojoFailureException
[ERROR]
[ERROR] After correcting the problems, you can resume the build with the command
[ERROR]   mvn <goals> -rf :gs-gwc
Build step 'Invoke top-level Maven targets' marked build as failure


_______________________________________________
Geoserver-devel mailing list
[hidden email]
https://lists.sourceforge.net/lists/listinfo/geoserver-devel
Reply | Threaded
Open this post in threaded view
|

Jenkins build is back to normal : geoserver-master #6733

Jenkins-2