Build failed in Jenkins: geoserver-master #6541

classic Classic list List threaded Threaded
2 messages Options
Reply | Threaded
Open this post in threaded view
|

Build failed in Jenkins: geoserver-master #6541

monitor
See <https://build.geoserver.org/job/geoserver-master/6541/display/redirect>

------------------------------------------
[...truncated 665.88 KB...]
[INFO] ------------------------------------------------------------------------
[INFO] Skipping GeoServer CAS Security Web Module
[INFO] This project has been banned from the build due to previous failures.
[INFO] ------------------------------------------------------------------------
Tests run: 6, Failures: 0, Errors: 0, Skipped: 0, Time elapsed: 0.565 sec
Running org.geoserver.csw.GetRecordByIdTest
Tests run: 10, Failures: 0, Errors: 0, Skipped: 0, Time elapsed: 1.647 sec
Running org.geoserver.csw.GetRecordsTest
Tests run: 25, Failures: 0, Errors: 0, Skipped: 0, Time elapsed: 3.256 sec
Running org.geoserver.csw.GetRepositoryItemKvpRequestReaderTest
Tests run: 2, Failures: 0, Errors: 0, Skipped: 0, Time elapsed: 0.005 sec
Running org.geoserver.csw.GetRepositoryItemTest
Tests run: 3, Failures: 0, Errors: 0, Skipped: 0, Time elapsed: 0.222 sec
Running org.geoserver.csw.ServiceTest
Tests run: 1, Failures: 0, Errors: 0, Skipped: 0, Time elapsed: 0.154 sec
Running org.geoserver.csw.records.iso.GetDomainTest
Tests run: 1, Failures: 0, Errors: 0, Skipped: 0, Time elapsed: 0.555 sec
Running org.geoserver.csw.records.iso.GetRecordByIdTest
Tests run: 1, Failures: 0, Errors: 0, Skipped: 0, Time elapsed: 0.267 sec
Running org.geoserver.csw.records.iso.GetRecordsTest
Tests run: 10, Failures: 0, Errors: 0, Skipped: 0, Time elapsed: 0.79 sec
Running org.geoserver.csw.store.internal.DescribeRecordTest
Tests run: 3, Failures: 0, Errors: 0, Skipped: 0, Time elapsed: 0.776 sec
Running org.geoserver.csw.store.internal.GeoServerInternalCatalogStoreTest
Tests run: 1, Failures: 0, Errors: 0, Skipped: 0, Time elapsed: 2.21 sec
Running org.geoserver.csw.store.internal.GetCapabilitiesTest
Tests run: 3, Failures: 0, Errors: 0, Skipped: 0, Time elapsed: 0.686 sec
Running org.geoserver.csw.store.internal.GetDomainTest
Tests run: 1, Failures: 0, Errors: 0, Skipped: 0, Time elapsed: 0.322 sec
Running org.geoserver.csw.store.internal.GetRecordByIdTest
Tests run: 1, Failures: 0, Errors: 0, Skipped: 0, Time elapsed: 0.243 sec
Running org.geoserver.csw.store.internal.GetRecordsTest
Tests run: 12, Failures: 0, Errors: 0, Skipped: 0, Time elapsed: 0.908 sec
Running org.geoserver.csw.store.internal.LayerGroupTest
Tests run: 3, Failures: 0, Errors: 0, Skipped: 0, Time elapsed: 0.534 sec
Running org.geoserver.csw.store.internal.ResourceAccessManagerCSWTest
Tests run: 2, Failures: 0, Errors: 0, Skipped: 0, Time elapsed: 0.567 sec

Results :

Tests run: 113, Failures: 0, Errors: 0, Skipped: 0

[INFO]
[INFO] --- maven-jar-plugin:2.4:jar (default-jar) @ gs-csw-core ---
[INFO] Building jar: <https://build.geoserver.org/job/geoserver-master/ws/src/extension/csw/core/target/gs-csw-core-2.16-SNAPSHOT.jar>
[INFO]
[INFO] --- maven-jar-plugin:2.4:test-jar (default) @ gs-csw-core ---
[INFO] Building jar: <https://build.geoserver.org/job/geoserver-master/ws/src/extension/csw/core/target/gs-csw-core-2.16-SNAPSHOT-tests.jar>
[INFO]
[INFO] --- maven-source-plugin:2.2.1:jar-no-fork (attach-sources) @ gs-csw-core ---
[INFO] Building jar: <https://build.geoserver.org/job/geoserver-master/ws/src/extension/csw/core/target/gs-csw-core-2.16-SNAPSHOT-sources.jar>
[INFO]
[INFO] --- maven-source-plugin:2.2.1:test-jar-no-fork (attach-sources) @ gs-csw-core ---
[INFO] Building jar: <https://build.geoserver.org/job/geoserver-master/ws/src/extension/csw/core/target/gs-csw-core-2.16-SNAPSHOT-test-sources.jar>
[INFO]
[INFO] --- maven-install-plugin:2.4:install (default-install) @ gs-csw-core ---
[INFO] Installing <https://build.geoserver.org/job/geoserver-master/ws/src/extension/csw/core/target/gs-csw-core-2.16-SNAPSHOT.jar> to /var/jenkins/.m2/repository/org/geoserver/csw/gs-csw-core/2.16-SNAPSHOT/gs-csw-core-2.16-SNAPSHOT.jar
[INFO] Installing <https://build.geoserver.org/job/geoserver-master/ws/src/extension/csw/core/pom.xml> to /var/jenkins/.m2/repository/org/geoserver/csw/gs-csw-core/2.16-SNAPSHOT/gs-csw-core-2.16-SNAPSHOT.pom
[INFO] Installing <https://build.geoserver.org/job/geoserver-master/ws/src/extension/csw/core/target/gs-csw-core-2.16-SNAPSHOT-tests.jar> to /var/jenkins/.m2/repository/org/geoserver/csw/gs-csw-core/2.16-SNAPSHOT/gs-csw-core-2.16-SNAPSHOT-tests.jar
[INFO] Installing <https://build.geoserver.org/job/geoserver-master/ws/src/extension/csw/core/target/gs-csw-core-2.16-SNAPSHOT-sources.jar> to /var/jenkins/.m2/repository/org/geoserver/csw/gs-csw-core/2.16-SNAPSHOT/gs-csw-core-2.16-SNAPSHOT-sources.jar
[INFO] Installing <https://build.geoserver.org/job/geoserver-master/ws/src/extension/csw/core/target/gs-csw-core-2.16-SNAPSHOT-test-sources.jar> to /var/jenkins/.m2/repository/org/geoserver/csw/gs-csw-core/2.16-SNAPSHOT/gs-csw-core-2.16-SNAPSHOT-test-sources.jar
[INFO]
[INFO] --------------------< org.geoserver.csw:gs-web-csw >--------------------
[INFO] Building CSW UI Module 2.16-SNAPSHOT                             [51/99]
[INFO] --------------------------------[ jar ]---------------------------------
[INFO]
[INFO] --- maven-clean-plugin:2.5:clean (default-clean) @ gs-web-csw ---
[INFO] Deleting <https://build.geoserver.org/job/geoserver-master/ws/src/extension/csw/web-csw/target>
[INFO]
[INFO] --- git-commit-id-plugin:2.1.15:revision (default) @ gs-web-csw ---
[INFO]
[INFO] --- directory-maven-plugin:0.3.1:highest-basedir (directories) @ gs-web-csw ---
[INFO] Highest basedir set to: <https://build.geoserver.org/job/geoserver-master/ws/src>
[INFO]
[INFO] --- fmt-maven-plugin:2.4.0:format (default) @ gs-web-csw ---
[info] Skipping format check
[INFO]
[INFO] --- maven-resources-plugin:2.6:resources (default-resources) @ gs-web-csw ---
[INFO] Using 'UTF-8' encoding to copy filtered resources.
[INFO] Copying 4 resources
[INFO] Copying 13 resources
[INFO]
[INFO] --- maven-compiler-plugin:3.8.0:compile (default-compile) @ gs-web-csw ---
[INFO] Changes detected - recompiling the module!
[INFO] Compiling 2 source files to <https://build.geoserver.org/job/geoserver-master/ws/src/extension/csw/web-csw/target/classes>
[INFO]
[INFO] --- maven-resources-plugin:2.6:testResources (default-testResources) @ gs-web-csw ---
[INFO] Using 'UTF-8' encoding to copy filtered resources.
[INFO] Copying 0 resource
[INFO] skip non existing resourceDirectory <https://build.geoserver.org/job/geoserver-master/ws/src/extension/csw/web-csw/src/test/resources>
[INFO]
[INFO] --- maven-compiler-plugin:3.8.0:testCompile (default-testCompile) @ gs-web-csw ---
[INFO] Changes detected - recompiling the module!
[INFO] Compiling 1 source file to <https://build.geoserver.org/job/geoserver-master/ws/src/extension/csw/web-csw/target/test-classes>
[INFO]
[INFO] --- maven-surefire-plugin:2.12.3:test (default-test) @ gs-web-csw ---
[INFO] Surefire report directory: <https://build.geoserver.org/job/geoserver-master/ws/src/extension/csw/web-csw/target/surefire-reports>

-------------------------------------------------------
 T E S T S
-------------------------------------------------------
Running org.geoserver.wfs.web.CSWAdminPageTest
Tests run: 1, Failures: 0, Errors: 0, Skipped: 0, Time elapsed: 6.115 sec

Results :

Tests run: 1, Failures: 0, Errors: 0, Skipped: 0

[INFO]
[INFO] --- maven-jar-plugin:2.4:jar (default-jar) @ gs-web-csw ---
[INFO] Building jar: <https://build.geoserver.org/job/geoserver-master/ws/src/extension/csw/web-csw/target/gs-web-csw-2.16-SNAPSHOT.jar>
[INFO]
[INFO] --- maven-jar-plugin:2.4:test-jar (default) @ gs-web-csw ---
[INFO] Building jar: <https://build.geoserver.org/job/geoserver-master/ws/src/extension/csw/web-csw/target/gs-web-csw-2.16-SNAPSHOT-tests.jar>
[INFO]
[INFO] --- maven-source-plugin:2.2.1:jar-no-fork (attach-sources) @ gs-web-csw ---
[INFO] Building jar: <https://build.geoserver.org/job/geoserver-master/ws/src/extension/csw/web-csw/target/gs-web-csw-2.16-SNAPSHOT-sources.jar>
[INFO]
[INFO] --- maven-source-plugin:2.2.1:test-jar-no-fork (attach-sources) @ gs-web-csw ---
[INFO] Building jar: <https://build.geoserver.org/job/geoserver-master/ws/src/extension/csw/web-csw/target/gs-web-csw-2.16-SNAPSHOT-test-sources.jar>
[INFO]
[INFO] --- maven-install-plugin:2.4:install (default-install) @ gs-web-csw ---
[INFO] Installing <https://build.geoserver.org/job/geoserver-master/ws/src/extension/csw/web-csw/target/gs-web-csw-2.16-SNAPSHOT.jar> to /var/jenkins/.m2/repository/org/geoserver/csw/gs-web-csw/2.16-SNAPSHOT/gs-web-csw-2.16-SNAPSHOT.jar
[INFO] Installing <https://build.geoserver.org/job/geoserver-master/ws/src/extension/csw/web-csw/pom.xml> to /var/jenkins/.m2/repository/org/geoserver/csw/gs-web-csw/2.16-SNAPSHOT/gs-web-csw-2.16-SNAPSHOT.pom
[INFO] Installing <https://build.geoserver.org/job/geoserver-master/ws/src/extension/csw/web-csw/target/gs-web-csw-2.16-SNAPSHOT-tests.jar> to /var/jenkins/.m2/repository/org/geoserver/csw/gs-web-csw/2.16-SNAPSHOT/gs-web-csw-2.16-SNAPSHOT-tests.jar
[INFO] Installing <https://build.geoserver.org/job/geoserver-master/ws/src/extension/csw/web-csw/target/gs-web-csw-2.16-SNAPSHOT-sources.jar> to /var/jenkins/.m2/repository/org/geoserver/csw/gs-web-csw/2.16-SNAPSHOT/gs-web-csw-2.16-SNAPSHOT-sources.jar
[INFO] Installing <https://build.geoserver.org/job/geoserver-master/ws/src/extension/csw/web-csw/target/gs-web-csw-2.16-SNAPSHOT-test-sources.jar> to /var/jenkins/.m2/repository/org/geoserver/csw/gs-web-csw/2.16-SNAPSHOT/gs-web-csw-2.16-SNAPSHOT-test-sources.jar
[INFO] ------------------------------------------------------------------------
[INFO] Reactor Summary for GeoServer 2.16-SNAPSHOT:
[INFO]
[INFO] GeoServer .......................................... SUCCESS [ 11.260 s]
[INFO] Core Platform Module ............................... SUCCESS [ 16.057 s]
[INFO] Open Web Service Module ............................ SUCCESS [ 11.189 s]
[INFO] Main Module ........................................ SUCCESS [01:26 min]
[INFO] GeoServer Security Modules ......................... SUCCESS [  0.169 s]
[INFO] GeoServer Security Tests Module .................... SUCCESS [01:25 min]
[INFO] GeoServer JDBC Security Module ..................... SUCCESS [ 45.732 s]
[INFO] GeoServer LDAP Security Module ..................... SUCCESS [  5.165 s]
[INFO] Web Coverage Service Module ........................ SUCCESS [  1.668 s]
[INFO] Web Coverage Service 1.0 Module .................... SUCCESS [ 22.888 s]
[INFO] Web Coverage Service 1.1 Module .................... SUCCESS [ 25.592 s]
[INFO] Web Coverage Service 2.0 Module .................... SUCCESS [ 55.189 s]
[INFO] Web Feature Service Module ......................... FAILURE [02:20 min]
[INFO] Web Map Service Module ............................. SKIPPED
[INFO] KML support for GeoServer .......................... SKIPPED
[INFO] gs-rest ............................................ SUCCESS [ 15.585 s]
[INFO] GeoWebCache (GWC) Module ........................... SKIPPED
[INFO] gs-restconfig ...................................... SUCCESS [01:23 min]
[INFO] gs-restconfig-wcs .................................. SUCCESS [ 18.428 s]
[INFO] gs-restconfig-wfs .................................. SKIPPED
[INFO] gs-restconfig-wms .................................. SKIPPED
[INFO] GeoServer Web Modules .............................. SUCCESS [  0.147 s]
[INFO] Core UI Module ..................................... SUCCESS [01:56 min]
[INFO] WMS UI Module ...................................... SKIPPED
[INFO] GWC UI Module ...................................... SKIPPED
[INFO] WFS UI Module ...................................... SKIPPED
[INFO] Demos Module ....................................... SKIPPED
[INFO] WCS UI Module ...................................... SKIPPED
[INFO] Security UI Modules ................................ SUCCESS [  0.079 s]
[INFO] Security UI Core Module ............................ SKIPPED
[INFO] Security UI JDBC Module ............................ SKIPPED
[INFO] Security UI LDAP Module ............................ SKIPPED
[INFO] REST UI Module ..................................... SUCCESS [ 11.712 s]
[INFO] GeoServer Extensions ............................... SUCCESS [  0.131 s]
[INFO] Printing Module .................................... SUCCESS [ 10.882 s]
[INFO] GeoServer Web Application .......................... SKIPPED
[INFO] Community Space .................................... SUCCESS [  0.107 s]
[INFO] Application Schema Support ......................... SUCCESS [  0.084 s]
[INFO] Application Schema Integration Test ................ SKIPPED
[INFO] Sample DataAccess Integration Test ................. SKIPPED
[INFO] ArcSDE DataStore Extension ......................... SUCCESS [  8.936 s]
[INFO] H2 DataStore Extension ............................. SUCCESS [ 12.261 s]
[INFO] SQL Server DataStore Extension ..................... SUCCESS [  1.137 s]
[INFO] Oracle DataStore Extension ......................... SUCCESS [  0.815 s]
[INFO] MySQL DataStore Extension .......................... SUCCESS [  0.382 s]
[INFO] DB2 DataStore Extension ............................ SUCCESS [  0.376 s]
[INFO] ImageMap Output Format ............................. SKIPPED
[INFO] ImageI/O-Ext GDAL Coverage Extension ............... SUCCESS [  2.514 s]
[INFO] JP2K Coverage Extension ............................ SUCCESS [  0.463 s]
[INFO] OGR parent ......................................... SUCCESS [  0.071 s]
[INFO] OGR CORE ........................................... SUCCESS [  0.894 s]
[INFO] OGR WFS ............................................ SKIPPED
[INFO] Web Processing Service parent ...................... SUCCESS [  0.076 s]
[INFO] Web Processing Service Module ...................... SKIPPED
[INFO] OGR WPS ............................................ SKIPPED
[INFO] Excel Output Format ................................ SKIPPED
[INFO] Chart external graphics support .................... SUCCESS [  0.673 s]
[INFO] Feature Generalization Extension ................... SUCCESS [  1.253 s]
[INFO] Image Mosaic JDBC Extension ........................ SUCCESS [  0.837 s]
[INFO] OWS request flow controller ........................ SUCCESS [ 13.519 s]
[INFO] Web process status sharing with Hazelcast .......... SKIPPED
[INFO] Web Processing Service GUI ......................... SKIPPED
[INFO] GeoServer Layer Querying filter functions .......... SKIPPED
[INFO] Teradata DataStore Extension ....................... SUCCESS [  0.669 s]
[INFO] GeoServer Monitor Extensions ....................... SKIPPED
[INFO] Core Monitor Extension ............................. SKIPPED
[INFO] GeoServer Security Extension Modules ............... SKIPPED
[INFO] GeoServer CAS Security Module ...................... SKIPPED
[INFO] GeoServer Security Extension Web Modules ........... SKIPPED
[INFO] GeoServer CAS Security Web Module .................. SKIPPED
[INFO] XLST based WFS output format ....................... SKIPPED
[INFO] GeoServer INSPIRE Extensions ....................... SKIPPED
[INFO] GeoServer CSS Styling .............................. SKIPPED
[INFO] Catalog Services for the Web parent ................ SUCCESS [  0.147 s]
[INFO] Catalog Services for the Web interfaces ............ SUCCESS [  6.569 s]
[INFO] Catalog Services for the Web - Simple CatalogStore implementation SUCCESS [  7.046 s]
[INFO] Catalog Services for the Web core module ........... SUCCESS [ 35.768 s]
[INFO] CSW UI Module ...................................... SUCCESS [  7.192 s]
[INFO] DXF WFS output format and WPS PPIO ................. SUCCESS [  0.052 s]
[INFO] DXF WFS output format .............................. SKIPPED
[INFO] DXF WPS PPIO ....................................... SKIPPED
[INFO] GeoServer WCS 2.0 Earth Observation Extensions ..... SUCCESS [  0.056 s]
[INFO] Web Coverage Service 2.0 Earth Observation extensions SUCCESS [ 18.683 s]
[INFO] Web Coverage Service 2.0 Earth Observation GUI extension SUCCESS [ 12.359 s]
[INFO] GeoServer libjpeg-turbo Module ..................... SKIPPED
[INFO] GeoServer Data Importer ............................ SKIPPED
[INFO] Importer Core Module ............................... SKIPPED
[INFO] Importer REST Api Module-ng ........................ SKIPPED
[INFO] Importer Berkley DB Persistence Module ............. SKIPPED
[INFO] Importer Web UI Module ............................. SKIPPED
[INFO] GRIB Coverage Format ............................... SUCCESS [ 13.679 s]
[INFO] NetCDF Coverage format ............................. SKIPPED
[INFO] WCS NetCDF output Module ........................... SKIPPED
[INFO] Vector Tiles ....................................... SKIPPED
[INFO] Ysld GeoServer Plugin .............................. SKIPPED
[INFO] MongoDB Data Store ................................. SUCCESS [  1.623 s]
[INFO] REST SLD service ................................... SKIPPED
[INFO] GeoFence security integration ...................... SKIPPED
[INFO] GeoFence Server .................................... SKIPPED
[INFO] ------------------------------------------------------------------------
[INFO] BUILD FAILURE
[INFO] ------------------------------------------------------------------------
[INFO] Total time:  08:48 min (Wall Clock)
[INFO] Finished at: 2019-02-09T12:04:39Z
[INFO] ------------------------------------------------------------------------
[ERROR] Failed to execute goal org.apache.maven.plugins:maven-surefire-plugin:2.12.3:test (default-test) on project gs-wfs: There are test failures.
[ERROR]
[ERROR] Please refer to <https://build.geoserver.org/job/geoserver-master/ws/src/wfs/target/surefire-reports> for the individual test results.
[ERROR] -> [Help 1]
[ERROR]
[ERROR] To see the full stack trace of the errors, re-run Maven with the -e switch.
[ERROR] Re-run Maven using the -X switch to enable full debug logging.
[ERROR]
[ERROR] For more information about the errors and possible solutions, please read the following articles:
[ERROR] [Help 1] http://cwiki.apache.org/confluence/display/MAVEN/MojoFailureException
[ERROR]
[ERROR] After correcting the problems, you can resume the build with the command
[ERROR]   mvn <goals> -rf :gs-wfs
Build step 'Invoke top-level Maven targets' marked build as failure


_______________________________________________
Geoserver-devel mailing list
[hidden email]
https://lists.sourceforge.net/lists/listinfo/geoserver-devel
Reply | Threaded
Open this post in threaded view
|

Jenkins build is back to normal : geoserver-master #6542

monitor