Build failed in Jenkins: geoserver-master #6535

classic Classic list List threaded Threaded
2 messages Options
Reply | Threaded
Open this post in threaded view
|

Build failed in Jenkins: geoserver-master #6535

monitor
See <https://build.geoserver.org/job/geoserver-master/6535/display/redirect?page=changes>

Changes:

[tbarsballe] [GEOS-9018] Only use Ctrl-Space to trigger autocomplete

------------------------------------------
[...truncated 1.22 MB...]
        at org.junit.internal.runners.statements.RunBefores.evaluate(RunBefores.java:26)
        at org.junit.internal.runners.statements.RunAfters.evaluate(RunAfters.java:27)
        at org.junit.rules.RunRules.evaluate(RunRules.java:20)
        at org.junit.runners.ParentRunner.runLeaf(ParentRunner.java:325)
        at org.junit.runners.BlockJUnit4ClassRunner.runChild(BlockJUnit4ClassRunner.java:78)
        at org.junit.runners.BlockJUnit4ClassRunner.runChild(BlockJUnit4ClassRunner.java:57)
        at org.junit.runners.ParentRunner$3.run(ParentRunner.java:290)
        at org.junit.runners.ParentRunner$1.schedule(ParentRunner.java:71)
        at org.junit.runners.ParentRunner.runChildren(ParentRunner.java:288)
        at org.junit.runners.ParentRunner.access$000(ParentRunner.java:58)
        at org.junit.runners.ParentRunner$2.evaluate(ParentRunner.java:268)
        at org.junit.internal.runners.statements.RunBefores.evaluate(RunBefores.java:26)
        at org.junit.internal.runners.statements.RunAfters.evaluate(RunAfters.java:27)
        at org.junit.runners.ParentRunner.run(ParentRunner.java:363)
        at org.apache.maven.surefire.junit4.JUnit4Provider.execute(JUnit4Provider.java:252)
        at org.apache.maven.surefire.junit4.JUnit4Provider.executeTestSet(JUnit4Provider.java:141)
        at org.apache.maven.surefire.junit4.JUnit4Provider.invoke(JUnit4Provider.java:112)
        at sun.reflect.NativeMethodAccessorImpl.invoke0(Native Method)
        at sun.reflect.NativeMethodAccessorImpl.invoke(NativeMethodAccessorImpl.java:62)
        at sun.reflect.DelegatingMethodAccessorImpl.invoke(DelegatingMethodAccessorImpl.java:43)
        at java.lang.reflect.Method.invoke(Method.java:498)
        at org.apache.maven.surefire.util.ReflectionUtils.invokeMethodWithArray(ReflectionUtils.java:189)
        at org.apache.maven.surefire.booter.ProviderFactory$ProviderProxy.invoke(ProviderFactory.java:165)
        at org.apache.maven.surefire.booter.ProviderFactory.invokeProvider(ProviderFactory.java:85)
        at org.apache.maven.surefire.booter.ForkedBooter.runSuitesInProcess(ForkedBooter.java:115)
        at org.apache.maven.surefire.booter.ForkedBooter.main(ForkedBooter.java:75)

[INFO]
[INFO] --- maven-jar-plugin:2.4:test-jar (default) @ gs-importer-web ---
[INFO] Building jar: <https://build.geoserver.org/job/geoserver-master/ws/src/extension/importer/web/target/gs-importer-web-2.16-SNAPSHOT-tests.jar>
[INFO]
[INFO] --- maven-source-plugin:2.2.1:jar-no-fork (attach-sources) @ gs-importer-web ---
[INFO] Building jar: <https://build.geoserver.org/job/geoserver-master/ws/src/extension/importer/web/target/gs-importer-web-2.16-SNAPSHOT-sources.jar>
[INFO]
[INFO] --- maven-source-plugin:2.2.1:test-jar-no-fork (attach-sources) @ gs-importer-web ---
[INFO] Building jar: <https://build.geoserver.org/job/geoserver-master/ws/src/extension/importer/web/target/gs-importer-web-2.16-SNAPSHOT-test-sources.jar>
[INFO]
[INFO] --- maven-install-plugin:2.4:install (default-install) @ gs-importer-web ---
[INFO] Installing <https://build.geoserver.org/job/geoserver-master/ws/src/extension/importer/web/target/gs-importer-web-2.16-SNAPSHOT.jar> to /var/jenkins/.m2/repository/org/geoserver/importer/gs-importer-web/2.16-SNAPSHOT/gs-importer-web-2.16-SNAPSHOT.jar
[INFO] Installing <https://build.geoserver.org/job/geoserver-master/ws/src/extension/importer/web/pom.xml> to /var/jenkins/.m2/repository/org/geoserver/importer/gs-importer-web/2.16-SNAPSHOT/gs-importer-web-2.16-SNAPSHOT.pom
[INFO] Installing <https://build.geoserver.org/job/geoserver-master/ws/src/extension/importer/web/target/gs-importer-web-2.16-SNAPSHOT-tests.jar> to /var/jenkins/.m2/repository/org/geoserver/importer/gs-importer-web/2.16-SNAPSHOT/gs-importer-web-2.16-SNAPSHOT-tests.jar
[INFO] Installing <https://build.geoserver.org/job/geoserver-master/ws/src/extension/importer/web/target/gs-importer-web-2.16-SNAPSHOT-sources.jar> to /var/jenkins/.m2/repository/org/geoserver/importer/gs-importer-web/2.16-SNAPSHOT/gs-importer-web-2.16-SNAPSHOT-sources.jar
Tests run: 17, Failures: 0, Errors: 0, Skipped: 0, Time elapsed: 21.647 sec
Running org.geoserver.importer.rest.PostScriptTransformTest
[INFO] Installing <https://build.geoserver.org/job/geoserver-master/ws/src/extension/importer/web/target/gs-importer-web-2.16-SNAPSHOT-test-sources.jar> to /var/jenkins/.m2/repository/org/geoserver/importer/gs-importer-web/2.16-SNAPSHOT/gs-importer-web-2.16-SNAPSHOT-test-sources.jar
[INFO]
[INFO] ---------------< org.geoserver.security:gs-web-sec-cas >----------------
[INFO] Building GeoServer CAS Security Web Module 2.16-SNAPSHOT         [94/99]
[INFO] --------------------------------[ jar ]---------------------------------
Tests run: 1, Failures: 0, Errors: 0, Skipped: 0, Time elapsed: 0.027 sec
Running org.geoserver.importer.rest.converters.ImportJSONIOTest
[INFO]
[INFO] --- maven-clean-plugin:2.5:clean (default-clean) @ gs-web-sec-cas ---
[INFO] Deleting <https://build.geoserver.org/job/geoserver-master/ws/src/extension/security/web/web-cas/target>
[INFO]
[INFO] --- git-commit-id-plugin:2.1.15:revision (default) @ gs-web-sec-cas ---
[INFO]
[INFO] --- directory-maven-plugin:0.3.1:highest-basedir (directories) @ gs-web-sec-cas ---
[INFO] Highest basedir set to: <https://build.geoserver.org/job/geoserver-master/ws/src>
[INFO]
[INFO] --- fmt-maven-plugin:2.4.0:format (default) @ gs-web-sec-cas ---
[info] Skipping format check
[INFO]
[INFO] --- maven-resources-plugin:2.6:resources (default-resources) @ gs-web-sec-cas ---
[INFO] Using 'UTF-8' encoding to copy filtered resources.
[INFO] Copying 2 resources
[INFO] skip non existing resourceDirectory <https://build.geoserver.org/job/geoserver-master/ws/src/extension/security/web/web-cas/src/main/resources>
[INFO]
[INFO] --- maven-compiler-plugin:3.8.0:compile (default-compile) @ gs-web-sec-cas ---
[INFO] Changes detected - recompiling the module!
[INFO] Compiling 2 source files to <https://build.geoserver.org/job/geoserver-master/ws/src/extension/security/web/web-cas/target/classes>
[INFO]
[INFO] --- maven-resources-plugin:2.6:testResources (default-testResources) @ gs-web-sec-cas ---
[INFO] Using 'UTF-8' encoding to copy filtered resources.
[INFO] skip non existing resourceDirectory <https://build.geoserver.org/job/geoserver-master/ws/src/extension/security/web/web-cas/src/test/java>
[INFO] skip non existing resourceDirectory <https://build.geoserver.org/job/geoserver-master/ws/src/extension/security/web/web-cas/src/test/resources>
[INFO]
[INFO] --- maven-compiler-plugin:3.8.0:testCompile (default-testCompile) @ gs-web-sec-cas ---
[INFO] No sources to compile
[INFO]
[INFO] --- maven-surefire-plugin:2.12.3:test (default-test) @ gs-web-sec-cas ---
[INFO] No tests to run.
[INFO]
[INFO] --- maven-jar-plugin:2.4:jar (default-jar) @ gs-web-sec-cas ---
[INFO] Building jar: <https://build.geoserver.org/job/geoserver-master/ws/src/extension/security/web/web-cas/target/gs-web-sec-cas-2.16-SNAPSHOT.jar>
[INFO]
[INFO] --- maven-jar-plugin:2.4:test-jar (default) @ gs-web-sec-cas ---
[WARNING] JAR will be empty - no content was marked for inclusion!
[INFO] Building jar: <https://build.geoserver.org/job/geoserver-master/ws/src/extension/security/web/web-cas/target/gs-web-sec-cas-2.16-SNAPSHOT-tests.jar>
[INFO]
[INFO] --- maven-source-plugin:2.2.1:jar-no-fork (attach-sources) @ gs-web-sec-cas ---
[INFO] Building jar: <https://build.geoserver.org/job/geoserver-master/ws/src/extension/security/web/web-cas/target/gs-web-sec-cas-2.16-SNAPSHOT-sources.jar>
[INFO]
[INFO] --- maven-source-plugin:2.2.1:test-jar-no-fork (attach-sources) @ gs-web-sec-cas ---
[INFO] No sources in project. Archive not created.
[INFO]
[INFO] --- maven-install-plugin:2.4:install (default-install) @ gs-web-sec-cas ---
[INFO] Installing <https://build.geoserver.org/job/geoserver-master/ws/src/extension/security/web/web-cas/target/gs-web-sec-cas-2.16-SNAPSHOT.jar> to /var/jenkins/.m2/repository/org/geoserver/security/gs-web-sec-cas/2.16-SNAPSHOT/gs-web-sec-cas-2.16-SNAPSHOT.jar
[INFO] Installing <https://build.geoserver.org/job/geoserver-master/ws/src/extension/security/web/web-cas/pom.xml> to /var/jenkins/.m2/repository/org/geoserver/security/gs-web-sec-cas/2.16-SNAPSHOT/gs-web-sec-cas-2.16-SNAPSHOT.pom
[INFO] Installing <https://build.geoserver.org/job/geoserver-master/ws/src/extension/security/web/web-cas/target/gs-web-sec-cas-2.16-SNAPSHOT-tests.jar> to /var/jenkins/.m2/repository/org/geoserver/security/gs-web-sec-cas/2.16-SNAPSHOT/gs-web-sec-cas-2.16-SNAPSHOT-tests.jar
[INFO] Installing <https://build.geoserver.org/job/geoserver-master/ws/src/extension/security/web/web-cas/target/gs-web-sec-cas-2.16-SNAPSHOT-sources.jar> to /var/jenkins/.m2/repository/org/geoserver/security/gs-web-sec-cas/2.16-SNAPSHOT/gs-web-sec-cas-2.16-SNAPSHOT-sources.jar
Tests run: 4, Failures: 0, Errors: 0, Skipped: 0, Time elapsed: 1.047 sec

Results :

Tests run: 76, Failures: 0, Errors: 0, Skipped: 0

[INFO]
[INFO] --- maven-jar-plugin:2.4:jar (default-jar) @ gs-importer-rest ---
[INFO] Building jar: <https://build.geoserver.org/job/geoserver-master/ws/src/extension/importer/rest/target/gs-importer-rest-2.16-SNAPSHOT.jar>
[INFO]
[INFO] --- maven-jar-plugin:2.4:test-jar (default) @ gs-importer-rest ---
[INFO] Building jar: <https://build.geoserver.org/job/geoserver-master/ws/src/extension/importer/rest/target/gs-importer-rest-2.16-SNAPSHOT-tests.jar>
[INFO]
[INFO] --- maven-source-plugin:2.2.1:jar-no-fork (attach-sources) @ gs-importer-rest ---
[INFO] Building jar: <https://build.geoserver.org/job/geoserver-master/ws/src/extension/importer/rest/target/gs-importer-rest-2.16-SNAPSHOT-sources.jar>
[INFO]
[INFO] --- maven-source-plugin:2.2.1:test-jar-no-fork (attach-sources) @ gs-importer-rest ---
[INFO] Building jar: <https://build.geoserver.org/job/geoserver-master/ws/src/extension/importer/rest/target/gs-importer-rest-2.16-SNAPSHOT-test-sources.jar>
[INFO]
[INFO] --- maven-install-plugin:2.4:install (default-install) @ gs-importer-rest ---
[INFO] Installing <https://build.geoserver.org/job/geoserver-master/ws/src/extension/importer/rest/target/gs-importer-rest-2.16-SNAPSHOT.jar> to /var/jenkins/.m2/repository/org/geoserver/importer/gs-importer-rest/2.16-SNAPSHOT/gs-importer-rest-2.16-SNAPSHOT.jar
[INFO] Installing <https://build.geoserver.org/job/geoserver-master/ws/src/extension/importer/rest/pom.xml> to /var/jenkins/.m2/repository/org/geoserver/importer/gs-importer-rest/2.16-SNAPSHOT/gs-importer-rest-2.16-SNAPSHOT.pom
[INFO] Installing <https://build.geoserver.org/job/geoserver-master/ws/src/extension/importer/rest/target/gs-importer-rest-2.16-SNAPSHOT-tests.jar> to /var/jenkins/.m2/repository/org/geoserver/importer/gs-importer-rest/2.16-SNAPSHOT/gs-importer-rest-2.16-SNAPSHOT-tests.jar
[INFO] Installing <https://build.geoserver.org/job/geoserver-master/ws/src/extension/importer/rest/target/gs-importer-rest-2.16-SNAPSHOT-sources.jar> to /var/jenkins/.m2/repository/org/geoserver/importer/gs-importer-rest/2.16-SNAPSHOT/gs-importer-rest-2.16-SNAPSHOT-sources.jar
[INFO] Installing <https://build.geoserver.org/job/geoserver-master/ws/src/extension/importer/rest/target/gs-importer-rest-2.16-SNAPSHOT-test-sources.jar> to /var/jenkins/.m2/repository/org/geoserver/importer/gs-importer-rest/2.16-SNAPSHOT/gs-importer-rest-2.16-SNAPSHOT-test-sources.jar
[INFO] ------------------------------------------------------------------------
[INFO] Reactor Summary for GeoServer 2.16-SNAPSHOT:
[INFO]
[INFO] GeoServer .......................................... SUCCESS [  8.737 s]
[INFO] Core Platform Module ............................... SUCCESS [ 11.935 s]
[INFO] Open Web Service Module ............................ SUCCESS [  6.357 s]
[INFO] Main Module ........................................ SUCCESS [ 50.793 s]
[INFO] GeoServer Security Modules ......................... SUCCESS [  0.138 s]
[INFO] GeoServer Security Tests Module .................... SUCCESS [01:08 min]
[INFO] GeoServer JDBC Security Module ..................... SUCCESS [ 42.067 s]
[INFO] GeoServer LDAP Security Module ..................... SUCCESS [  2.175 s]
[INFO] Web Coverage Service Module ........................ SUCCESS [  0.775 s]
[INFO] Web Coverage Service 1.0 Module .................... SUCCESS [ 13.273 s]
[INFO] Web Coverage Service 1.1 Module .................... SUCCESS [ 13.905 s]
[INFO] Web Coverage Service 2.0 Module .................... SUCCESS [ 47.361 s]
[INFO] Web Feature Service Module ......................... SUCCESS [01:14 min]
[INFO] Web Map Service Module ............................. SUCCESS [02:45 min]
[INFO] KML support for GeoServer .......................... SUCCESS [ 43.202 s]
[INFO] gs-rest ............................................ SUCCESS [  9.154 s]
[INFO] GeoWebCache (GWC) Module ........................... FAILURE [02:02 min]
[INFO] gs-restconfig ...................................... SUCCESS [01:10 min]
[INFO] gs-restconfig-wcs .................................. SUCCESS [ 31.091 s]
[INFO] gs-restconfig-wfs .................................. SUCCESS [ 33.405 s]
[INFO] gs-restconfig-wms .................................. SUCCESS [ 15.352 s]
[INFO] GeoServer Web Modules .............................. SUCCESS [  0.122 s]
[INFO] Core UI Module ..................................... SUCCESS [ 59.434 s]
[INFO] WMS UI Module ...................................... SUCCESS [ 41.908 s]
[INFO] GWC UI Module ...................................... SKIPPED
[INFO] WFS UI Module ...................................... SUCCESS [ 14.853 s]
[INFO] Demos Module ....................................... SUCCESS [ 18.434 s]
[INFO] WCS UI Module ...................................... SUCCESS [ 16.667 s]
[INFO] Security UI Modules ................................ SUCCESS [  0.046 s]
[INFO] Security UI Core Module ............................ SUCCESS [02:37 min]
[INFO] Security UI JDBC Module ............................ SUCCESS [01:47 min]
[INFO] Security UI LDAP Module ............................ SUCCESS [ 18.767 s]
[INFO] REST UI Module ..................................... SUCCESS [ 15.717 s]
[INFO] GeoServer Extensions ............................... SUCCESS [  0.078 s]
[INFO] Printing Module .................................... SUCCESS [  8.052 s]
[INFO] GeoServer Web Application .......................... SKIPPED
[INFO] Community Space .................................... SUCCESS [  0.064 s]
[INFO] Application Schema Support ......................... SUCCESS [  0.031 s]
[INFO] Application Schema Integration Test ................ SUCCESS [03:37 min]
[INFO] Sample DataAccess Integration Test ................. SUCCESS [ 13.928 s]
[INFO] ArcSDE DataStore Extension ......................... SUCCESS [  7.801 s]
[INFO] H2 DataStore Extension ............................. SUCCESS [ 14.686 s]
[INFO] SQL Server DataStore Extension ..................... SUCCESS [  0.732 s]
[INFO] Oracle DataStore Extension ......................... SUCCESS [  0.556 s]
[INFO] MySQL DataStore Extension .......................... SUCCESS [  0.212 s]
[INFO] DB2 DataStore Extension ............................ SUCCESS [  0.215 s]
[INFO] ImageMap Output Format ............................. SUCCESS [  6.600 s]
[INFO] ImageI/O-Ext GDAL Coverage Extension ............... SUCCESS [  1.836 s]
[INFO] JP2K Coverage Extension ............................ SUCCESS [  0.258 s]
[INFO] OGR parent ......................................... SUCCESS [  0.042 s]
[INFO] OGR CORE ........................................... SUCCESS [  0.435 s]
[INFO] OGR WFS ............................................ SUCCESS [ 11.064 s]
[INFO] Web Processing Service parent ...................... SUCCESS [  0.023 s]
[INFO] Web Processing Service Module ...................... SUCCESS [01:55 min]
[INFO] OGR WPS ............................................ SUCCESS [  9.970 s]
[INFO] Excel Output Format ................................ SUCCESS [ 17.935 s]
[INFO] Chart external graphics support .................... SUCCESS [  0.390 s]
[INFO] Feature Generalization Extension ................... SUCCESS [  0.693 s]
[INFO] Image Mosaic JDBC Extension ........................ SUCCESS [  0.387 s]
[INFO] OWS request flow controller ........................ SUCCESS [ 11.086 s]
[INFO] Web process status sharing with Hazelcast .......... SUCCESS [ 12.666 s]
[INFO] Web Processing Service GUI ......................... SUCCESS [ 49.756 s]
[INFO] GeoServer Layer Querying filter functions .......... SUCCESS [ 20.169 s]
[INFO] Teradata DataStore Extension ....................... SUCCESS [  0.554 s]
[INFO] GeoServer Monitor Extensions ....................... SUCCESS [  0.056 s]
[INFO] Core Monitor Extension ............................. SKIPPED
[INFO] GeoServer Security Extension Modules ............... SUCCESS [  0.096 s]
[INFO] GeoServer CAS Security Module ...................... SUCCESS [  3.828 s]
[INFO] GeoServer Security Extension Web Modules ........... SUCCESS [  0.050 s]
[INFO] GeoServer CAS Security Web Module .................. SUCCESS [  0.827 s]
[INFO] XLST based WFS output format ....................... SUCCESS [ 20.373 s]
[INFO] GeoServer INSPIRE Extensions ....................... SKIPPED
[INFO] GeoServer CSS Styling .............................. SUCCESS [ 21.709 s]
[INFO] Catalog Services for the Web parent ................ SUCCESS [  0.045 s]
[INFO] Catalog Services for the Web interfaces ............ SUCCESS [  8.986 s]
[INFO] Catalog Services for the Web - Simple CatalogStore implementation SUCCESS [  8.746 s]
[INFO] Catalog Services for the Web core module ........... SUCCESS [ 48.173 s]
[INFO] CSW UI Module ...................................... SUCCESS [  9.685 s]
[INFO] DXF WFS output format and WPS PPIO ................. SUCCESS [  0.052 s]
[INFO] DXF WFS output format .............................. SUCCESS [ 15.958 s]
[INFO] DXF WPS PPIO ....................................... SUCCESS [  9.495 s]
[INFO] GeoServer WCS 2.0 Earth Observation Extensions ..... SUCCESS [  0.023 s]
[INFO] Web Coverage Service 2.0 Earth Observation extensions SUCCESS [ 19.490 s]
[INFO] Web Coverage Service 2.0 Earth Observation GUI extension SUCCESS [ 15.879 s]
[INFO] GeoServer libjpeg-turbo Module ..................... SUCCESS [ 10.650 s]
[INFO] GeoServer Data Importer ............................ SUCCESS [  0.069 s]
[INFO] Importer Core Module ............................... SUCCESS [01:02 min]
[INFO] Importer REST Api Module-ng ........................ SUCCESS [ 57.556 s]
[INFO] Importer Berkley DB Persistence Module ............. SUCCESS [ 19.957 s]
[INFO] Importer Web UI Module ............................. SUCCESS [ 17.036 s]
[INFO] GRIB Coverage Format ............................... SUCCESS [ 20.712 s]
[INFO] NetCDF Coverage format ............................. SUCCESS [ 26.049 s]
[INFO] WCS NetCDF output Module ........................... SUCCESS [ 56.143 s]
[INFO] Vector Tiles ....................................... SUCCESS [ 19.529 s]
[INFO] Ysld GeoServer Plugin .............................. SKIPPED
[INFO] MongoDB Data Store ................................. SUCCESS [  1.332 s]
[INFO] REST SLD service ................................... SUCCESS [ 27.281 s]
[INFO] GeoFence security integration ...................... SUCCESS [ 32.743 s]
[INFO] GeoFence Server .................................... SUCCESS [ 54.259 s]
[INFO] ------------------------------------------------------------------------
[INFO] BUILD FAILURE
[INFO] ------------------------------------------------------------------------
[INFO] Total time:  20:36 min (Wall Clock)
[INFO] Finished at: 2019-02-07T14:37:50Z
[INFO] ------------------------------------------------------------------------
[ERROR] Failed to execute goal org.apache.maven.plugins:maven-surefire-plugin:2.12.3:test (default-test) on project gs-gwc: There are test failures.
[ERROR]
[ERROR] Please refer to <https://build.geoserver.org/job/geoserver-master/ws/src/gwc/target/surefire-reports> for the individual test results.
[ERROR] -> [Help 1]
[ERROR]
[ERROR] To see the full stack trace of the errors, re-run Maven with the -e switch.
[ERROR] Re-run Maven using the -X switch to enable full debug logging.
[ERROR]
[ERROR] For more information about the errors and possible solutions, please read the following articles:
[ERROR] [Help 1] http://cwiki.apache.org/confluence/display/MAVEN/MojoFailureException
[ERROR]
[ERROR] After correcting the problems, you can resume the build with the command
[ERROR]   mvn <goals> -rf :gs-gwc
Build step 'Invoke top-level Maven targets' marked build as failure
Not sending mail to unregistered user [hidden email]


_______________________________________________
Geoserver-devel mailing list
[hidden email]
https://lists.sourceforge.net/lists/listinfo/geoserver-devel
Reply | Threaded
Open this post in threaded view
|

Jenkins build is back to normal : geoserver-master #6536

monitor