Build failed in Jenkins: geoserver-master #6525

classic Classic list List threaded Threaded
2 messages Options
Reply | Threaded
Open this post in threaded view
|

Build failed in Jenkins: geoserver-master #6525

monitor
See <https://build.geoserver.org/job/geoserver-master/6525/display/redirect>

------------------------------------------
[...truncated 1.22 MB...]
        at org.junit.internal.runners.model.ReflectiveCallable.run(ReflectiveCallable.java:12)
        at org.junit.runners.model.FrameworkMethod.invokeExplosively(FrameworkMethod.java:47)
        at org.junit.internal.runners.statements.InvokeMethod.evaluate(InvokeMethod.java:17)
        at org.junit.internal.runners.statements.RunBefores.evaluate(RunBefores.java:26)
        at org.junit.internal.runners.statements.RunAfters.evaluate(RunAfters.java:27)
        at org.junit.rules.RunRules.evaluate(RunRules.java:20)
        at org.junit.runners.ParentRunner.runLeaf(ParentRunner.java:325)
        at org.junit.runners.BlockJUnit4ClassRunner.runChild(BlockJUnit4ClassRunner.java:78)
        at org.junit.runners.BlockJUnit4ClassRunner.runChild(BlockJUnit4ClassRunner.java:57)
        at org.junit.runners.ParentRunner$3.run(ParentRunner.java:290)
        at org.junit.runners.ParentRunner$1.schedule(ParentRunner.java:71)
        at org.junit.runners.ParentRunner.runChildren(ParentRunner.java:288)
        at org.junit.runners.ParentRunner.access$000(ParentRunner.java:58)
        at org.junit.runners.ParentRunner$2.evaluate(ParentRunner.java:268)
        at org.junit.internal.runners.statements.RunBefores.evaluate(RunBefores.java:26)
        at org.junit.internal.runners.statements.RunAfters.evaluate(RunAfters.java:27)
        at org.junit.runners.ParentRunner.run(ParentRunner.java:363)
        at org.apache.maven.surefire.junit4.JUnit4Provider.execute(JUnit4Provider.java:252)
        at org.apache.maven.surefire.junit4.JUnit4Provider.executeTestSet(JUnit4Provider.java:141)
        at org.apache.maven.surefire.junit4.JUnit4Provider.invoke(JUnit4Provider.java:112)
        at sun.reflect.NativeMethodAccessorImpl.invoke0(Native Method)
        at sun.reflect.NativeMethodAccessorImpl.invoke(NativeMethodAccessorImpl.java:62)
        at sun.reflect.DelegatingMethodAccessorImpl.invoke(DelegatingMethodAccessorImpl.java:43)
        at java.lang.reflect.Method.invoke(Method.java:498)
        at org.apache.maven.surefire.util.ReflectionUtils.invokeMethodWithArray(ReflectionUtils.java:189)
        at org.apache.maven.surefire.booter.ProviderFactory$ProviderProxy.invoke(ProviderFactory.java:165)
        at org.apache.maven.surefire.booter.ProviderFactory.invokeProvider(ProviderFactory.java:85)
        at org.apache.maven.surefire.booter.ForkedBooter.runSuitesInProcess(ForkedBooter.java:115)
        at org.apache.maven.surefire.booter.ForkedBooter.main(ForkedBooter.java:75)

Feb 03, 2019 3:09:32 PM org.geoserver.importer.Importer init
SEVERE: Failed to init the context
java.lang.NullPointerException
        at org.geoserver.importer.SpatialFile.prepare(SpatialFile.java:103)
        at org.geoserver.importer.Importer.addTasks(Importer.java:472)
        at org.geoserver.importer.Importer.init(Importer.java:440)
        at org.geoserver.importer.rest.ImportController.createImport(ImportController.java:221)
        at org.geoserver.importer.rest.ImportController.postImports(ImportController.java:72)
        at sun.reflect.GeneratedMethodAccessor297.invoke(Unknown Source)
        at sun.reflect.DelegatingMethodAccessorImpl.invoke(DelegatingMethodAccessorImpl.java:43)
        at java.lang.reflect.Method.invoke(Method.java:498)
        at org.springframework.web.method.support.InvocableHandlerMethod.doInvoke(InvocableHandlerMethod.java:207)
        at org.springframework.web.method.support.InvocableHandlerMethod.invokeForRequest(InvocableHandlerMethod.java:137)
        at org.springframework.web.servlet.mvc.method.annotation.ServletInvocableHandlerMethod.invokeAndHandle(ServletInvocableHandlerMethod.java:102)
        at org.springframework.web.servlet.mvc.method.annotation.RequestMappingHandlerAdapter.invokeHandlerMethod(RequestMappingHandlerAdapter.java:895)
        at org.springframework.web.servlet.mvc.method.annotation.RequestMappingHandlerAdapter.handleInternal(RequestMappingHandlerAdapter.java:800)
        at org.springframework.web.servlet.mvc.method.AbstractHandlerMethodAdapter.handle(AbstractHandlerMethodAdapter.java:87)
        at org.springframework.web.servlet.DispatcherServlet.doDispatch(DispatcherServlet.java:1038)
        at org.springframework.web.servlet.DispatcherServlet.doService(DispatcherServlet.java:942)
        at org.springframework.web.servlet.FrameworkServlet.processRequest(FrameworkServlet.java:998)
        at org.springframework.web.servlet.FrameworkServlet.doPost(FrameworkServlet.java:901)
        at javax.servlet.http.HttpServlet.service(HttpServlet.java:688)
        at org.springframework.web.servlet.FrameworkServlet.service(FrameworkServlet.java:875)
        at javax.servlet.http.HttpServlet.service(HttpServlet.java:770)
        at org.geoserver.test.GeoServerSystemTestSupport$2.service(GeoServerSystemTestSupport.java:1636)
        at javax.servlet.http.HttpServlet.service(HttpServlet.java:770)
        at org.springframework.mock.web.MockFilterChain$ServletFilterProxy.doFilter(MockFilterChain.java:166)
        at org.springframework.mock.web.MockFilterChain.doFilter(MockFilterChain.java:133)
        at org.geoserver.test.GeoServerSystemTestSupport.dispatch(GeoServerSystemTestSupport.java:1665)
        at org.geoserver.test.GeoServerSystemTestSupport.dispatch(GeoServerSystemTestSupport.java:1576)
        at org.geoserver.test.GeoServerSystemTestSupport.dispatch(GeoServerSystemTestSupport.java:1564)
        at org.geoserver.test.GeoServerSystemTestSupport.postAsServletResponse(GeoServerSystemTestSupport.java:1212)
        at org.geoserver.importer.rest.ImporterIntegrationTest.testDirectWrongDir(ImporterIntegrationTest.java:206)
        at sun.reflect.NativeMethodAccessorImpl.invoke0(Native Method)
        at sun.reflect.NativeMethodAccessorImpl.invoke(NativeMethodAccessorImpl.java:62)
        at sun.reflect.DelegatingMethodAccessorImpl.invoke(DelegatingMethodAccessorImpl.java:43)
        at java.lang.reflect.Method.invoke(Method.java:498)
        at org.junit.runners.model.FrameworkMethod$1.runReflectiveCall(FrameworkMethod.java:50)
        at org.junit.internal.runners.model.ReflectiveCallable.run(ReflectiveCallable.java:12)
        at org.junit.runners.model.FrameworkMethod.invokeExplosively(FrameworkMethod.java:47)
        at org.junit.internal.runners.statements.InvokeMethod.evaluate(InvokeMethod.java:17)
        at org.junit.internal.runners.statements.RunBefores.evaluate(RunBefores.java:26)
        at org.junit.internal.runners.statements.RunAfters.evaluate(RunAfters.java:27)
        at org.junit.rules.RunRules.evaluate(RunRules.java:20)
        at org.junit.runners.ParentRunner.runLeaf(ParentRunner.java:325)
        at org.junit.runners.BlockJUnit4ClassRunner.runChild(BlockJUnit4ClassRunner.java:78)
        at org.junit.runners.BlockJUnit4ClassRunner.runChild(BlockJUnit4ClassRunner.java:57)
        at org.junit.runners.ParentRunner$3.run(ParentRunner.java:290)
        at org.junit.runners.ParentRunner$1.schedule(ParentRunner.java:71)
        at org.junit.runners.ParentRunner.runChildren(ParentRunner.java:288)
        at org.junit.runners.ParentRunner.access$000(ParentRunner.java:58)
        at org.junit.runners.ParentRunner$2.evaluate(ParentRunner.java:268)
        at org.junit.internal.runners.statements.RunBefores.evaluate(RunBefores.java:26)
        at org.junit.internal.runners.statements.RunAfters.evaluate(RunAfters.java:27)
        at org.junit.runners.ParentRunner.run(ParentRunner.java:363)
        at org.apache.maven.surefire.junit4.JUnit4Provider.execute(JUnit4Provider.java:252)
        at org.apache.maven.surefire.junit4.JUnit4Provider.executeTestSet(JUnit4Provider.java:141)
        at org.apache.maven.surefire.junit4.JUnit4Provider.invoke(JUnit4Provider.java:112)
        at sun.reflect.NativeMethodAccessorImpl.invoke0(Native Method)
        at sun.reflect.NativeMethodAccessorImpl.invoke(NativeMethodAccessorImpl.java:62)
        at sun.reflect.DelegatingMethodAccessorImpl.invoke(DelegatingMethodAccessorImpl.java:43)
        at java.lang.reflect.Method.invoke(Method.java:498)
        at org.apache.maven.surefire.util.ReflectionUtils.invokeMethodWithArray(ReflectionUtils.java:189)
        at org.apache.maven.surefire.booter.ProviderFactory$ProviderProxy.invoke(ProviderFactory.java:165)
        at org.apache.maven.surefire.booter.ProviderFactory.invokeProvider(ProviderFactory.java:85)
        at org.apache.maven.surefire.booter.ForkedBooter.runSuitesInProcess(ForkedBooter.java:115)
        at org.apache.maven.surefire.booter.ForkedBooter.main(ForkedBooter.java:75)

Tests run: 17, Failures: 0, Errors: 0, Skipped: 0, Time elapsed: 20.284 sec
Running org.geoserver.importer.rest.PostScriptTransformTest
Tests run: 1, Failures: 0, Errors: 0, Skipped: 0, Time elapsed: 0.019 sec
Running org.geoserver.importer.rest.converters.ImportJSONIOTest
Tests run: 4, Failures: 0, Errors: 0, Skipped: 0, Time elapsed: 0.825 sec

Results :

Tests run: 76, Failures: 0, Errors: 0, Skipped: 0

[INFO]
[INFO] --- maven-jar-plugin:2.4:jar (default-jar) @ gs-importer-rest ---
[INFO] Building jar: <https://build.geoserver.org/job/geoserver-master/ws/src/extension/importer/rest/target/gs-importer-rest-2.16-SNAPSHOT.jar>
[INFO]
[INFO] --- maven-jar-plugin:2.4:test-jar (default) @ gs-importer-rest ---
[INFO] Building jar: <https://build.geoserver.org/job/geoserver-master/ws/src/extension/importer/rest/target/gs-importer-rest-2.16-SNAPSHOT-tests.jar>
[INFO]
[INFO] --- maven-source-plugin:2.2.1:jar-no-fork (attach-sources) @ gs-importer-rest ---
[INFO] Building jar: <https://build.geoserver.org/job/geoserver-master/ws/src/extension/importer/rest/target/gs-importer-rest-2.16-SNAPSHOT-sources.jar>
[INFO]
[INFO] --- maven-source-plugin:2.2.1:test-jar-no-fork (attach-sources) @ gs-importer-rest ---
[INFO] Building jar: <https://build.geoserver.org/job/geoserver-master/ws/src/extension/importer/rest/target/gs-importer-rest-2.16-SNAPSHOT-test-sources.jar>
[INFO]
[INFO] --- maven-install-plugin:2.4:install (default-install) @ gs-importer-rest ---
[INFO] Installing <https://build.geoserver.org/job/geoserver-master/ws/src/extension/importer/rest/target/gs-importer-rest-2.16-SNAPSHOT.jar> to /var/jenkins/.m2/repository/org/geoserver/importer/gs-importer-rest/2.16-SNAPSHOT/gs-importer-rest-2.16-SNAPSHOT.jar
[INFO] Installing <https://build.geoserver.org/job/geoserver-master/ws/src/extension/importer/rest/pom.xml> to /var/jenkins/.m2/repository/org/geoserver/importer/gs-importer-rest/2.16-SNAPSHOT/gs-importer-rest-2.16-SNAPSHOT.pom
[INFO] Installing <https://build.geoserver.org/job/geoserver-master/ws/src/extension/importer/rest/target/gs-importer-rest-2.16-SNAPSHOT-tests.jar> to /var/jenkins/.m2/repository/org/geoserver/importer/gs-importer-rest/2.16-SNAPSHOT/gs-importer-rest-2.16-SNAPSHOT-tests.jar
[INFO] Installing <https://build.geoserver.org/job/geoserver-master/ws/src/extension/importer/rest/target/gs-importer-rest-2.16-SNAPSHOT-sources.jar> to /var/jenkins/.m2/repository/org/geoserver/importer/gs-importer-rest/2.16-SNAPSHOT/gs-importer-rest-2.16-SNAPSHOT-sources.jar
[INFO] Installing <https://build.geoserver.org/job/geoserver-master/ws/src/extension/importer/rest/target/gs-importer-rest-2.16-SNAPSHOT-test-sources.jar> to /var/jenkins/.m2/repository/org/geoserver/importer/gs-importer-rest/2.16-SNAPSHOT/gs-importer-rest-2.16-SNAPSHOT-test-sources.jar
[INFO] ------------------------------------------------------------------------
[INFO] Reactor Summary for GeoServer 2.16-SNAPSHOT:
[INFO]
[INFO] GeoServer .......................................... SUCCESS [  5.744 s]
[INFO] Core Platform Module ............................... SUCCESS [ 10.752 s]
[INFO] Open Web Service Module ............................ SUCCESS [  6.426 s]
[INFO] Main Module ........................................ SUCCESS [ 51.216 s]
[INFO] GeoServer Security Modules ......................... SUCCESS [  0.090 s]
[INFO] GeoServer Security Tests Module .................... SUCCESS [02:05 min]
[INFO] GeoServer JDBC Security Module ..................... SUCCESS [ 51.768 s]
[INFO] GeoServer LDAP Security Module ..................... SUCCESS [  6.062 s]
[INFO] Web Coverage Service Module ........................ SUCCESS [  0.644 s]
[INFO] Web Coverage Service 1.0 Module .................... SUCCESS [ 34.032 s]
[INFO] Web Coverage Service 1.1 Module .................... SUCCESS [ 27.772 s]
[INFO] Web Coverage Service 2.0 Module .................... SUCCESS [ 52.228 s]
[INFO] Web Feature Service Module ......................... SUCCESS [02:06 min]
[INFO] Web Map Service Module ............................. SUCCESS [02:56 min]
[INFO] KML support for GeoServer .......................... SUCCESS [ 39.002 s]
[INFO] gs-rest ............................................ SUCCESS [  9.102 s]
[INFO] GeoWebCache (GWC) Module ........................... FAILURE [01:40 min]
[INFO] gs-restconfig ...................................... SUCCESS [01:47 min]
[INFO] gs-restconfig-wcs .................................. SUCCESS [ 22.647 s]
[INFO] gs-restconfig-wfs .................................. SUCCESS [ 30.160 s]
[INFO] gs-restconfig-wms .................................. SUCCESS [ 15.834 s]
[INFO] GeoServer Web Modules .............................. SUCCESS [  0.076 s]
[INFO] Core UI Module ..................................... SUCCESS [01:48 min]
[INFO] WMS UI Module ...................................... SUCCESS [ 51.874 s]
[INFO] GWC UI Module ...................................... SKIPPED
[INFO] WFS UI Module ...................................... SUCCESS [ 14.581 s]
[INFO] Demos Module ....................................... SUCCESS [ 27.539 s]
[INFO] WCS UI Module ...................................... SUCCESS [ 15.647 s]
[INFO] Security UI Modules ................................ SUCCESS [  0.078 s]
[INFO] Security UI Core Module ............................ SUCCESS [02:37 min]
[INFO] Security UI JDBC Module ............................ SUCCESS [01:43 min]
[INFO] Security UI LDAP Module ............................ SUCCESS [ 12.974 s]
[INFO] REST UI Module ..................................... SUCCESS [ 16.926 s]
[INFO] GeoServer Extensions ............................... SUCCESS [  0.129 s]
[INFO] Printing Module .................................... SUCCESS [ 10.577 s]
[INFO] GeoServer Web Application .......................... SKIPPED
[INFO] Community Space .................................... SUCCESS [  0.115 s]
[INFO] Application Schema Support ......................... SUCCESS [  0.031 s]
[INFO] Application Schema Integration Test ................ SUCCESS [03:47 min]
[INFO] Sample DataAccess Integration Test ................. SUCCESS [ 14.196 s]
[INFO] ArcSDE DataStore Extension ......................... SUCCESS [ 14.047 s]
[INFO] H2 DataStore Extension ............................. SUCCESS [ 15.418 s]
[INFO] SQL Server DataStore Extension ..................... SUCCESS [  0.747 s]
[INFO] Oracle DataStore Extension ......................... SUCCESS [  0.602 s]
[INFO] MySQL DataStore Extension .......................... SUCCESS [  0.209 s]
[INFO] DB2 DataStore Extension ............................ SUCCESS [  0.245 s]
[INFO] ImageMap Output Format ............................. SUCCESS [  7.250 s]
[INFO] ImageI/O-Ext GDAL Coverage Extension ............... SUCCESS [  1.595 s]
[INFO] JP2K Coverage Extension ............................ SUCCESS [  0.238 s]
[INFO] OGR parent ......................................... SUCCESS [  0.037 s]
[INFO] OGR CORE ........................................... SUCCESS [  0.995 s]
[INFO] OGR WFS ............................................ SUCCESS [ 10.285 s]
[INFO] Web Processing Service parent ...................... SUCCESS [  0.028 s]
[INFO] Web Processing Service Module ...................... SUCCESS [01:54 min]
[INFO] OGR WPS ............................................ SUCCESS [ 11.038 s]
[INFO] Excel Output Format ................................ SUCCESS [ 14.385 s]
[INFO] Chart external graphics support .................... SUCCESS [  0.484 s]
[INFO] Feature Generalization Extension ................... SUCCESS [  1.165 s]
[INFO] Image Mosaic JDBC Extension ........................ SUCCESS [  0.483 s]
[INFO] OWS request flow controller ........................ SUCCESS [ 13.538 s]
[INFO] Web process status sharing with Hazelcast .......... SUCCESS [ 14.374 s]
[INFO] Web Processing Service GUI ......................... SUCCESS [ 48.575 s]
[INFO] GeoServer Layer Querying filter functions .......... SUCCESS [ 25.681 s]
[INFO] Teradata DataStore Extension ....................... SUCCESS [  1.178 s]
[INFO] GeoServer Monitor Extensions ....................... SUCCESS [  0.139 s]
[INFO] Core Monitor Extension ............................. SKIPPED
[INFO] GeoServer Security Extension Modules ............... SUCCESS [  0.078 s]
[INFO] GeoServer CAS Security Module ...................... SUCCESS [  5.732 s]
[INFO] GeoServer Security Extension Web Modules ........... SUCCESS [  0.093 s]
[INFO] GeoServer CAS Security Web Module .................. SUCCESS [  0.598 s]
[INFO] XLST based WFS output format ....................... SUCCESS [ 25.218 s]
[INFO] GeoServer INSPIRE Extensions ....................... SKIPPED
[INFO] GeoServer CSS Styling .............................. SUCCESS [ 23.027 s]
[INFO] Catalog Services for the Web parent ................ SUCCESS [  0.133 s]
[INFO] Catalog Services for the Web interfaces ............ SUCCESS [  7.212 s]
[INFO] Catalog Services for the Web - Simple CatalogStore implementation SUCCESS [ 12.424 s]
[INFO] Catalog Services for the Web core module ........... SUCCESS [ 49.764 s]
[INFO] CSW UI Module ...................................... SUCCESS [ 12.548 s]
[INFO] DXF WFS output format and WPS PPIO ................. SUCCESS [  0.038 s]
[INFO] DXF WFS output format .............................. SUCCESS [ 15.276 s]
[INFO] DXF WPS PPIO ....................................... SUCCESS [ 11.479 s]
[INFO] GeoServer WCS 2.0 Earth Observation Extensions ..... SUCCESS [  0.024 s]
[INFO] Web Coverage Service 2.0 Earth Observation extensions SUCCESS [ 25.196 s]
[INFO] Web Coverage Service 2.0 Earth Observation GUI extension SUCCESS [ 14.636 s]
[INFO] GeoServer libjpeg-turbo Module ..................... SUCCESS [ 12.354 s]
[INFO] GeoServer Data Importer ............................ SUCCESS [  0.208 s]
[INFO] Importer Core Module ............................... SUCCESS [01:12 min]
[INFO] Importer REST Api Module-ng ........................ SUCCESS [ 56.055 s]
[INFO] Importer Berkley DB Persistence Module ............. SUCCESS [ 22.332 s]
[INFO] Importer Web UI Module ............................. SUCCESS [ 17.324 s]
[INFO] GRIB Coverage Format ............................... SUCCESS [ 18.614 s]
[INFO] NetCDF Coverage format ............................. SUCCESS [ 30.157 s]
[INFO] WCS NetCDF output Module ........................... SUCCESS [ 49.394 s]
[INFO] Vector Tiles ....................................... SUCCESS [ 21.264 s]
[INFO] Ysld GeoServer Plugin .............................. SKIPPED
[INFO] MongoDB Data Store ................................. SUCCESS [  1.234 s]
[INFO] REST SLD service ................................... SUCCESS [ 27.093 s]
[INFO] GeoFence security integration ...................... SUCCESS [ 30.451 s]
[INFO] GeoFence Server .................................... SUCCESS [ 56.755 s]
[INFO] ------------------------------------------------------------------------
[INFO] BUILD FAILURE
[INFO] ------------------------------------------------------------------------
[INFO] Total time:  23:01 min (Wall Clock)
[INFO] Finished at: 2019-02-03T15:09:33Z
[INFO] ------------------------------------------------------------------------
[ERROR] Failed to execute goal org.apache.maven.plugins:maven-surefire-plugin:2.12.3:test (default-test) on project gs-gwc: There are test failures.
[ERROR]
[ERROR] Please refer to <https://build.geoserver.org/job/geoserver-master/ws/src/gwc/target/surefire-reports> for the individual test results.
[ERROR] -> [Help 1]
[ERROR]
[ERROR] To see the full stack trace of the errors, re-run Maven with the -e switch.
[ERROR] Re-run Maven using the -X switch to enable full debug logging.
[ERROR]
[ERROR] For more information about the errors and possible solutions, please read the following articles:
[ERROR] [Help 1] http://cwiki.apache.org/confluence/display/MAVEN/MojoFailureException
[ERROR]
[ERROR] After correcting the problems, you can resume the build with the command
[ERROR]   mvn <goals> -rf :gs-gwc
Build step 'Invoke top-level Maven targets' marked build as failure


_______________________________________________
Geoserver-devel mailing list
[hidden email]
https://lists.sourceforge.net/lists/listinfo/geoserver-devel
Reply | Threaded
Open this post in threaded view
|

Jenkins build is back to normal : geoserver-master #6526

monitor