Build failed in Jenkins: geoserver-master #5915

Previous Topic Next Topic
 
classic Classic list List threaded Threaded
10 messages Options
Reply | Threaded
Open this post in threaded view
|

Build failed in Jenkins: geoserver-master #5915

monitor
See <https://build.geoserver.org/job/geoserver-master/5915/display/redirect?page=changes>

Changes:

[Kevin Smith] Use prefixed names for style preview

------------------------------------------
[...truncated 11.11 MB...]
        at java.lang.reflect.Method.invoke(Method.java:498)
        at org.apache.maven.surefire.util.ReflectionUtils.invokeMethodWithArray(ReflectionUtils.java:189)
        at org.apache.maven.surefire.booter.ProviderFactory$ProviderProxy.invoke(ProviderFactory.java:165)
        at org.apache.maven.surefire.booter.ProviderFactory.invokeProvider(ProviderFactory.java:85)
        at org.apache.maven.surefire.booter.ForkedBooter.runSuitesInProcess(ForkedBooter.java:115)
        at org.apache.maven.surefire.booter.ForkedBooter.main(ForkedBooter.java:75)
Jun 13, 2018 12:28:57 AM org.geoserver.importer.Importer copyFromFeatureReader
INFO: load to target took 17
Jun 13, 2018 12:28:59 AM org.geoserver.catalog.ResourcePool getFeatureType
WARNING: Error while getting feature type, flushing cache and retrying: Failed to find the datastore factory for dummy, did you forget to install the store extension jar?
Jun 13, 2018 12:29:00 AM org.geoserver.importer.Importer copyFromFeatureReader
INFO: load to target took 16
13 Jun 00:29:00 ERROR [geoserver.rest] - No such import: 0
org.geoserver.rest.RestException 404 NOT_FOUND: No such import: 0
        at org.geoserver.importer.rest.ImportBaseController.context(ImportBaseController.java:43)
        at org.geoserver.importer.rest.ImportBaseController.context(ImportBaseController.java:27)
        at org.geoserver.importer.rest.ImportBaseController.context(ImportBaseController.java:23)
        at org.geoserver.importer.rest.ImportController.getImports(ImportController.java:107)
        at sun.reflect.GeneratedMethodAccessor261.invoke(Unknown Source)
        at sun.reflect.DelegatingMethodAccessorImpl.invoke(DelegatingMethodAccessorImpl.java:43)
        at java.lang.reflect.Method.invoke(Method.java:498)
        at org.springframework.web.method.support.InvocableHandlerMethod.doInvoke(InvocableHandlerMethod.java:205)
        at org.springframework.web.method.support.InvocableHandlerMethod.invokeForRequest(InvocableHandlerMethod.java:133)
        at org.springframework.web.servlet.mvc.method.annotation.ServletInvocableHandlerMethod.invokeAndHandle(ServletInvocableHandlerMethod.java:97)
        at org.springframework.web.servlet.mvc.method.annotation.RequestMappingHandlerAdapter.invokeHandlerMethod(RequestMappingHandlerAdapter.java:827)
        at org.springframework.web.servlet.mvc.method.annotation.RequestMappingHandlerAdapter.handleInternal(RequestMappingHandlerAdapter.java:738)
        at org.springframework.web.servlet.mvc.method.AbstractHandlerMethodAdapter.handle(AbstractHandlerMethodAdapter.java:85)
        at org.springframework.web.servlet.DispatcherServlet.doDispatch(DispatcherServlet.java:967)
        at org.springframework.web.servlet.DispatcherServlet.doService(DispatcherServlet.java:901)
        at org.springframework.web.servlet.FrameworkServlet.processRequest(FrameworkServlet.java:970)
        at org.springframework.web.servlet.FrameworkServlet.doGet(FrameworkServlet.java:861)
        at javax.servlet.http.HttpServlet.service(HttpServlet.java:668)
        at org.springframework.web.servlet.FrameworkServlet.service(FrameworkServlet.java:846)
        at javax.servlet.http.HttpServlet.service(HttpServlet.java:770)
        at org.geoserver.test.GeoServerSystemTestSupport$2.service(GeoServerSystemTestSupport.java:1636)
        at javax.servlet.http.HttpServlet.service(HttpServlet.java:770)
        at org.springframework.mock.web.MockFilterChain$ServletFilterProxy.doFilter(MockFilterChain.java:160)
        at org.springframework.mock.web.MockFilterChain.doFilter(MockFilterChain.java:127)
        at org.geoserver.test.GeoServerSystemTestSupport.dispatch(GeoServerSystemTestSupport.java:1665)
        at org.geoserver.test.GeoServerSystemTestSupport.dispatch(GeoServerSystemTestSupport.java:1576)
        at org.geoserver.test.GeoServerSystemTestSupport.getAsServletResponse(GeoServerSystemTestSupport.java:1048)
        at org.geoserver.test.GeoServerSystemTestSupport.getAsServletResponse(GeoServerSystemTestSupport.java:1031)
        at org.geoserver.importer.rest.ImporterIntegrationTest.testDirectExecuteInternal(ImporterIntegrationTest.java:337)
        at org.geoserver.importer.rest.ImporterIntegrationTest.testDirectExecuteSync(ImporterIntegrationTest.java:255)
        at sun.reflect.NativeMethodAccessorImpl.invoke0(Native Method)
        at sun.reflect.NativeMethodAccessorImpl.invoke(NativeMethodAccessorImpl.java:62)
        at sun.reflect.DelegatingMethodAccessorImpl.invoke(DelegatingMethodAccessorImpl.java:43)
        at java.lang.reflect.Method.invoke(Method.java:498)
        at org.junit.runners.model.FrameworkMethod$1.runReflectiveCall(FrameworkMethod.java:47)
        at org.junit.internal.runners.model.ReflectiveCallable.run(ReflectiveCallable.java:12)
        at org.junit.runners.model.FrameworkMethod.invokeExplosively(FrameworkMethod.java:44)
        at org.junit.internal.runners.statements.InvokeMethod.evaluate(InvokeMethod.java:17)
        at org.junit.internal.runners.statements.RunBefores.evaluate(RunBefores.java:26)
        at org.junit.internal.runners.statements.RunAfters.evaluate(RunAfters.java:27)
        at org.junit.rules.RunRules.evaluate(RunRules.java:20)
        at org.junit.runners.ParentRunner.runLeaf(ParentRunner.java:271)
        at org.junit.runners.BlockJUnit4ClassRunner.runChild(BlockJUnit4ClassRunner.java:70)
        at org.junit.runners.BlockJUnit4ClassRunner.runChild(BlockJUnit4ClassRunner.java:50)
        at org.junit.runners.ParentRunner$3.run(ParentRunner.java:238)
        at org.junit.runners.ParentRunner$1.schedule(ParentRunner.java:63)
        at org.junit.runners.ParentRunner.runChildren(ParentRunner.java:236)
        at org.junit.runners.ParentRunner.access$000(ParentRunner.java:53)
        at org.junit.runners.ParentRunner$2.evaluate(ParentRunner.java:229)
        at org.junit.internal.runners.statements.RunBefores.evaluate(RunBefores.java:26)
        at org.junit.internal.runners.statements.RunAfters.evaluate(RunAfters.java:27)
        at org.junit.runners.ParentRunner.run(ParentRunner.java:309)
        at org.apache.maven.surefire.junit4.JUnit4Provider.execute(JUnit4Provider.java:252)
        at org.apache.maven.surefire.junit4.JUnit4Provider.executeTestSet(JUnit4Provider.java:141)
        at org.apache.maven.surefire.junit4.JUnit4Provider.invoke(JUnit4Provider.java:112)
        at sun.reflect.NativeMethodAccessorImpl.invoke0(Native Method)
        at sun.reflect.NativeMethodAccessorImpl.invoke(NativeMethodAccessorImpl.java:62)
        at sun.reflect.DelegatingMethodAccessorImpl.invoke(DelegatingMethodAccessorImpl.java:43)
        at java.lang.reflect.Method.invoke(Method.java:498)
        at org.apache.maven.surefire.util.ReflectionUtils.invokeMethodWithArray(ReflectionUtils.java:189)
        at org.apache.maven.surefire.booter.ProviderFactory$ProviderProxy.invoke(ProviderFactory.java:165)
        at org.apache.maven.surefire.booter.ProviderFactory.invokeProvider(ProviderFactory.java:85)
        at org.apache.maven.surefire.booter.ForkedBooter.runSuitesInProcess(ForkedBooter.java:115)
        at org.apache.maven.surefire.booter.ForkedBooter.main(ForkedBooter.java:75)
Jun 13, 2018 12:29:01 AM org.geoserver.importer.Importer copyFromFeatureReader
INFO: load to target took 14
Jun 13, 2018 12:29:01 AM org.geoserver.catalog.ResourcePool getFeatureType
WARNING: Error while getting feature type, flushing cache and retrying: Failed to find the datastore factory for dummy, did you forget to install the store extension jar?
Jun 13, 2018 12:29:02 AM org.geoserver.catalog.ResourcePool getFeatureType
WARNING: Error while getting feature type, flushing cache and retrying: Failed to find the datastore factory for dummy, did you forget to install the store extension jar?
Jun 13, 2018 12:29:02 AM org.geoserver.catalog.ResourcePool getFeatureType
WARNING: Error while getting feature type, flushing cache and retrying: Failed to find the datastore factory for dummy, did you forget to install the store extension jar?
Tests run: 14, Failures: 0, Errors: 0, Skipped: 0, Time elapsed: 13.645 sec
Running org.geoserver.importer.rest.PostScriptTransformTest
Tests run: 1, Failures: 0, Errors: 0, Skipped: 0, Time elapsed: 0.02 sec
Running org.geoserver.importer.rest.converters.ImportJSONIOTest
Jun 13, 2018 12:29:02 AM org.geoserver.platform.GeoServerExtensions checkContext
WARNING: Extension lookup 'GeoServerSecurityProvider', but ApplicationContext is unset.
Jun 13, 2018 12:29:02 AM org.geoserver.platform.GeoServerExtensions checkContext
WARNING: Extension lookup 'ExtensionFilter', but ApplicationContext is unset.
Jun 13, 2018 12:29:02 AM org.geoserver.platform.GeoServerExtensions checkContext
WARNING: Extension lookup 'ExtensionProvider', but ApplicationContext is unset.
Jun 13, 2018 12:29:02 AM org.geoserver.platform.GeoServerExtensions checkContext
WARNING: Extension lookup 'ExtensionFilter', but ApplicationContext is unset.
Jun 13, 2018 12:29:03 AM org.geoserver.importer.Importer createContextStore
INFO: Enabling import store: memory
Tests run: 4, Failures: 0, Errors: 0, Skipped: 0, Time elapsed: 0.842 sec

Results :

Tests run: 73, Failures: 0, Errors: 0, Skipped: 0

[INFO]
[INFO] --- maven-jar-plugin:2.4:jar (default-jar) @ gs-importer-rest ---
[INFO] Building jar: <https://build.geoserver.org/job/geoserver-master/ws/src/extension/importer/rest/target/gs-importer-rest-2.14-SNAPSHOT.jar>
[INFO]
[INFO] --- maven-jar-plugin:2.4:test-jar (default) @ gs-importer-rest ---
[INFO] Building jar: <https://build.geoserver.org/job/geoserver-master/ws/src/extension/importer/rest/target/gs-importer-rest-2.14-SNAPSHOT-tests.jar>
[INFO]
[INFO] --- maven-source-plugin:2.2.1:jar-no-fork (attach-sources) @ gs-importer-rest ---
[INFO] Building jar: <https://build.geoserver.org/job/geoserver-master/ws/src/extension/importer/rest/target/gs-importer-rest-2.14-SNAPSHOT-sources.jar>
[INFO]
[INFO] --- maven-source-plugin:2.2.1:test-jar-no-fork (attach-sources) @ gs-importer-rest ---
[INFO] Building jar: <https://build.geoserver.org/job/geoserver-master/ws/src/extension/importer/rest/target/gs-importer-rest-2.14-SNAPSHOT-test-sources.jar>
[INFO]
[INFO] --- fmt-maven-plugin:2.4.0:check (default) @ gs-importer-rest ---
[debug] Using AOSP style
[INFO] Processed 30 files (0 non-complying).
[INFO]
[INFO] --- maven-install-plugin:2.4:install (default-install) @ gs-importer-rest ---
[INFO] Installing <https://build.geoserver.org/job/geoserver-master/ws/src/extension/importer/rest/target/gs-importer-rest-2.14-SNAPSHOT.jar> to /var/jenkins/.m2/repository/org/geoserver/importer/gs-importer-rest/2.14-SNAPSHOT/gs-importer-rest-2.14-SNAPSHOT.jar
[INFO] Installing <https://build.geoserver.org/job/geoserver-master/ws/src/extension/importer/rest/pom.xml> to /var/jenkins/.m2/repository/org/geoserver/importer/gs-importer-rest/2.14-SNAPSHOT/gs-importer-rest-2.14-SNAPSHOT.pom
[INFO] Installing <https://build.geoserver.org/job/geoserver-master/ws/src/extension/importer/rest/target/gs-importer-rest-2.14-SNAPSHOT-tests.jar> to /var/jenkins/.m2/repository/org/geoserver/importer/gs-importer-rest/2.14-SNAPSHOT/gs-importer-rest-2.14-SNAPSHOT-tests.jar
[INFO] Installing <https://build.geoserver.org/job/geoserver-master/ws/src/extension/importer/rest/target/gs-importer-rest-2.14-SNAPSHOT-sources.jar> to /var/jenkins/.m2/repository/org/geoserver/importer/gs-importer-rest/2.14-SNAPSHOT/gs-importer-rest-2.14-SNAPSHOT-sources.jar
[INFO] Installing <https://build.geoserver.org/job/geoserver-master/ws/src/extension/importer/rest/target/gs-importer-rest-2.14-SNAPSHOT-test-sources.jar> to /var/jenkins/.m2/repository/org/geoserver/importer/gs-importer-rest/2.14-SNAPSHOT/gs-importer-rest-2.14-SNAPSHOT-test-sources.jar
[INFO] ------------------------------------------------------------------------
[INFO] Reactor Summary:
[INFO]
[INFO] GeoServer .......................................... SUCCESS [  6.037 s]
[INFO] Core Platform Module ............................... SUCCESS [ 12.734 s]
[INFO] Open Web Service Module ............................ SUCCESS [ 11.231 s]
[INFO] Main Module ........................................ SUCCESS [01:02 min]
[INFO] GeoServer Security Modules ......................... SUCCESS [  0.058 s]
[INFO] GeoServer Security Tests Module .................... SUCCESS [01:17 min]
[INFO] GeoServer JDBC Security Module ..................... SUCCESS [ 35.037 s]
[INFO] GeoServer LDAP Security Module ..................... SUCCESS [ 21.598 s]
[INFO] Web Coverage Service Module ........................ SUCCESS [  4.300 s]
[INFO] Web Coverage Service 1.0 Module .................... SUCCESS [ 15.645 s]
[INFO] Web Coverage Service 1.1 Module .................... SUCCESS [ 18.562 s]
[INFO] Web Coverage Service 2.0 Module .................... SUCCESS [ 39.153 s]
[INFO] Web Feature Service Module ......................... SUCCESS [01:36 min]
[INFO] Web Map Service Module ............................. SUCCESS [01:55 min]
[INFO] KML support for GeoServer .......................... SUCCESS [ 28.523 s]
[INFO] gs-rest ............................................ SUCCESS [ 16.564 s]
[INFO] GeoWebCache (GWC) Module ........................... FAILURE [02:19 min]
[INFO] gs-restconfig ...................................... SUCCESS [01:22 min]
[INFO] gs-restconfig-wcs .................................. SUCCESS [ 19.356 s]
[INFO] gs-restconfig-wfs .................................. SUCCESS [ 17.907 s]
[INFO] gs-restconfig-wms .................................. SUCCESS [ 12.514 s]
[INFO] GeoServer Web Modules .............................. SUCCESS [  0.068 s]
[INFO] Core UI Module ..................................... SUCCESS [01:08 min]
[INFO] WMS UI Module ...................................... SUCCESS [ 30.993 s]
[INFO] GWC UI Module ...................................... SKIPPED
[INFO] WFS UI Module ...................................... SUCCESS [ 10.278 s]
[INFO] Demos Module ....................................... SUCCESS [ 17.092 s]
[INFO] WCS UI Module ...................................... SUCCESS [ 11.888 s]
[INFO] Security UI Modules ................................ SUCCESS [  0.099 s]
[INFO] Security UI Core Module ............................ SUCCESS [01:35 min]
[INFO] Security UI JDBC Module ............................ SUCCESS [01:12 min]
[INFO] Security UI LDAP Module ............................ SUCCESS [ 18.497 s]
[INFO] REST UI Module ..................................... SUCCESS [ 10.356 s]
[INFO] GeoServer Extensions ............................... SUCCESS [  0.037 s]
[INFO] Printing Module .................................... SUCCESS [ 13.170 s]
[INFO] GeoServer Web Application .......................... SKIPPED
[INFO] Community Space .................................... SUCCESS [  0.062 s]
[INFO] Application Schema Support ......................... SUCCESS [  0.036 s]
[INFO] Application Schema Integration Test ................ SUCCESS [02:26 min]
[INFO] Sample DataAccess Integration Test ................. SUCCESS [  9.741 s]
[INFO] ArcSDE DataStore Extension ......................... SUCCESS [ 11.242 s]
[INFO] H2 DataStore Extension ............................. SUCCESS [ 10.751 s]
[INFO] SQL Server DataStore Extension ..................... SUCCESS [  0.907 s]
[INFO] Oracle DataStore Extension ......................... SUCCESS [  0.392 s]
[INFO] MySQL DataStore Extension .......................... SUCCESS [  0.204 s]
[INFO] DB2 DataStore Extension ............................ SUCCESS [  0.194 s]
[INFO] ImageMap Output Format ............................. SUCCESS [  7.465 s]
[INFO] ImageI/O-Ext GDAL Coverage Extension ............... SUCCESS [  4.163 s]
[INFO] JP2K Coverage Extension ............................ SUCCESS [  0.278 s]
[INFO] OGR parent ......................................... SUCCESS [  0.060 s]
[INFO] OGR CORE ........................................... SUCCESS [  2.033 s]
[INFO] OGR WFS ............................................ SUCCESS [  9.091 s]
[INFO] Web Processing Service parent ...................... SUCCESS [  0.020 s]
[INFO] Web Processing Service Module ...................... SUCCESS [01:09 min]
[INFO] OGR WPS ............................................ SUCCESS [ 11.029 s]
[INFO] Excel Output Format ................................ SUCCESS [ 11.920 s]
[INFO] Chart external graphics support .................... SUCCESS [  0.553 s]
[INFO] Feature Generalization Extension ................... SUCCESS [  2.129 s]
[INFO] Image Mosaic JDBC Extension ........................ SUCCESS [  0.519 s]
[INFO] OWS request flow controller ........................ SUCCESS [ 17.991 s]
[INFO] Web process status sharing with Hazelcast .......... SUCCESS [ 18.077 s]
[INFO] Web Processing Service GUI ......................... SUCCESS [ 23.687 s]
[INFO] GeoServer Layer Querying filter functions .......... SUCCESS [ 13.156 s]
[INFO] Teradata DataStore Extension ....................... SUCCESS [  1.998 s]
[INFO] GeoServer Monitor Extensions ....................... SUCCESS [  0.048 s]
[INFO] Core Monitor Extension ............................. SKIPPED
[INFO] GeoServer Security Extension Modules ............... SUCCESS [  0.025 s]
[INFO] GeoServer CAS Security Module ...................... SUCCESS [  6.457 s]
[INFO] GeoServer Security Extension Web Modules ........... SUCCESS [  0.026 s]
[INFO] GeoServer CAS Security Web Module .................. SUCCESS [  2.403 s]
[INFO] XLST based WFS output format ....................... SUCCESS [ 17.616 s]
[INFO] GeoServer INSPIRE Extensions ....................... SKIPPED
[INFO] GeoServer CSS Styling .............................. SUCCESS [ 15.362 s]
[INFO] Catalog Services for the Web parent ................ SUCCESS [  0.078 s]
[INFO] Catalog Services for the Web interfaces ............ SUCCESS [  8.798 s]
[INFO] Catalog Services for the Web - Simple CatalogStore implementation SUCCESS [  8.194 s]
[INFO] Catalog Services for the Web core module ........... SUCCESS [ 31.037 s]
[INFO] CSW UI Module ...................................... SUCCESS [ 10.918 s]
[INFO] DXF WFS output format and WPS PPIO ................. SUCCESS [  0.050 s]
[INFO] DXF WFS output format .............................. SUCCESS [ 11.557 s]
[INFO] DXF WPS PPIO ....................................... SUCCESS [  8.537 s]
[INFO] GeoServer WCS 2.0 Earth Observation Extensions ..... SUCCESS [  0.049 s]
[INFO] Web Coverage Service 2.0 Earth Observation extensions SUCCESS [ 16.190 s]
[INFO] Web Coverage Service 2.0 Earth Observation GUI extension SUCCESS [ 13.242 s]
[INFO] GeoServer libjpeg-turbo Module ..................... SUCCESS [  8.462 s]
[INFO] GeoServer Data Importer ............................ SUCCESS [  0.053 s]
[INFO] Importer Core Module ............................... SUCCESS [ 47.756 s]
[INFO] Importer REST Api Module-ng ........................ SUCCESS [ 41.052 s]
[INFO] Importer Berkley DB Persistence Module ............. SUCCESS [ 15.003 s]
[INFO] Importer Web UI Module ............................. SUCCESS [ 13.482 s]
[INFO] GRIB Coverage Format ............................... SUCCESS [ 14.466 s]
[INFO] NetCDF Coverage format ............................. SUCCESS [ 15.530 s]
[INFO] WCS NetCDF output Module ........................... SUCCESS [ 51.561 s]
[INFO] Vector Tiles ....................................... SUCCESS [ 13.839 s]
[INFO] Ysld GeoServer Plugin .............................. SKIPPED
[INFO] MongoDB Data Store ................................. SUCCESS [  1.828 s]
[INFO] ------------------------------------------------------------------------
[INFO] BUILD FAILURE
[INFO] ------------------------------------------------------------------------
[INFO] Total time: 16:52 min (Wall Clock)
[INFO] Finished at: 2018-06-13T00:29:03+00:00
[INFO] Final Memory: 141M/1518M
[INFO] ------------------------------------------------------------------------
[ERROR] Failed to execute goal org.apache.maven.plugins:maven-surefire-plugin:2.12.3:test (default-test) on project gs-gwc: There are test failures.
[ERROR]
[ERROR] Please refer to <https://build.geoserver.org/job/geoserver-master/ws/src/gwc/target/surefire-reports> for the individual test results.
[ERROR] -> [Help 1]
[ERROR]
[ERROR] To see the full stack trace of the errors, re-run Maven with the -e switch.
[ERROR] Re-run Maven using the -X switch to enable full debug logging.
[ERROR]
[ERROR] For more information about the errors and possible solutions, please read the following articles:
[ERROR] [Help 1] http://cwiki.apache.org/confluence/display/MAVEN/MojoFailureException
[ERROR]
[ERROR] After correcting the problems, you can resume the build with the command
[ERROR]   mvn <goals> -rf :gs-gwc
Build step 'Invoke top-level Maven targets' marked build as failure

------------------------------------------------------------------------------
Check out the vibrant tech community on one of the world's most
engaging tech sites, Slashdot.org! http://sdm.link/slashdot
_______________________________________________
Geoserver-devel mailing list
[hidden email]
https://lists.sourceforge.net/lists/listinfo/geoserver-devel
Reply | Threaded
Open this post in threaded view
|

Build failed in Jenkins: geoserver-master #5916

monitor
See <https://build.geoserver.org/job/geoserver-master/5916/display/redirect>

------------------------------------------
[...truncated 11.12 MB...]
[INFO]
[INFO] --- maven-install-plugin:2.4:install (default-install) @ gs-web-sec-cas ---
[INFO] Installing <https://build.geoserver.org/job/geoserver-master/ws/src/extension/security/web/web-cas/target/gs-web-sec-cas-2.14-SNAPSHOT.jar> to /var/jenkins/.m2/repository/org/geoserver/security/gs-web-sec-cas/2.14-SNAPSHOT/gs-web-sec-cas-2.14-SNAPSHOT.jar
[INFO] Installing <https://build.geoserver.org/job/geoserver-master/ws/src/extension/security/web/web-cas/pom.xml> to /var/jenkins/.m2/repository/org/geoserver/security/gs-web-sec-cas/2.14-SNAPSHOT/gs-web-sec-cas-2.14-SNAPSHOT.pom
[INFO] Installing <https://build.geoserver.org/job/geoserver-master/ws/src/extension/security/web/web-cas/target/gs-web-sec-cas-2.14-SNAPSHOT-tests.jar> to /var/jenkins/.m2/repository/org/geoserver/security/gs-web-sec-cas/2.14-SNAPSHOT/gs-web-sec-cas-2.14-SNAPSHOT-tests.jar
[INFO] Installing <https://build.geoserver.org/job/geoserver-master/ws/src/extension/security/web/web-cas/target/gs-web-sec-cas-2.14-SNAPSHOT-sources.jar> to /var/jenkins/.m2/repository/org/geoserver/security/gs-web-sec-cas/2.14-SNAPSHOT/gs-web-sec-cas-2.14-SNAPSHOT-sources.jar
Jun 13, 2018 12:50:18 AM org.geoserver.importer.Importer copyFromFeatureReader
INFO: load to target took 20
Jun 13, 2018 12:50:20 AM org.geoserver.catalog.ResourcePool getFeatureType
WARNING: Error while getting feature type, flushing cache and retrying: Failed to find the datastore factory for dummy, did you forget to install the store extension jar?
Jun 13, 2018 12:50:20 AM org.geoserver.importer.Importer copyFromFeatureReader
INFO: load to target took 15
13 Jun 00:50:21 ERROR [geoserver.rest] - No such import: 0
org.geoserver.rest.RestException 404 NOT_FOUND: No such import: 0
        at org.geoserver.importer.rest.ImportBaseController.context(ImportBaseController.java:43)
        at org.geoserver.importer.rest.ImportBaseController.context(ImportBaseController.java:27)
        at org.geoserver.importer.rest.ImportBaseController.context(ImportBaseController.java:23)
        at org.geoserver.importer.rest.ImportController.getImports(ImportController.java:107)
        at sun.reflect.GeneratedMethodAccessor258.invoke(Unknown Source)
        at sun.reflect.DelegatingMethodAccessorImpl.invoke(DelegatingMethodAccessorImpl.java:43)
        at java.lang.reflect.Method.invoke(Method.java:498)
        at org.springframework.web.method.support.InvocableHandlerMethod.doInvoke(InvocableHandlerMethod.java:205)
        at org.springframework.web.method.support.InvocableHandlerMethod.invokeForRequest(InvocableHandlerMethod.java:133)
        at org.springframework.web.servlet.mvc.method.annotation.ServletInvocableHandlerMethod.invokeAndHandle(ServletInvocableHandlerMethod.java:97)
        at org.springframework.web.servlet.mvc.method.annotation.RequestMappingHandlerAdapter.invokeHandlerMethod(RequestMappingHandlerAdapter.java:827)
        at org.springframework.web.servlet.mvc.method.annotation.RequestMappingHandlerAdapter.handleInternal(RequestMappingHandlerAdapter.java:738)
        at org.springframework.web.servlet.mvc.method.AbstractHandlerMethodAdapter.handle(AbstractHandlerMethodAdapter.java:85)
        at org.springframework.web.servlet.DispatcherServlet.doDispatch(DispatcherServlet.java:967)
        at org.springframework.web.servlet.DispatcherServlet.doService(DispatcherServlet.java:901)
        at org.springframework.web.servlet.FrameworkServlet.processRequest(FrameworkServlet.java:970)
        at org.springframework.web.servlet.FrameworkServlet.doGet(FrameworkServlet.java:861)
        at javax.servlet.http.HttpServlet.service(HttpServlet.java:668)
        at org.springframework.web.servlet.FrameworkServlet.service(FrameworkServlet.java:846)
        at javax.servlet.http.HttpServlet.service(HttpServlet.java:770)
        at org.geoserver.test.GeoServerSystemTestSupport$2.service(GeoServerSystemTestSupport.java:1636)
        at javax.servlet.http.HttpServlet.service(HttpServlet.java:770)
        at org.springframework.mock.web.MockFilterChain$ServletFilterProxy.doFilter(MockFilterChain.java:160)
        at org.springframework.mock.web.MockFilterChain.doFilter(MockFilterChain.java:127)
        at org.geoserver.test.GeoServerSystemTestSupport.dispatch(GeoServerSystemTestSupport.java:1665)
        at org.geoserver.test.GeoServerSystemTestSupport.dispatch(GeoServerSystemTestSupport.java:1576)
        at org.geoserver.test.GeoServerSystemTestSupport.getAsServletResponse(GeoServerSystemTestSupport.java:1048)
        at org.geoserver.test.GeoServerSystemTestSupport.getAsServletResponse(GeoServerSystemTestSupport.java:1031)
        at org.geoserver.importer.rest.ImporterIntegrationTest.testDirectExecuteInternal(ImporterIntegrationTest.java:337)
        at org.geoserver.importer.rest.ImporterIntegrationTest.testDirectExecuteSync(ImporterIntegrationTest.java:255)
        at sun.reflect.NativeMethodAccessorImpl.invoke0(Native Method)
        at sun.reflect.NativeMethodAccessorImpl.invoke(NativeMethodAccessorImpl.java:62)
        at sun.reflect.DelegatingMethodAccessorImpl.invoke(DelegatingMethodAccessorImpl.java:43)
        at java.lang.reflect.Method.invoke(Method.java:498)
        at org.junit.runners.model.FrameworkMethod$1.runReflectiveCall(FrameworkMethod.java:47)
        at org.junit.internal.runners.model.ReflectiveCallable.run(ReflectiveCallable.java:12)
        at org.junit.runners.model.FrameworkMethod.invokeExplosively(FrameworkMethod.java:44)
        at org.junit.internal.runners.statements.InvokeMethod.evaluate(InvokeMethod.java:17)
        at org.junit.internal.runners.statements.RunBefores.evaluate(RunBefores.java:26)
        at org.junit.internal.runners.statements.RunAfters.evaluate(RunAfters.java:27)
        at org.junit.rules.RunRules.evaluate(RunRules.java:20)
        at org.junit.runners.ParentRunner.runLeaf(ParentRunner.java:271)
        at org.junit.runners.BlockJUnit4ClassRunner.runChild(BlockJUnit4ClassRunner.java:70)
        at org.junit.runners.BlockJUnit4ClassRunner.runChild(BlockJUnit4ClassRunner.java:50)
        at org.junit.runners.ParentRunner$3.run(ParentRunner.java:238)
        at org.junit.runners.ParentRunner$1.schedule(ParentRunner.java:63)
        at org.junit.runners.ParentRunner.runChildren(ParentRunner.java:236)
        at org.junit.runners.ParentRunner.access$000(ParentRunner.java:53)
        at org.junit.runners.ParentRunner$2.evaluate(ParentRunner.java:229)
        at org.junit.internal.runners.statements.RunBefores.evaluate(RunBefores.java:26)
        at org.junit.internal.runners.statements.RunAfters.evaluate(RunAfters.java:27)
        at org.junit.runners.ParentRunner.run(ParentRunner.java:309)
        at org.apache.maven.surefire.junit4.JUnit4Provider.execute(JUnit4Provider.java:252)
        at org.apache.maven.surefire.junit4.JUnit4Provider.executeTestSet(JUnit4Provider.java:141)
        at org.apache.maven.surefire.junit4.JUnit4Provider.invoke(JUnit4Provider.java:112)
        at sun.reflect.NativeMethodAccessorImpl.invoke0(Native Method)
        at sun.reflect.NativeMethodAccessorImpl.invoke(NativeMethodAccessorImpl.java:62)
        at sun.reflect.DelegatingMethodAccessorImpl.invoke(DelegatingMethodAccessorImpl.java:43)
        at java.lang.reflect.Method.invoke(Method.java:498)
        at org.apache.maven.surefire.util.ReflectionUtils.invokeMethodWithArray(ReflectionUtils.java:189)
        at org.apache.maven.surefire.booter.ProviderFactory$ProviderProxy.invoke(ProviderFactory.java:165)
        at org.apache.maven.surefire.booter.ProviderFactory.invokeProvider(ProviderFactory.java:85)
        at org.apache.maven.surefire.booter.ForkedBooter.runSuitesInProcess(ForkedBooter.java:115)
        at org.apache.maven.surefire.booter.ForkedBooter.main(ForkedBooter.java:75)
Jun 13, 2018 12:50:21 AM org.geoserver.importer.Importer copyFromFeatureReader
INFO: load to target took 13
Jun 13, 2018 12:50:21 AM org.geoserver.catalog.ResourcePool getFeatureType
WARNING: Error while getting feature type, flushing cache and retrying: Failed to find the datastore factory for dummy, did you forget to install the store extension jar?
Jun 13, 2018 12:50:22 AM org.geoserver.catalog.ResourcePool getFeatureType
WARNING: Error while getting feature type, flushing cache and retrying: Failed to find the datastore factory for dummy, did you forget to install the store extension jar?
Jun 13, 2018 12:50:22 AM org.geoserver.catalog.ResourcePool getFeatureType
WARNING: Error while getting feature type, flushing cache and retrying: Failed to find the datastore factory for dummy, did you forget to install the store extension jar?
Tests run: 14, Failures: 0, Errors: 0, Skipped: 0, Time elapsed: 13.676 sec
Running org.geoserver.importer.rest.PostScriptTransformTest
Tests run: 1, Failures: 0, Errors: 0, Skipped: 0, Time elapsed: 0.014 sec
Running org.geoserver.importer.rest.converters.ImportJSONIOTest
Jun 13, 2018 12:50:23 AM org.geoserver.platform.GeoServerExtensions checkContext
WARNING: Extension lookup 'GeoServerSecurityProvider', but ApplicationContext is unset.
Jun 13, 2018 12:50:23 AM org.geoserver.platform.GeoServerExtensions checkContext
WARNING: Extension lookup 'ExtensionFilter', but ApplicationContext is unset.
Jun 13, 2018 12:50:23 AM org.geoserver.platform.GeoServerExtensions checkContext
WARNING: Extension lookup 'ExtensionProvider', but ApplicationContext is unset.
Jun 13, 2018 12:50:23 AM org.geoserver.platform.GeoServerExtensions checkContext
WARNING: Extension lookup 'ExtensionFilter', but ApplicationContext is unset.
Jun 13, 2018 12:50:23 AM org.geoserver.importer.Importer createContextStore
INFO: Enabling import store: memory
Tests run: 4, Failures: 0, Errors: 0, Skipped: 0, Time elapsed: 0.775 sec

Results :

Tests run: 73, Failures: 0, Errors: 0, Skipped: 0

[INFO]
[INFO] --- maven-jar-plugin:2.4:jar (default-jar) @ gs-importer-rest ---
[INFO] Building jar: <https://build.geoserver.org/job/geoserver-master/ws/src/extension/importer/rest/target/gs-importer-rest-2.14-SNAPSHOT.jar>
[INFO]
[INFO] --- maven-jar-plugin:2.4:test-jar (default) @ gs-importer-rest ---
[INFO] Building jar: <https://build.geoserver.org/job/geoserver-master/ws/src/extension/importer/rest/target/gs-importer-rest-2.14-SNAPSHOT-tests.jar>
[INFO]
[INFO] --- maven-source-plugin:2.2.1:jar-no-fork (attach-sources) @ gs-importer-rest ---
[INFO] Building jar: <https://build.geoserver.org/job/geoserver-master/ws/src/extension/importer/rest/target/gs-importer-rest-2.14-SNAPSHOT-sources.jar>
[INFO]
[INFO] --- maven-source-plugin:2.2.1:test-jar-no-fork (attach-sources) @ gs-importer-rest ---
[INFO] Building jar: <https://build.geoserver.org/job/geoserver-master/ws/src/extension/importer/rest/target/gs-importer-rest-2.14-SNAPSHOT-test-sources.jar>
[INFO]
[INFO] --- fmt-maven-plugin:2.4.0:check (default) @ gs-importer-rest ---
[debug] Using AOSP style
[INFO] Processed 30 files (0 non-complying).
[INFO]
[INFO] --- maven-install-plugin:2.4:install (default-install) @ gs-importer-rest ---
[INFO] Installing <https://build.geoserver.org/job/geoserver-master/ws/src/extension/importer/rest/target/gs-importer-rest-2.14-SNAPSHOT.jar> to /var/jenkins/.m2/repository/org/geoserver/importer/gs-importer-rest/2.14-SNAPSHOT/gs-importer-rest-2.14-SNAPSHOT.jar
[INFO] Installing <https://build.geoserver.org/job/geoserver-master/ws/src/extension/importer/rest/pom.xml> to /var/jenkins/.m2/repository/org/geoserver/importer/gs-importer-rest/2.14-SNAPSHOT/gs-importer-rest-2.14-SNAPSHOT.pom
[INFO] Installing <https://build.geoserver.org/job/geoserver-master/ws/src/extension/importer/rest/target/gs-importer-rest-2.14-SNAPSHOT-tests.jar> to /var/jenkins/.m2/repository/org/geoserver/importer/gs-importer-rest/2.14-SNAPSHOT/gs-importer-rest-2.14-SNAPSHOT-tests.jar
[INFO] Installing <https://build.geoserver.org/job/geoserver-master/ws/src/extension/importer/rest/target/gs-importer-rest-2.14-SNAPSHOT-sources.jar> to /var/jenkins/.m2/repository/org/geoserver/importer/gs-importer-rest/2.14-SNAPSHOT/gs-importer-rest-2.14-SNAPSHOT-sources.jar
[INFO] Installing <https://build.geoserver.org/job/geoserver-master/ws/src/extension/importer/rest/target/gs-importer-rest-2.14-SNAPSHOT-test-sources.jar> to /var/jenkins/.m2/repository/org/geoserver/importer/gs-importer-rest/2.14-SNAPSHOT/gs-importer-rest-2.14-SNAPSHOT-test-sources.jar
[INFO] ------------------------------------------------------------------------
[INFO] Reactor Summary:
[INFO]
[INFO] GeoServer .......................................... SUCCESS [  6.141 s]
[INFO] Core Platform Module ............................... SUCCESS [ 13.140 s]
[INFO] Open Web Service Module ............................ SUCCESS [ 11.530 s]
[INFO] Main Module ........................................ SUCCESS [01:03 min]
[INFO] GeoServer Security Modules ......................... SUCCESS [  0.076 s]
[INFO] GeoServer Security Tests Module .................... SUCCESS [01:19 min]
[INFO] GeoServer JDBC Security Module ..................... SUCCESS [ 36.381 s]
[INFO] GeoServer LDAP Security Module ..................... SUCCESS [ 21.149 s]
[INFO] Web Coverage Service Module ........................ SUCCESS [  4.193 s]
[INFO] Web Coverage Service 1.0 Module .................... SUCCESS [ 15.849 s]
[INFO] Web Coverage Service 1.1 Module .................... SUCCESS [ 18.697 s]
[INFO] Web Coverage Service 2.0 Module .................... SUCCESS [ 38.569 s]
[INFO] Web Feature Service Module ......................... SUCCESS [01:32 min]
[INFO] Web Map Service Module ............................. SUCCESS [01:56 min]
[INFO] KML support for GeoServer .......................... SUCCESS [ 29.009 s]
[INFO] gs-rest ............................................ SUCCESS [ 15.463 s]
[INFO] GeoWebCache (GWC) Module ........................... FAILURE [02:17 min]
[INFO] gs-restconfig ...................................... SUCCESS [01:20 min]
[INFO] gs-restconfig-wcs .................................. SUCCESS [ 16.429 s]
[INFO] gs-restconfig-wfs .................................. SUCCESS [ 17.516 s]
[INFO] gs-restconfig-wms .................................. SUCCESS [ 12.063 s]
[INFO] GeoServer Web Modules .............................. SUCCESS [  0.057 s]
[INFO] Core UI Module ..................................... SUCCESS [01:08 min]
[INFO] WMS UI Module ...................................... SUCCESS [ 30.685 s]
[INFO] GWC UI Module ...................................... SKIPPED
[INFO] WFS UI Module ...................................... SUCCESS [  9.975 s]
[INFO] Demos Module ....................................... SUCCESS [ 17.012 s]
[INFO] WCS UI Module ...................................... SUCCESS [ 11.993 s]
[INFO] Security UI Modules ................................ SUCCESS [  0.077 s]
[INFO] Security UI Core Module ............................ SUCCESS [01:32 min]
[INFO] Security UI JDBC Module ............................ SUCCESS [01:07 min]
[INFO] Security UI LDAP Module ............................ SUCCESS [ 18.045 s]
[INFO] REST UI Module ..................................... SUCCESS [ 10.459 s]
[INFO] GeoServer Extensions ............................... SUCCESS [  0.038 s]
[INFO] Printing Module .................................... SUCCESS [ 12.636 s]
[INFO] GeoServer Web Application .......................... SKIPPED
[INFO] Community Space .................................... SUCCESS [  0.029 s]
[INFO] Application Schema Support ......................... SUCCESS [  0.029 s]
[INFO] Application Schema Integration Test ................ SUCCESS [02:29 min]
[INFO] Sample DataAccess Integration Test ................. SUCCESS [  9.739 s]
[INFO] ArcSDE DataStore Extension ......................... SUCCESS [ 10.429 s]
[INFO] H2 DataStore Extension ............................. SUCCESS [ 10.816 s]
[INFO] SQL Server DataStore Extension ..................... SUCCESS [  0.888 s]
[INFO] Oracle DataStore Extension ......................... SUCCESS [  0.367 s]
[INFO] MySQL DataStore Extension .......................... SUCCESS [  0.205 s]
[INFO] DB2 DataStore Extension ............................ SUCCESS [  0.197 s]
[INFO] ImageMap Output Format ............................. SUCCESS [  7.479 s]
[INFO] ImageI/O-Ext GDAL Coverage Extension ............... SUCCESS [  4.334 s]
[INFO] JP2K Coverage Extension ............................ SUCCESS [  0.270 s]
[INFO] OGR parent ......................................... SUCCESS [  0.031 s]
[INFO] OGR CORE ........................................... SUCCESS [  2.258 s]
[INFO] OGR WFS ............................................ SUCCESS [  8.596 s]
[INFO] Web Processing Service parent ...................... SUCCESS [  0.034 s]
[INFO] Web Processing Service Module ...................... SUCCESS [01:09 min]
[INFO] OGR WPS ............................................ SUCCESS [ 10.594 s]
[INFO] Excel Output Format ................................ SUCCESS [ 12.465 s]
[INFO] Chart external graphics support .................... SUCCESS [  0.471 s]
[INFO] Feature Generalization Extension ................... SUCCESS [  3.786 s]
[INFO] Image Mosaic JDBC Extension ........................ SUCCESS [  0.516 s]
[INFO] OWS request flow controller ........................ SUCCESS [ 18.258 s]
[INFO] Web process status sharing with Hazelcast .......... SUCCESS [ 32.845 s]
[INFO] Web Processing Service GUI ......................... SUCCESS [ 19.805 s]
[INFO] GeoServer Layer Querying filter functions .......... SUCCESS [ 13.326 s]
[INFO] Teradata DataStore Extension ....................... SUCCESS [  4.654 s]
[INFO] GeoServer Monitor Extensions ....................... SUCCESS [  0.045 s]
[INFO] Core Monitor Extension ............................. SKIPPED
[INFO] GeoServer Security Extension Modules ............... SUCCESS [  0.027 s]
[INFO] GeoServer CAS Security Module ...................... SUCCESS [  7.898 s]
[INFO] GeoServer Security Extension Web Modules ........... SUCCESS [  0.042 s]
[INFO] GeoServer CAS Security Web Module .................. SUCCESS [  2.312 s]
[INFO] XLST based WFS output format ....................... SUCCESS [ 17.257 s]
[INFO] GeoServer INSPIRE Extensions ....................... SKIPPED
[INFO] GeoServer CSS Styling .............................. SUCCESS [ 15.288 s]
[INFO] Catalog Services for the Web parent ................ SUCCESS [  0.078 s]
[INFO] Catalog Services for the Web interfaces ............ SUCCESS [  9.038 s]
[INFO] Catalog Services for the Web - Simple CatalogStore implementation SUCCESS [  8.225 s]
[INFO] Catalog Services for the Web core module ........... SUCCESS [ 30.884 s]
[INFO] CSW UI Module ...................................... SUCCESS [ 11.433 s]
[INFO] DXF WFS output format and WPS PPIO ................. SUCCESS [  0.057 s]
[INFO] DXF WFS output format .............................. SUCCESS [ 11.704 s]
[INFO] DXF WPS PPIO ....................................... SUCCESS [  7.271 s]
[INFO] GeoServer WCS 2.0 Earth Observation Extensions ..... SUCCESS [  0.051 s]
[INFO] Web Coverage Service 2.0 Earth Observation extensions SUCCESS [ 17.532 s]
[INFO] Web Coverage Service 2.0 Earth Observation GUI extension SUCCESS [ 11.196 s]
[INFO] GeoServer libjpeg-turbo Module ..................... SUCCESS [  8.346 s]
[INFO] GeoServer Data Importer ............................ SUCCESS [  0.055 s]
[INFO] Importer Core Module ............................... SUCCESS [ 48.725 s]
[INFO] Importer REST Api Module-ng ........................ SUCCESS [ 42.317 s]
[INFO] Importer Berkley DB Persistence Module ............. SUCCESS [ 13.620 s]
[INFO] Importer Web UI Module ............................. SUCCESS [ 13.355 s]
[INFO] GRIB Coverage Format ............................... SUCCESS [ 14.252 s]
[INFO] NetCDF Coverage format ............................. SUCCESS [ 15.973 s]
[INFO] WCS NetCDF output Module ........................... SUCCESS [ 53.674 s]
[INFO] Vector Tiles ....................................... SUCCESS [ 13.966 s]
[INFO] Ysld GeoServer Plugin .............................. SKIPPED
[INFO] MongoDB Data Store ................................. SUCCESS [  1.932 s]
[INFO] ------------------------------------------------------------------------
[INFO] BUILD FAILURE
[INFO] ------------------------------------------------------------------------
[INFO] Total time: 16:53 min (Wall Clock)
[INFO] Finished at: 2018-06-13T00:50:23+00:00
[INFO] Final Memory: 140M/1417M
[INFO] ------------------------------------------------------------------------
[ERROR] Failed to execute goal org.apache.maven.plugins:maven-surefire-plugin:2.12.3:test (default-test) on project gs-gwc: There are test failures.
[ERROR]
[ERROR] Please refer to <https://build.geoserver.org/job/geoserver-master/ws/src/gwc/target/surefire-reports> for the individual test results.
[ERROR] -> [Help 1]
[ERROR]
[ERROR] To see the full stack trace of the errors, re-run Maven with the -e switch.
[ERROR] Re-run Maven using the -X switch to enable full debug logging.
[ERROR]
[ERROR] For more information about the errors and possible solutions, please read the following articles:
[ERROR] [Help 1] http://cwiki.apache.org/confluence/display/MAVEN/MojoFailureException
[ERROR]
[ERROR] After correcting the problems, you can resume the build with the command
[ERROR]   mvn <goals> -rf :gs-gwc
Build step 'Invoke top-level Maven targets' marked build as failure

------------------------------------------------------------------------------
Check out the vibrant tech community on one of the world's most
engaging tech sites, Slashdot.org! http://sdm.link/slashdot
_______________________________________________
Geoserver-devel mailing list
[hidden email]
https://lists.sourceforge.net/lists/listinfo/geoserver-devel
Reply | Threaded
Open this post in threaded view
|

Build failed in Jenkins: geoserver-master #5917

monitor
See <https://build.geoserver.org/job/geoserver-master/5917/display/redirect?page=changes>

Changes:

[github] [GEOS-8772] Add documentation about the :where_clause: place holder in

------------------------------------------
[...truncated 11.12 MB...]
        at org.apache.maven.surefire.util.ReflectionUtils.invokeMethodWithArray(ReflectionUtils.java:189)
        at org.apache.maven.surefire.booter.ProviderFactory$ProviderProxy.invoke(ProviderFactory.java:165)
        at org.apache.maven.surefire.booter.ProviderFactory.invokeProvider(ProviderFactory.java:85)
        at org.apache.maven.surefire.booter.ForkedBooter.runSuitesInProcess(ForkedBooter.java:115)
        at org.apache.maven.surefire.booter.ForkedBooter.main(ForkedBooter.java:75)
Jun 13, 2018 7:54:01 AM org.geoserver.importer.Importer copyFromFeatureReader
INFO: load to target took 18
Jun 13, 2018 7:54:03 AM org.geoserver.catalog.ResourcePool getFeatureType
WARNING: Error while getting feature type, flushing cache and retrying: Failed to find the datastore factory for dummy, did you forget to install the store extension jar?
Jun 13, 2018 7:54:04 AM org.geoserver.importer.Importer copyFromFeatureReader
INFO: load to target took 16
13 Jun 07:54:04 ERROR [geoserver.rest] - No such import: 0
org.geoserver.rest.RestException 404 NOT_FOUND: No such import: 0
        at org.geoserver.importer.rest.ImportBaseController.context(ImportBaseController.java:43)
        at org.geoserver.importer.rest.ImportBaseController.context(ImportBaseController.java:27)
        at org.geoserver.importer.rest.ImportBaseController.context(ImportBaseController.java:23)
        at org.geoserver.importer.rest.ImportController.getImports(ImportController.java:107)
        at sun.reflect.GeneratedMethodAccessor261.invoke(Unknown Source)
        at sun.reflect.DelegatingMethodAccessorImpl.invoke(DelegatingMethodAccessorImpl.java:43)
        at java.lang.reflect.Method.invoke(Method.java:498)
        at org.springframework.web.method.support.InvocableHandlerMethod.doInvoke(InvocableHandlerMethod.java:205)
        at org.springframework.web.method.support.InvocableHandlerMethod.invokeForRequest(InvocableHandlerMethod.java:133)
        at org.springframework.web.servlet.mvc.method.annotation.ServletInvocableHandlerMethod.invokeAndHandle(ServletInvocableHandlerMethod.java:97)
        at org.springframework.web.servlet.mvc.method.annotation.RequestMappingHandlerAdapter.invokeHandlerMethod(RequestMappingHandlerAdapter.java:827)
        at org.springframework.web.servlet.mvc.method.annotation.RequestMappingHandlerAdapter.handleInternal(RequestMappingHandlerAdapter.java:738)
        at org.springframework.web.servlet.mvc.method.AbstractHandlerMethodAdapter.handle(AbstractHandlerMethodAdapter.java:85)
        at org.springframework.web.servlet.DispatcherServlet.doDispatch(DispatcherServlet.java:967)
        at org.springframework.web.servlet.DispatcherServlet.doService(DispatcherServlet.java:901)
        at org.springframework.web.servlet.FrameworkServlet.processRequest(FrameworkServlet.java:970)
        at org.springframework.web.servlet.FrameworkServlet.doGet(FrameworkServlet.java:861)
        at javax.servlet.http.HttpServlet.service(HttpServlet.java:668)
        at org.springframework.web.servlet.FrameworkServlet.service(FrameworkServlet.java:846)
        at javax.servlet.http.HttpServlet.service(HttpServlet.java:770)
        at org.geoserver.test.GeoServerSystemTestSupport$2.service(GeoServerSystemTestSupport.java:1636)
        at javax.servlet.http.HttpServlet.service(HttpServlet.java:770)
        at org.springframework.mock.web.MockFilterChain$ServletFilterProxy.doFilter(MockFilterChain.java:160)
        at org.springframework.mock.web.MockFilterChain.doFilter(MockFilterChain.java:127)
        at org.geoserver.test.GeoServerSystemTestSupport.dispatch(GeoServerSystemTestSupport.java:1665)
        at org.geoserver.test.GeoServerSystemTestSupport.dispatch(GeoServerSystemTestSupport.java:1576)
        at org.geoserver.test.GeoServerSystemTestSupport.getAsServletResponse(GeoServerSystemTestSupport.java:1048)
        at org.geoserver.test.GeoServerSystemTestSupport.getAsServletResponse(GeoServerSystemTestSupport.java:1031)
        at org.geoserver.importer.rest.ImporterIntegrationTest.testDirectExecuteInternal(ImporterIntegrationTest.java:337)
        at org.geoserver.importer.rest.ImporterIntegrationTest.testDirectExecuteSync(ImporterIntegrationTest.java:255)
        at sun.reflect.NativeMethodAccessorImpl.invoke0(Native Method)
        at sun.reflect.NativeMethodAccessorImpl.invoke(NativeMethodAccessorImpl.java:62)
        at sun.reflect.DelegatingMethodAccessorImpl.invoke(DelegatingMethodAccessorImpl.java:43)
        at java.lang.reflect.Method.invoke(Method.java:498)
        at org.junit.runners.model.FrameworkMethod$1.runReflectiveCall(FrameworkMethod.java:47)
        at org.junit.internal.runners.model.ReflectiveCallable.run(ReflectiveCallable.java:12)
        at org.junit.runners.model.FrameworkMethod.invokeExplosively(FrameworkMethod.java:44)
        at org.junit.internal.runners.statements.InvokeMethod.evaluate(InvokeMethod.java:17)
        at org.junit.internal.runners.statements.RunBefores.evaluate(RunBefores.java:26)
        at org.junit.internal.runners.statements.RunAfters.evaluate(RunAfters.java:27)
        at org.junit.rules.RunRules.evaluate(RunRules.java:20)
        at org.junit.runners.ParentRunner.runLeaf(ParentRunner.java:271)
        at org.junit.runners.BlockJUnit4ClassRunner.runChild(BlockJUnit4ClassRunner.java:70)
        at org.junit.runners.BlockJUnit4ClassRunner.runChild(BlockJUnit4ClassRunner.java:50)
        at org.junit.runners.ParentRunner$3.run(ParentRunner.java:238)
        at org.junit.runners.ParentRunner$1.schedule(ParentRunner.java:63)
        at org.junit.runners.ParentRunner.runChildren(ParentRunner.java:236)
        at org.junit.runners.ParentRunner.access$000(ParentRunner.java:53)
        at org.junit.runners.ParentRunner$2.evaluate(ParentRunner.java:229)
        at org.junit.internal.runners.statements.RunBefores.evaluate(RunBefores.java:26)
        at org.junit.internal.runners.statements.RunAfters.evaluate(RunAfters.java:27)
        at org.junit.runners.ParentRunner.run(ParentRunner.java:309)
        at org.apache.maven.surefire.junit4.JUnit4Provider.execute(JUnit4Provider.java:252)
        at org.apache.maven.surefire.junit4.JUnit4Provider.executeTestSet(JUnit4Provider.java:141)
        at org.apache.maven.surefire.junit4.JUnit4Provider.invoke(JUnit4Provider.java:112)
        at sun.reflect.NativeMethodAccessorImpl.invoke0(Native Method)
        at sun.reflect.NativeMethodAccessorImpl.invoke(NativeMethodAccessorImpl.java:62)
        at sun.reflect.DelegatingMethodAccessorImpl.invoke(DelegatingMethodAccessorImpl.java:43)
        at java.lang.reflect.Method.invoke(Method.java:498)
        at org.apache.maven.surefire.util.ReflectionUtils.invokeMethodWithArray(ReflectionUtils.java:189)
        at org.apache.maven.surefire.booter.ProviderFactory$ProviderProxy.invoke(ProviderFactory.java:165)
        at org.apache.maven.surefire.booter.ProviderFactory.invokeProvider(ProviderFactory.java:85)
        at org.apache.maven.surefire.booter.ForkedBooter.runSuitesInProcess(ForkedBooter.java:115)
        at org.apache.maven.surefire.booter.ForkedBooter.main(ForkedBooter.java:75)
Jun 13, 2018 7:54:04 AM org.geoserver.importer.Importer copyFromFeatureReader
INFO: load to target took 13
Jun 13, 2018 7:54:05 AM org.geoserver.catalog.ResourcePool getFeatureType
WARNING: Error while getting feature type, flushing cache and retrying: Failed to find the datastore factory for dummy, did you forget to install the store extension jar?
Jun 13, 2018 7:54:06 AM org.geoserver.catalog.ResourcePool getFeatureType
WARNING: Error while getting feature type, flushing cache and retrying: Failed to find the datastore factory for dummy, did you forget to install the store extension jar?
Jun 13, 2018 7:54:06 AM org.geoserver.catalog.ResourcePool getFeatureType
WARNING: Error while getting feature type, flushing cache and retrying: Failed to find the datastore factory for dummy, did you forget to install the store extension jar?
Tests run: 14, Failures: 0, Errors: 0, Skipped: 0, Time elapsed: 13.486 sec
Running org.geoserver.importer.rest.PostScriptTransformTest
Tests run: 1, Failures: 0, Errors: 0, Skipped: 0, Time elapsed: 0.012 sec
Running org.geoserver.importer.rest.converters.ImportJSONIOTest
Jun 13, 2018 7:54:06 AM org.geoserver.platform.GeoServerExtensions checkContext
WARNING: Extension lookup 'GeoServerSecurityProvider', but ApplicationContext is unset.
Jun 13, 2018 7:54:06 AM org.geoserver.platform.GeoServerExtensions checkContext
WARNING: Extension lookup 'ExtensionFilter', but ApplicationContext is unset.
Jun 13, 2018 7:54:06 AM org.geoserver.platform.GeoServerExtensions checkContext
WARNING: Extension lookup 'ExtensionProvider', but ApplicationContext is unset.
Jun 13, 2018 7:54:06 AM org.geoserver.platform.GeoServerExtensions checkContext
WARNING: Extension lookup 'ExtensionFilter', but ApplicationContext is unset.
Jun 13, 2018 7:54:07 AM org.geoserver.importer.Importer createContextStore
INFO: Enabling import store: memory
Tests run: 4, Failures: 0, Errors: 0, Skipped: 0, Time elapsed: 0.859 sec

Results :

Tests run: 73, Failures: 0, Errors: 0, Skipped: 0

[INFO]
[INFO] --- maven-jar-plugin:2.4:jar (default-jar) @ gs-importer-rest ---
[INFO] Building jar: <https://build.geoserver.org/job/geoserver-master/ws/src/extension/importer/rest/target/gs-importer-rest-2.14-SNAPSHOT.jar>
[INFO]
[INFO] --- maven-jar-plugin:2.4:test-jar (default) @ gs-importer-rest ---
[INFO] Building jar: <https://build.geoserver.org/job/geoserver-master/ws/src/extension/importer/rest/target/gs-importer-rest-2.14-SNAPSHOT-tests.jar>
[INFO]
[INFO] --- maven-source-plugin:2.2.1:jar-no-fork (attach-sources) @ gs-importer-rest ---
[INFO] Building jar: <https://build.geoserver.org/job/geoserver-master/ws/src/extension/importer/rest/target/gs-importer-rest-2.14-SNAPSHOT-sources.jar>
[INFO]
[INFO] --- maven-source-plugin:2.2.1:test-jar-no-fork (attach-sources) @ gs-importer-rest ---
[INFO] Building jar: <https://build.geoserver.org/job/geoserver-master/ws/src/extension/importer/rest/target/gs-importer-rest-2.14-SNAPSHOT-test-sources.jar>
[INFO]
[INFO] --- fmt-maven-plugin:2.4.0:check (default) @ gs-importer-rest ---
[debug] Using AOSP style
[INFO] Processed 29 files (0 non-complying).
[INFO]
[INFO] --- maven-install-plugin:2.4:install (default-install) @ gs-importer-rest ---
[INFO] Installing <https://build.geoserver.org/job/geoserver-master/ws/src/extension/importer/rest/target/gs-importer-rest-2.14-SNAPSHOT.jar> to /var/jenkins/.m2/repository/org/geoserver/importer/gs-importer-rest/2.14-SNAPSHOT/gs-importer-rest-2.14-SNAPSHOT.jar
[INFO] Installing <https://build.geoserver.org/job/geoserver-master/ws/src/extension/importer/rest/pom.xml> to /var/jenkins/.m2/repository/org/geoserver/importer/gs-importer-rest/2.14-SNAPSHOT/gs-importer-rest-2.14-SNAPSHOT.pom
[INFO] Installing <https://build.geoserver.org/job/geoserver-master/ws/src/extension/importer/rest/target/gs-importer-rest-2.14-SNAPSHOT-tests.jar> to /var/jenkins/.m2/repository/org/geoserver/importer/gs-importer-rest/2.14-SNAPSHOT/gs-importer-rest-2.14-SNAPSHOT-tests.jar
[INFO] Installing <https://build.geoserver.org/job/geoserver-master/ws/src/extension/importer/rest/target/gs-importer-rest-2.14-SNAPSHOT-sources.jar> to /var/jenkins/.m2/repository/org/geoserver/importer/gs-importer-rest/2.14-SNAPSHOT/gs-importer-rest-2.14-SNAPSHOT-sources.jar
[INFO] Installing <https://build.geoserver.org/job/geoserver-master/ws/src/extension/importer/rest/target/gs-importer-rest-2.14-SNAPSHOT-test-sources.jar> to /var/jenkins/.m2/repository/org/geoserver/importer/gs-importer-rest/2.14-SNAPSHOT/gs-importer-rest-2.14-SNAPSHOT-test-sources.jar
[INFO] ------------------------------------------------------------------------
[INFO] Reactor Summary:
[INFO]
[INFO] GeoServer .......................................... SUCCESS [  6.221 s]
[INFO] Core Platform Module ............................... SUCCESS [ 12.805 s]
[INFO] Open Web Service Module ............................ SUCCESS [ 11.681 s]
[INFO] Main Module ........................................ SUCCESS [01:02 min]
[INFO] GeoServer Security Modules ......................... SUCCESS [  0.059 s]
[INFO] GeoServer Security Tests Module .................... SUCCESS [01:20 min]
[INFO] GeoServer JDBC Security Module ..................... SUCCESS [ 35.082 s]
[INFO] GeoServer LDAP Security Module ..................... SUCCESS [ 20.209 s]
[INFO] Web Coverage Service Module ........................ SUCCESS [  4.483 s]
[INFO] Web Coverage Service 1.0 Module .................... SUCCESS [ 16.052 s]
[INFO] Web Coverage Service 1.1 Module .................... SUCCESS [ 18.803 s]
[INFO] Web Coverage Service 2.0 Module .................... SUCCESS [ 38.557 s]
[INFO] Web Feature Service Module ......................... SUCCESS [01:38 min]
[INFO] Web Map Service Module ............................. SUCCESS [01:55 min]
[INFO] KML support for GeoServer .......................... SUCCESS [ 28.809 s]
[INFO] gs-rest ............................................ SUCCESS [ 15.492 s]
[INFO] GeoWebCache (GWC) Module ........................... FAILURE [02:18 min]
[INFO] gs-restconfig ...................................... SUCCESS [01:21 min]
[INFO] gs-restconfig-wcs .................................. SUCCESS [ 18.593 s]
[INFO] gs-restconfig-wfs .................................. SUCCESS [ 17.296 s]
[INFO] gs-restconfig-wms .................................. SUCCESS [ 12.488 s]
[INFO] GeoServer Web Modules .............................. SUCCESS [  0.064 s]
[INFO] Core UI Module ..................................... SUCCESS [01:09 min]
[INFO] WMS UI Module ...................................... SUCCESS [ 30.486 s]
[INFO] GWC UI Module ...................................... SKIPPED
[INFO] WFS UI Module ...................................... SUCCESS [ 10.265 s]
[INFO] Demos Module ....................................... SUCCESS [ 17.052 s]
[INFO] WCS UI Module ...................................... SUCCESS [ 12.041 s]
[INFO] Security UI Modules ................................ SUCCESS [  0.107 s]
[INFO] Security UI Core Module ............................ SUCCESS [01:34 min]
[INFO] Security UI JDBC Module ............................ SUCCESS [01:06 min]
[INFO] Security UI LDAP Module ............................ SUCCESS [ 18.182 s]
[INFO] REST UI Module ..................................... SUCCESS [ 10.485 s]
[INFO] GeoServer Extensions ............................... SUCCESS [  0.045 s]
[INFO] Printing Module .................................... SUCCESS [ 12.375 s]
[INFO] GeoServer Web Application .......................... SKIPPED
[INFO] Community Space .................................... SUCCESS [  0.027 s]
[INFO] Application Schema Support ......................... SUCCESS [  0.022 s]
[INFO] Application Schema Integration Test ................ SUCCESS [02:30 min]
[INFO] Sample DataAccess Integration Test ................. SUCCESS [  9.858 s]
[INFO] ArcSDE DataStore Extension ......................... SUCCESS [ 11.480 s]
[INFO] H2 DataStore Extension ............................. SUCCESS [ 10.435 s]
[INFO] SQL Server DataStore Extension ..................... SUCCESS [  0.897 s]
[INFO] Oracle DataStore Extension ......................... SUCCESS [  0.382 s]
[INFO] MySQL DataStore Extension .......................... SUCCESS [  0.211 s]
[INFO] DB2 DataStore Extension ............................ SUCCESS [  0.217 s]
[INFO] ImageMap Output Format ............................. SUCCESS [  7.561 s]
[INFO] ImageI/O-Ext GDAL Coverage Extension ............... SUCCESS [  4.535 s]
[INFO] JP2K Coverage Extension ............................ SUCCESS [  0.249 s]
[INFO] OGR parent ......................................... SUCCESS [  0.032 s]
[INFO] OGR CORE ........................................... SUCCESS [  3.643 s]
[INFO] OGR WFS ............................................ SUCCESS [  8.872 s]
[INFO] Web Processing Service parent ...................... SUCCESS [  0.018 s]
[INFO] Web Processing Service Module ...................... SUCCESS [01:10 min]
[INFO] OGR WPS ............................................ SUCCESS [ 10.959 s]
[INFO] Excel Output Format ................................ SUCCESS [ 12.247 s]
[INFO] Chart external graphics support .................... SUCCESS [  0.460 s]
[INFO] Feature Generalization Extension ................... SUCCESS [  6.210 s]
[INFO] Image Mosaic JDBC Extension ........................ SUCCESS [  0.520 s]
[INFO] OWS request flow controller ........................ SUCCESS [ 19.924 s]
[INFO] Web process status sharing with Hazelcast .......... SUCCESS [ 13.441 s]
[INFO] Web Processing Service GUI ......................... SUCCESS [ 25.866 s]
[INFO] GeoServer Layer Querying filter functions .......... SUCCESS [ 13.119 s]
[INFO] Teradata DataStore Extension ....................... SUCCESS [  2.088 s]
[INFO] GeoServer Monitor Extensions ....................... SUCCESS [  0.047 s]
[INFO] Core Monitor Extension ............................. SKIPPED
[INFO] GeoServer Security Extension Modules ............... SUCCESS [  0.028 s]
[INFO] GeoServer CAS Security Module ...................... SUCCESS [  6.286 s]
[INFO] GeoServer Security Extension Web Modules ........... SUCCESS [  0.031 s]
[INFO] GeoServer CAS Security Web Module .................. SUCCESS [  2.196 s]
[INFO] XLST based WFS output format ....................... SUCCESS [ 17.189 s]
[INFO] GeoServer INSPIRE Extensions ....................... SKIPPED
[INFO] GeoServer CSS Styling .............................. SUCCESS [ 15.197 s]
[INFO] Catalog Services for the Web parent ................ SUCCESS [  0.068 s]
[INFO] Catalog Services for the Web interfaces ............ SUCCESS [  9.156 s]
[INFO] Catalog Services for the Web - Simple CatalogStore implementation SUCCESS [  8.432 s]
[INFO] Catalog Services for the Web core module ........... SUCCESS [ 30.712 s]
[INFO] CSW UI Module ...................................... SUCCESS [ 11.702 s]
[INFO] DXF WFS output format and WPS PPIO ................. SUCCESS [  0.045 s]
[INFO] DXF WFS output format .............................. SUCCESS [ 11.519 s]
[INFO] DXF WPS PPIO ....................................... SUCCESS [  8.543 s]
[INFO] GeoServer WCS 2.0 Earth Observation Extensions ..... SUCCESS [  0.016 s]
[INFO] Web Coverage Service 2.0 Earth Observation extensions SUCCESS [ 15.739 s]
[INFO] Web Coverage Service 2.0 Earth Observation GUI extension SUCCESS [ 11.998 s]
[INFO] GeoServer libjpeg-turbo Module ..................... SUCCESS [  8.662 s]
[INFO] GeoServer Data Importer ............................ SUCCESS [  0.048 s]
[INFO] Importer Core Module ............................... SUCCESS [ 50.328 s]
[INFO] Importer REST Api Module-ng ........................ SUCCESS [ 41.166 s]
[INFO] Importer Berkley DB Persistence Module ............. SUCCESS [ 14.353 s]
[INFO] Importer Web UI Module ............................. SUCCESS [ 13.745 s]
[INFO] GRIB Coverage Format ............................... SUCCESS [ 14.757 s]
[INFO] NetCDF Coverage format ............................. SUCCESS [ 15.380 s]
[INFO] WCS NetCDF output Module ........................... SUCCESS [ 52.872 s]
[INFO] Vector Tiles ....................................... SUCCESS [ 14.066 s]
[INFO] Ysld GeoServer Plugin .............................. SKIPPED
[INFO] MongoDB Data Store ................................. SUCCESS [  1.855 s]
[INFO] ------------------------------------------------------------------------
[INFO] BUILD FAILURE
[INFO] ------------------------------------------------------------------------
[INFO] Total time: 16:55 min (Wall Clock)
[INFO] Finished at: 2018-06-13T07:54:07+00:00
[INFO] Final Memory: 140M/1420M
[INFO] ------------------------------------------------------------------------
[ERROR] Failed to execute goal org.apache.maven.plugins:maven-surefire-plugin:2.12.3:test (default-test) on project gs-gwc: There are test failures.
[ERROR]
[ERROR] Please refer to <https://build.geoserver.org/job/geoserver-master/ws/src/gwc/target/surefire-reports> for the individual test results.
[ERROR] -> [Help 1]
[ERROR]
[ERROR] To see the full stack trace of the errors, re-run Maven with the -e switch.
[ERROR] Re-run Maven using the -X switch to enable full debug logging.
[ERROR]
[ERROR] For more information about the errors and possible solutions, please read the following articles:
[ERROR] [Help 1] http://cwiki.apache.org/confluence/display/MAVEN/MojoFailureException
[ERROR]
[ERROR] After correcting the problems, you can resume the build with the command
[ERROR]   mvn <goals> -rf :gs-gwc
Build step 'Invoke top-level Maven targets' marked build as failure
Not sending mail to unregistered user [hidden email]

------------------------------------------------------------------------------
Check out the vibrant tech community on one of the world's most
engaging tech sites, Slashdot.org! http://sdm.link/slashdot
_______________________________________________
Geoserver-devel mailing list
[hidden email]
https://lists.sourceforge.net/lists/listinfo/geoserver-devel
Reply | Threaded
Open this post in threaded view
|

Build failed in Jenkins: geoserver-master #5918

monitor
See <https://build.geoserver.org/job/geoserver-master/5918/display/redirect>

------------------------------------------
[...truncated 11.11 MB...]
[INFO] --- maven-install-plugin:2.4:install (default-install) @ gs-web-sec-cas ---
[INFO] Installing <https://build.geoserver.org/job/geoserver-master/ws/src/extension/security/web/web-cas/target/gs-web-sec-cas-2.14-SNAPSHOT.jar> to /var/jenkins/.m2/repository/org/geoserver/security/gs-web-sec-cas/2.14-SNAPSHOT/gs-web-sec-cas-2.14-SNAPSHOT.jar
[INFO] Installing <https://build.geoserver.org/job/geoserver-master/ws/src/extension/security/web/web-cas/pom.xml> to /var/jenkins/.m2/repository/org/geoserver/security/gs-web-sec-cas/2.14-SNAPSHOT/gs-web-sec-cas-2.14-SNAPSHOT.pom
[INFO] Installing <https://build.geoserver.org/job/geoserver-master/ws/src/extension/security/web/web-cas/target/gs-web-sec-cas-2.14-SNAPSHOT-tests.jar> to /var/jenkins/.m2/repository/org/geoserver/security/gs-web-sec-cas/2.14-SNAPSHOT/gs-web-sec-cas-2.14-SNAPSHOT-tests.jar
[INFO] Installing <https://build.geoserver.org/job/geoserver-master/ws/src/extension/security/web/web-cas/target/gs-web-sec-cas-2.14-SNAPSHOT-sources.jar> to /var/jenkins/.m2/repository/org/geoserver/security/gs-web-sec-cas/2.14-SNAPSHOT/gs-web-sec-cas-2.14-SNAPSHOT-sources.jar
Jun 13, 2018 11:24:16 AM org.geoserver.importer.Importer copyFromFeatureReader
INFO: load to target took 23
Jun 13, 2018 11:24:18 AM org.geoserver.catalog.ResourcePool getFeatureType
WARNING: Error while getting feature type, flushing cache and retrying: Failed to find the datastore factory for dummy, did you forget to install the store extension jar?
Jun 13, 2018 11:24:18 AM org.geoserver.importer.Importer copyFromFeatureReader
INFO: load to target took 16
13 Jun 11:24:19 ERROR [geoserver.rest] - No such import: 0
org.geoserver.rest.RestException 404 NOT_FOUND: No such import: 0
        at org.geoserver.importer.rest.ImportBaseController.context(ImportBaseController.java:43)
        at org.geoserver.importer.rest.ImportBaseController.context(ImportBaseController.java:27)
        at org.geoserver.importer.rest.ImportBaseController.context(ImportBaseController.java:23)
        at org.geoserver.importer.rest.ImportController.getImports(ImportController.java:107)
        at sun.reflect.GeneratedMethodAccessor259.invoke(Unknown Source)
        at sun.reflect.DelegatingMethodAccessorImpl.invoke(DelegatingMethodAccessorImpl.java:43)
        at java.lang.reflect.Method.invoke(Method.java:498)
        at org.springframework.web.method.support.InvocableHandlerMethod.doInvoke(InvocableHandlerMethod.java:205)
        at org.springframework.web.method.support.InvocableHandlerMethod.invokeForRequest(InvocableHandlerMethod.java:133)
        at org.springframework.web.servlet.mvc.method.annotation.ServletInvocableHandlerMethod.invokeAndHandle(ServletInvocableHandlerMethod.java:97)
        at org.springframework.web.servlet.mvc.method.annotation.RequestMappingHandlerAdapter.invokeHandlerMethod(RequestMappingHandlerAdapter.java:827)
        at org.springframework.web.servlet.mvc.method.annotation.RequestMappingHandlerAdapter.handleInternal(RequestMappingHandlerAdapter.java:738)
        at org.springframework.web.servlet.mvc.method.AbstractHandlerMethodAdapter.handle(AbstractHandlerMethodAdapter.java:85)
        at org.springframework.web.servlet.DispatcherServlet.doDispatch(DispatcherServlet.java:967)
        at org.springframework.web.servlet.DispatcherServlet.doService(DispatcherServlet.java:901)
        at org.springframework.web.servlet.FrameworkServlet.processRequest(FrameworkServlet.java:970)
        at org.springframework.web.servlet.FrameworkServlet.doGet(FrameworkServlet.java:861)
        at javax.servlet.http.HttpServlet.service(HttpServlet.java:668)
        at org.springframework.web.servlet.FrameworkServlet.service(FrameworkServlet.java:846)
        at javax.servlet.http.HttpServlet.service(HttpServlet.java:770)
        at org.geoserver.test.GeoServerSystemTestSupport$2.service(GeoServerSystemTestSupport.java:1636)
        at javax.servlet.http.HttpServlet.service(HttpServlet.java:770)
        at org.springframework.mock.web.MockFilterChain$ServletFilterProxy.doFilter(MockFilterChain.java:160)
        at org.springframework.mock.web.MockFilterChain.doFilter(MockFilterChain.java:127)
        at org.geoserver.test.GeoServerSystemTestSupport.dispatch(GeoServerSystemTestSupport.java:1665)
        at org.geoserver.test.GeoServerSystemTestSupport.dispatch(GeoServerSystemTestSupport.java:1576)
        at org.geoserver.test.GeoServerSystemTestSupport.getAsServletResponse(GeoServerSystemTestSupport.java:1048)
        at org.geoserver.test.GeoServerSystemTestSupport.getAsServletResponse(GeoServerSystemTestSupport.java:1031)
        at org.geoserver.importer.rest.ImporterIntegrationTest.testDirectExecuteInternal(ImporterIntegrationTest.java:337)
        at org.geoserver.importer.rest.ImporterIntegrationTest.testDirectExecuteSync(ImporterIntegrationTest.java:255)
        at sun.reflect.NativeMethodAccessorImpl.invoke0(Native Method)
        at sun.reflect.NativeMethodAccessorImpl.invoke(NativeMethodAccessorImpl.java:62)
        at sun.reflect.DelegatingMethodAccessorImpl.invoke(DelegatingMethodAccessorImpl.java:43)
        at java.lang.reflect.Method.invoke(Method.java:498)
        at org.junit.runners.model.FrameworkMethod$1.runReflectiveCall(FrameworkMethod.java:47)
        at org.junit.internal.runners.model.ReflectiveCallable.run(ReflectiveCallable.java:12)
        at org.junit.runners.model.FrameworkMethod.invokeExplosively(FrameworkMethod.java:44)
        at org.junit.internal.runners.statements.InvokeMethod.evaluate(InvokeMethod.java:17)
        at org.junit.internal.runners.statements.RunBefores.evaluate(RunBefores.java:26)
        at org.junit.internal.runners.statements.RunAfters.evaluate(RunAfters.java:27)
        at org.junit.rules.RunRules.evaluate(RunRules.java:20)
        at org.junit.runners.ParentRunner.runLeaf(ParentRunner.java:271)
        at org.junit.runners.BlockJUnit4ClassRunner.runChild(BlockJUnit4ClassRunner.java:70)
        at org.junit.runners.BlockJUnit4ClassRunner.runChild(BlockJUnit4ClassRunner.java:50)
        at org.junit.runners.ParentRunner$3.run(ParentRunner.java:238)
        at org.junit.runners.ParentRunner$1.schedule(ParentRunner.java:63)
        at org.junit.runners.ParentRunner.runChildren(ParentRunner.java:236)
        at org.junit.runners.ParentRunner.access$000(ParentRunner.java:53)
        at org.junit.runners.ParentRunner$2.evaluate(ParentRunner.java:229)
        at org.junit.internal.runners.statements.RunBefores.evaluate(RunBefores.java:26)
        at org.junit.internal.runners.statements.RunAfters.evaluate(RunAfters.java:27)
        at org.junit.runners.ParentRunner.run(ParentRunner.java:309)
        at org.apache.maven.surefire.junit4.JUnit4Provider.execute(JUnit4Provider.java:252)
        at org.apache.maven.surefire.junit4.JUnit4Provider.executeTestSet(JUnit4Provider.java:141)
        at org.apache.maven.surefire.junit4.JUnit4Provider.invoke(JUnit4Provider.java:112)
        at sun.reflect.NativeMethodAccessorImpl.invoke0(Native Method)
        at sun.reflect.NativeMethodAccessorImpl.invoke(NativeMethodAccessorImpl.java:62)
        at sun.reflect.DelegatingMethodAccessorImpl.invoke(DelegatingMethodAccessorImpl.java:43)
        at java.lang.reflect.Method.invoke(Method.java:498)
        at org.apache.maven.surefire.util.ReflectionUtils.invokeMethodWithArray(ReflectionUtils.java:189)
        at org.apache.maven.surefire.booter.ProviderFactory$ProviderProxy.invoke(ProviderFactory.java:165)
        at org.apache.maven.surefire.booter.ProviderFactory.invokeProvider(ProviderFactory.java:85)
        at org.apache.maven.surefire.booter.ForkedBooter.runSuitesInProcess(ForkedBooter.java:115)
        at org.apache.maven.surefire.booter.ForkedBooter.main(ForkedBooter.java:75)
Jun 13, 2018 11:24:19 AM org.geoserver.importer.Importer copyFromFeatureReader
INFO: load to target took 15
Jun 13, 2018 11:24:19 AM org.geoserver.catalog.ResourcePool getFeatureType
WARNING: Error while getting feature type, flushing cache and retrying: Failed to find the datastore factory for dummy, did you forget to install the store extension jar?
Jun 13, 2018 11:24:20 AM org.geoserver.catalog.ResourcePool getFeatureType
WARNING: Error while getting feature type, flushing cache and retrying: Failed to find the datastore factory for dummy, did you forget to install the store extension jar?
Jun 13, 2018 11:24:20 AM org.geoserver.catalog.ResourcePool getFeatureType
WARNING: Error while getting feature type, flushing cache and retrying: Failed to find the datastore factory for dummy, did you forget to install the store extension jar?
Tests run: 14, Failures: 0, Errors: 0, Skipped: 0, Time elapsed: 13.121 sec
Running org.geoserver.importer.rest.PostScriptTransformTest
Tests run: 1, Failures: 0, Errors: 0, Skipped: 0, Time elapsed: 0.013 sec
Running org.geoserver.importer.rest.converters.ImportJSONIOTest
Jun 13, 2018 11:24:21 AM org.geoserver.platform.GeoServerExtensions checkContext
WARNING: Extension lookup 'GeoServerSecurityProvider', but ApplicationContext is unset.
Jun 13, 2018 11:24:21 AM org.geoserver.platform.GeoServerExtensions checkContext
WARNING: Extension lookup 'ExtensionFilter', but ApplicationContext is unset.
Jun 13, 2018 11:24:21 AM org.geoserver.platform.GeoServerExtensions checkContext
WARNING: Extension lookup 'ExtensionProvider', but ApplicationContext is unset.
Jun 13, 2018 11:24:21 AM org.geoserver.platform.GeoServerExtensions checkContext
WARNING: Extension lookup 'ExtensionFilter', but ApplicationContext is unset.
Jun 13, 2018 11:24:21 AM org.geoserver.importer.Importer createContextStore
INFO: Enabling import store: memory
Tests run: 4, Failures: 0, Errors: 0, Skipped: 0, Time elapsed: 0.754 sec

Results :

Tests run: 73, Failures: 0, Errors: 0, Skipped: 0

[INFO]
[INFO] --- maven-jar-plugin:2.4:jar (default-jar) @ gs-importer-rest ---
[INFO] Building jar: <https://build.geoserver.org/job/geoserver-master/ws/src/extension/importer/rest/target/gs-importer-rest-2.14-SNAPSHOT.jar>
[INFO]
[INFO] --- maven-jar-plugin:2.4:test-jar (default) @ gs-importer-rest ---
[INFO] Building jar: <https://build.geoserver.org/job/geoserver-master/ws/src/extension/importer/rest/target/gs-importer-rest-2.14-SNAPSHOT-tests.jar>
[INFO]
[INFO] --- maven-source-plugin:2.2.1:jar-no-fork (attach-sources) @ gs-importer-rest ---
[INFO] Building jar: <https://build.geoserver.org/job/geoserver-master/ws/src/extension/importer/rest/target/gs-importer-rest-2.14-SNAPSHOT-sources.jar>
[INFO]
[INFO] --- maven-source-plugin:2.2.1:test-jar-no-fork (attach-sources) @ gs-importer-rest ---
[INFO] Building jar: <https://build.geoserver.org/job/geoserver-master/ws/src/extension/importer/rest/target/gs-importer-rest-2.14-SNAPSHOT-test-sources.jar>
[INFO]
[INFO] --- fmt-maven-plugin:2.4.0:check (default) @ gs-importer-rest ---
[debug] Using AOSP style
[INFO] Processed 30 files (0 non-complying).
[INFO]
[INFO] --- maven-install-plugin:2.4:install (default-install) @ gs-importer-rest ---
[INFO] Installing <https://build.geoserver.org/job/geoserver-master/ws/src/extension/importer/rest/target/gs-importer-rest-2.14-SNAPSHOT.jar> to /var/jenkins/.m2/repository/org/geoserver/importer/gs-importer-rest/2.14-SNAPSHOT/gs-importer-rest-2.14-SNAPSHOT.jar
[INFO] Installing <https://build.geoserver.org/job/geoserver-master/ws/src/extension/importer/rest/pom.xml> to /var/jenkins/.m2/repository/org/geoserver/importer/gs-importer-rest/2.14-SNAPSHOT/gs-importer-rest-2.14-SNAPSHOT.pom
[INFO] Installing <https://build.geoserver.org/job/geoserver-master/ws/src/extension/importer/rest/target/gs-importer-rest-2.14-SNAPSHOT-tests.jar> to /var/jenkins/.m2/repository/org/geoserver/importer/gs-importer-rest/2.14-SNAPSHOT/gs-importer-rest-2.14-SNAPSHOT-tests.jar
[INFO] Installing <https://build.geoserver.org/job/geoserver-master/ws/src/extension/importer/rest/target/gs-importer-rest-2.14-SNAPSHOT-sources.jar> to /var/jenkins/.m2/repository/org/geoserver/importer/gs-importer-rest/2.14-SNAPSHOT/gs-importer-rest-2.14-SNAPSHOT-sources.jar
[INFO] Installing <https://build.geoserver.org/job/geoserver-master/ws/src/extension/importer/rest/target/gs-importer-rest-2.14-SNAPSHOT-test-sources.jar> to /var/jenkins/.m2/repository/org/geoserver/importer/gs-importer-rest/2.14-SNAPSHOT/gs-importer-rest-2.14-SNAPSHOT-test-sources.jar
[INFO] ------------------------------------------------------------------------
[INFO] Reactor Summary:
[INFO]
[INFO] GeoServer .......................................... SUCCESS [  5.717 s]
[INFO] Core Platform Module ............................... SUCCESS [ 13.067 s]
[INFO] Open Web Service Module ............................ SUCCESS [ 11.128 s]
[INFO] Main Module ........................................ SUCCESS [01:02 min]
[INFO] GeoServer Security Modules ......................... SUCCESS [  0.066 s]
[INFO] GeoServer Security Tests Module .................... SUCCESS [01:19 min]
[INFO] GeoServer JDBC Security Module ..................... SUCCESS [ 34.855 s]
[INFO] GeoServer LDAP Security Module ..................... SUCCESS [ 22.166 s]
[INFO] Web Coverage Service Module ........................ SUCCESS [  4.387 s]
[INFO] Web Coverage Service 1.0 Module .................... SUCCESS [ 15.679 s]
[INFO] Web Coverage Service 1.1 Module .................... SUCCESS [ 18.898 s]
[INFO] Web Coverage Service 2.0 Module .................... SUCCESS [ 38.140 s]
[INFO] Web Feature Service Module ......................... SUCCESS [01:34 min]
[INFO] Web Map Service Module ............................. SUCCESS [01:56 min]
[INFO] KML support for GeoServer .......................... SUCCESS [ 28.183 s]
[INFO] gs-rest ............................................ SUCCESS [ 15.649 s]
[INFO] GeoWebCache (GWC) Module ........................... FAILURE [02:18 min]
[INFO] gs-restconfig ...................................... SUCCESS [01:21 min]
[INFO] gs-restconfig-wcs .................................. SUCCESS [ 18.850 s]
[INFO] gs-restconfig-wfs .................................. SUCCESS [ 17.883 s]
[INFO] gs-restconfig-wms .................................. SUCCESS [ 12.127 s]
[INFO] GeoServer Web Modules .............................. SUCCESS [  0.059 s]
[INFO] Core UI Module ..................................... SUCCESS [01:08 min]
[INFO] WMS UI Module ...................................... SUCCESS [ 30.576 s]
[INFO] GWC UI Module ...................................... SKIPPED
[INFO] WFS UI Module ...................................... SUCCESS [ 10.496 s]
[INFO] Demos Module ....................................... SUCCESS [ 17.277 s]
[INFO] WCS UI Module ...................................... SUCCESS [ 12.057 s]
[INFO] Security UI Modules ................................ SUCCESS [  0.080 s]
[INFO] Security UI Core Module ............................ SUCCESS [01:35 min]
[INFO] Security UI JDBC Module ............................ SUCCESS [01:10 min]
[INFO] Security UI LDAP Module ............................ SUCCESS [ 18.334 s]
[INFO] REST UI Module ..................................... SUCCESS [ 10.414 s]
[INFO] GeoServer Extensions ............................... SUCCESS [  0.041 s]
[INFO] Printing Module .................................... SUCCESS [ 13.081 s]
[INFO] GeoServer Web Application .......................... SKIPPED
[INFO] Community Space .................................... SUCCESS [  0.069 s]
[INFO] Application Schema Support ......................... SUCCESS [  0.025 s]
[INFO] Application Schema Integration Test ................ SUCCESS [02:27 min]
[INFO] Sample DataAccess Integration Test ................. SUCCESS [  9.919 s]
[INFO] ArcSDE DataStore Extension ......................... SUCCESS [ 10.325 s]
[INFO] H2 DataStore Extension ............................. SUCCESS [ 10.474 s]
[INFO] SQL Server DataStore Extension ..................... SUCCESS [  0.995 s]
[INFO] Oracle DataStore Extension ......................... SUCCESS [  0.382 s]
[INFO] MySQL DataStore Extension .......................... SUCCESS [  0.204 s]
[INFO] DB2 DataStore Extension ............................ SUCCESS [  0.208 s]
[INFO] ImageMap Output Format ............................. SUCCESS [  7.715 s]
[INFO] ImageI/O-Ext GDAL Coverage Extension ............... SUCCESS [  4.153 s]
[INFO] JP2K Coverage Extension ............................ SUCCESS [  0.244 s]
[INFO] OGR parent ......................................... SUCCESS [  0.025 s]
[INFO] OGR CORE ........................................... SUCCESS [  2.143 s]
[INFO] OGR WFS ............................................ SUCCESS [  8.829 s]
[INFO] Web Processing Service parent ...................... SUCCESS [  0.024 s]
[INFO] Web Processing Service Module ...................... SUCCESS [01:09 min]
[INFO] OGR WPS ............................................ SUCCESS [ 10.933 s]
[INFO] Excel Output Format ................................ SUCCESS [ 11.829 s]
[INFO] Chart external graphics support .................... SUCCESS [  0.482 s]
[INFO] Feature Generalization Extension ................... SUCCESS [  2.724 s]
[INFO] Image Mosaic JDBC Extension ........................ SUCCESS [  0.466 s]
[INFO] OWS request flow controller ........................ SUCCESS [ 17.704 s]
[INFO] Web process status sharing with Hazelcast .......... SUCCESS [ 16.899 s]
[INFO] Web Processing Service GUI ......................... SUCCESS [ 23.178 s]
[INFO] GeoServer Layer Querying filter functions .......... SUCCESS [ 13.315 s]
[INFO] Teradata DataStore Extension ....................... SUCCESS [  2.708 s]
[INFO] GeoServer Monitor Extensions ....................... SUCCESS [  0.070 s]
[INFO] Core Monitor Extension ............................. SKIPPED
[INFO] GeoServer Security Extension Modules ............... SUCCESS [  0.027 s]
[INFO] GeoServer CAS Security Module ...................... SUCCESS [  7.347 s]
[INFO] GeoServer Security Extension Web Modules ........... SUCCESS [  0.038 s]
[INFO] GeoServer CAS Security Web Module .................. SUCCESS [  1.798 s]
[INFO] XLST based WFS output format ....................... SUCCESS [ 17.192 s]
[INFO] GeoServer INSPIRE Extensions ....................... SKIPPED
[INFO] GeoServer CSS Styling .............................. SUCCESS [ 15.332 s]
[INFO] Catalog Services for the Web parent ................ SUCCESS [  0.082 s]
[INFO] Catalog Services for the Web interfaces ............ SUCCESS [  8.782 s]
[INFO] Catalog Services for the Web - Simple CatalogStore implementation SUCCESS [  8.432 s]
[INFO] Catalog Services for the Web core module ........... SUCCESS [ 30.509 s]
[INFO] CSW UI Module ...................................... SUCCESS [ 11.571 s]
[INFO] DXF WFS output format and WPS PPIO ................. SUCCESS [  0.058 s]
[INFO] DXF WFS output format .............................. SUCCESS [ 11.648 s]
[INFO] DXF WPS PPIO ....................................... SUCCESS [  8.598 s]
[INFO] GeoServer WCS 2.0 Earth Observation Extensions ..... SUCCESS [  0.042 s]
[INFO] Web Coverage Service 2.0 Earth Observation extensions SUCCESS [ 15.598 s]
[INFO] Web Coverage Service 2.0 Earth Observation GUI extension SUCCESS [ 12.567 s]
[INFO] GeoServer libjpeg-turbo Module ..................... SUCCESS [  8.414 s]
[INFO] GeoServer Data Importer ............................ SUCCESS [  0.034 s]
[INFO] Importer Core Module ............................... SUCCESS [ 49.801 s]
[INFO] Importer REST Api Module-ng ........................ SUCCESS [ 41.222 s]
[INFO] Importer Berkley DB Persistence Module ............. SUCCESS [ 14.262 s]
[INFO] Importer Web UI Module ............................. SUCCESS [ 13.382 s]
[INFO] GRIB Coverage Format ............................... SUCCESS [ 14.883 s]
[INFO] NetCDF Coverage format ............................. SUCCESS [ 15.634 s]
[INFO] WCS NetCDF output Module ........................... SUCCESS [ 52.776 s]
[INFO] Vector Tiles ....................................... SUCCESS [ 13.890 s]
[INFO] Ysld GeoServer Plugin .............................. SKIPPED
[INFO] MongoDB Data Store ................................. SUCCESS [  1.841 s]
[INFO] ------------------------------------------------------------------------
[INFO] BUILD FAILURE
[INFO] ------------------------------------------------------------------------
[INFO] Total time: 16:49 min (Wall Clock)
[INFO] Finished at: 2018-06-13T11:24:22+00:00
[INFO] Final Memory: 138M/1467M
[INFO] ------------------------------------------------------------------------
[ERROR] Failed to execute goal org.apache.maven.plugins:maven-surefire-plugin:2.12.3:test (default-test) on project gs-gwc: There are test failures.
[ERROR]
[ERROR] Please refer to <https://build.geoserver.org/job/geoserver-master/ws/src/gwc/target/surefire-reports> for the individual test results.
[ERROR] -> [Help 1]
[ERROR]
[ERROR] To see the full stack trace of the errors, re-run Maven with the -e switch.
[ERROR] Re-run Maven using the -X switch to enable full debug logging.
[ERROR]
[ERROR] For more information about the errors and possible solutions, please read the following articles:
[ERROR] [Help 1] http://cwiki.apache.org/confluence/display/MAVEN/MojoFailureException
[ERROR]
[ERROR] After correcting the problems, you can resume the build with the command
[ERROR]   mvn <goals> -rf :gs-gwc
Build step 'Invoke top-level Maven targets' marked build as failure
Not sending mail to unregistered user [hidden email]

------------------------------------------------------------------------------
Check out the vibrant tech community on one of the world's most
engaging tech sites, Slashdot.org! http://sdm.link/slashdot
_______________________________________________
Geoserver-devel mailing list
[hidden email]
https://lists.sourceforge.net/lists/listinfo/geoserver-devel
Reply | Threaded
Open this post in threaded view
|

Build failed in Jenkins: geoserver-master #5919

monitor
See <https://build.geoserver.org/job/geoserver-master/5919/display/redirect>

------------------------------------------
[...truncated 11.12 MB...]
[INFO] Processed 2 files (0 non-complying).
[INFO]
[INFO] --- maven-install-plugin:2.4:install (default-install) @ gs-web-sec-cas ---
[INFO] Installing <https://build.geoserver.org/job/geoserver-master/ws/src/extension/security/web/web-cas/target/gs-web-sec-cas-2.14-SNAPSHOT.jar> to /var/jenkins/.m2/repository/org/geoserver/security/gs-web-sec-cas/2.14-SNAPSHOT/gs-web-sec-cas-2.14-SNAPSHOT.jar
[INFO] Installing <https://build.geoserver.org/job/geoserver-master/ws/src/extension/security/web/web-cas/pom.xml> to /var/jenkins/.m2/repository/org/geoserver/security/gs-web-sec-cas/2.14-SNAPSHOT/gs-web-sec-cas-2.14-SNAPSHOT.pom
[INFO] Installing <https://build.geoserver.org/job/geoserver-master/ws/src/extension/security/web/web-cas/target/gs-web-sec-cas-2.14-SNAPSHOT-tests.jar> to /var/jenkins/.m2/repository/org/geoserver/security/gs-web-sec-cas/2.14-SNAPSHOT/gs-web-sec-cas-2.14-SNAPSHOT-tests.jar
[INFO] Installing <https://build.geoserver.org/job/geoserver-master/ws/src/extension/security/web/web-cas/target/gs-web-sec-cas-2.14-SNAPSHOT-sources.jar> to /var/jenkins/.m2/repository/org/geoserver/security/gs-web-sec-cas/2.14-SNAPSHOT/gs-web-sec-cas-2.14-SNAPSHOT-sources.jar
Jun 13, 2018 11:44:51 AM org.geoserver.catalog.ResourcePool getFeatureType
WARNING: Error while getting feature type, flushing cache and retrying: Failed to find the datastore factory for dummy, did you forget to install the store extension jar?
Jun 13, 2018 11:44:52 AM org.geoserver.importer.Importer copyFromFeatureReader
INFO: load to target took 16
13 Jun 11:44:53 ERROR [geoserver.rest] - No such import: 0
org.geoserver.rest.RestException 404 NOT_FOUND: No such import: 0
        at org.geoserver.importer.rest.ImportBaseController.context(ImportBaseController.java:43)
        at org.geoserver.importer.rest.ImportBaseController.context(ImportBaseController.java:27)
        at org.geoserver.importer.rest.ImportBaseController.context(ImportBaseController.java:23)
        at org.geoserver.importer.rest.ImportController.getImports(ImportController.java:107)
        at sun.reflect.GeneratedMethodAccessor258.invoke(Unknown Source)
        at sun.reflect.DelegatingMethodAccessorImpl.invoke(DelegatingMethodAccessorImpl.java:43)
        at java.lang.reflect.Method.invoke(Method.java:498)
        at org.springframework.web.method.support.InvocableHandlerMethod.doInvoke(InvocableHandlerMethod.java:205)
        at org.springframework.web.method.support.InvocableHandlerMethod.invokeForRequest(InvocableHandlerMethod.java:133)
        at org.springframework.web.servlet.mvc.method.annotation.ServletInvocableHandlerMethod.invokeAndHandle(ServletInvocableHandlerMethod.java:97)
        at org.springframework.web.servlet.mvc.method.annotation.RequestMappingHandlerAdapter.invokeHandlerMethod(RequestMappingHandlerAdapter.java:827)
        at org.springframework.web.servlet.mvc.method.annotation.RequestMappingHandlerAdapter.handleInternal(RequestMappingHandlerAdapter.java:738)
        at org.springframework.web.servlet.mvc.method.AbstractHandlerMethodAdapter.handle(AbstractHandlerMethodAdapter.java:85)
        at org.springframework.web.servlet.DispatcherServlet.doDispatch(DispatcherServlet.java:967)
        at org.springframework.web.servlet.DispatcherServlet.doService(DispatcherServlet.java:901)
        at org.springframework.web.servlet.FrameworkServlet.processRequest(FrameworkServlet.java:970)
        at org.springframework.web.servlet.FrameworkServlet.doGet(FrameworkServlet.java:861)
        at javax.servlet.http.HttpServlet.service(HttpServlet.java:668)
        at org.springframework.web.servlet.FrameworkServlet.service(FrameworkServlet.java:846)
        at javax.servlet.http.HttpServlet.service(HttpServlet.java:770)
        at org.geoserver.test.GeoServerSystemTestSupport$2.service(GeoServerSystemTestSupport.java:1636)
        at javax.servlet.http.HttpServlet.service(HttpServlet.java:770)
        at org.springframework.mock.web.MockFilterChain$ServletFilterProxy.doFilter(MockFilterChain.java:160)
        at org.springframework.mock.web.MockFilterChain.doFilter(MockFilterChain.java:127)
        at org.geoserver.test.GeoServerSystemTestSupport.dispatch(GeoServerSystemTestSupport.java:1665)
        at org.geoserver.test.GeoServerSystemTestSupport.dispatch(GeoServerSystemTestSupport.java:1576)
        at org.geoserver.test.GeoServerSystemTestSupport.getAsServletResponse(GeoServerSystemTestSupport.java:1048)
        at org.geoserver.test.GeoServerSystemTestSupport.getAsServletResponse(GeoServerSystemTestSupport.java:1031)
        at org.geoserver.importer.rest.ImporterIntegrationTest.testDirectExecuteInternal(ImporterIntegrationTest.java:337)
        at org.geoserver.importer.rest.ImporterIntegrationTest.testDirectExecuteSync(ImporterIntegrationTest.java:255)
        at sun.reflect.NativeMethodAccessorImpl.invoke0(Native Method)
        at sun.reflect.NativeMethodAccessorImpl.invoke(NativeMethodAccessorImpl.java:62)
        at sun.reflect.DelegatingMethodAccessorImpl.invoke(DelegatingMethodAccessorImpl.java:43)
        at java.lang.reflect.Method.invoke(Method.java:498)
        at org.junit.runners.model.FrameworkMethod$1.runReflectiveCall(FrameworkMethod.java:47)
        at org.junit.internal.runners.model.ReflectiveCallable.run(ReflectiveCallable.java:12)
        at org.junit.runners.model.FrameworkMethod.invokeExplosively(FrameworkMethod.java:44)
        at org.junit.internal.runners.statements.InvokeMethod.evaluate(InvokeMethod.java:17)
        at org.junit.internal.runners.statements.RunBefores.evaluate(RunBefores.java:26)
        at org.junit.internal.runners.statements.RunAfters.evaluate(RunAfters.java:27)
        at org.junit.rules.RunRules.evaluate(RunRules.java:20)
        at org.junit.runners.ParentRunner.runLeaf(ParentRunner.java:271)
        at org.junit.runners.BlockJUnit4ClassRunner.runChild(BlockJUnit4ClassRunner.java:70)
        at org.junit.runners.BlockJUnit4ClassRunner.runChild(BlockJUnit4ClassRunner.java:50)
        at org.junit.runners.ParentRunner$3.run(ParentRunner.java:238)
        at org.junit.runners.ParentRunner$1.schedule(ParentRunner.java:63)
        at org.junit.runners.ParentRunner.runChildren(ParentRunner.java:236)
        at org.junit.runners.ParentRunner.access$000(ParentRunner.java:53)
        at org.junit.runners.ParentRunner$2.evaluate(ParentRunner.java:229)
        at org.junit.internal.runners.statements.RunBefores.evaluate(RunBefores.java:26)
        at org.junit.internal.runners.statements.RunAfters.evaluate(RunAfters.java:27)
        at org.junit.runners.ParentRunner.run(ParentRunner.java:309)
        at org.apache.maven.surefire.junit4.JUnit4Provider.execute(JUnit4Provider.java:252)
        at org.apache.maven.surefire.junit4.JUnit4Provider.executeTestSet(JUnit4Provider.java:141)
        at org.apache.maven.surefire.junit4.JUnit4Provider.invoke(JUnit4Provider.java:112)
        at sun.reflect.NativeMethodAccessorImpl.invoke0(Native Method)
        at sun.reflect.NativeMethodAccessorImpl.invoke(NativeMethodAccessorImpl.java:62)
        at sun.reflect.DelegatingMethodAccessorImpl.invoke(DelegatingMethodAccessorImpl.java:43)
        at java.lang.reflect.Method.invoke(Method.java:498)
        at org.apache.maven.surefire.util.ReflectionUtils.invokeMethodWithArray(ReflectionUtils.java:189)
        at org.apache.maven.surefire.booter.ProviderFactory$ProviderProxy.invoke(ProviderFactory.java:165)
        at org.apache.maven.surefire.booter.ProviderFactory.invokeProvider(ProviderFactory.java:85)
        at org.apache.maven.surefire.booter.ForkedBooter.runSuitesInProcess(ForkedBooter.java:115)
        at org.apache.maven.surefire.booter.ForkedBooter.main(ForkedBooter.java:75)
Jun 13, 2018 11:44:53 AM org.geoserver.importer.Importer copyFromFeatureReader
INFO: load to target took 13
Jun 13, 2018 11:44:53 AM org.geoserver.catalog.ResourcePool getFeatureType
WARNING: Error while getting feature type, flushing cache and retrying: Failed to find the datastore factory for dummy, did you forget to install the store extension jar?
Jun 13, 2018 11:44:54 AM org.geoserver.catalog.ResourcePool getFeatureType
WARNING: Error while getting feature type, flushing cache and retrying: Failed to find the datastore factory for dummy, did you forget to install the store extension jar?
Jun 13, 2018 11:44:54 AM org.geoserver.catalog.ResourcePool getFeatureType
WARNING: Error while getting feature type, flushing cache and retrying: Failed to find the datastore factory for dummy, did you forget to install the store extension jar?
Tests run: 14, Failures: 0, Errors: 0, Skipped: 0, Time elapsed: 13.334 sec
Running org.geoserver.importer.rest.PostScriptTransformTest
Tests run: 1, Failures: 0, Errors: 0, Skipped: 0, Time elapsed: 0.014 sec
Running org.geoserver.importer.rest.converters.ImportJSONIOTest
Jun 13, 2018 11:44:55 AM org.geoserver.platform.GeoServerExtensions checkContext
WARNING: Extension lookup 'GeoServerSecurityProvider', but ApplicationContext is unset.
Jun 13, 2018 11:44:55 AM org.geoserver.platform.GeoServerExtensions checkContext
WARNING: Extension lookup 'ExtensionFilter', but ApplicationContext is unset.
Jun 13, 2018 11:44:55 AM org.geoserver.platform.GeoServerExtensions checkContext
WARNING: Extension lookup 'ExtensionProvider', but ApplicationContext is unset.
Jun 13, 2018 11:44:55 AM org.geoserver.platform.GeoServerExtensions checkContext
WARNING: Extension lookup 'ExtensionFilter', but ApplicationContext is unset.
Jun 13, 2018 11:44:55 AM org.geoserver.importer.Importer createContextStore
INFO: Enabling import store: memory
Tests run: 4, Failures: 0, Errors: 0, Skipped: 0, Time elapsed: 0.846 sec

Results :

Tests run: 73, Failures: 0, Errors: 0, Skipped: 0

[INFO]
[INFO] --- maven-jar-plugin:2.4:jar (default-jar) @ gs-importer-rest ---
[INFO] Building jar: <https://build.geoserver.org/job/geoserver-master/ws/src/extension/importer/rest/target/gs-importer-rest-2.14-SNAPSHOT.jar>
[INFO]
[INFO] --- maven-jar-plugin:2.4:test-jar (default) @ gs-importer-rest ---
[INFO] Building jar: <https://build.geoserver.org/job/geoserver-master/ws/src/extension/importer/rest/target/gs-importer-rest-2.14-SNAPSHOT-tests.jar>
[INFO]
[INFO] --- maven-source-plugin:2.2.1:jar-no-fork (attach-sources) @ gs-importer-rest ---
[INFO] Building jar: <https://build.geoserver.org/job/geoserver-master/ws/src/extension/importer/rest/target/gs-importer-rest-2.14-SNAPSHOT-sources.jar>
[INFO]
[INFO] --- maven-source-plugin:2.2.1:test-jar-no-fork (attach-sources) @ gs-importer-rest ---
[INFO] Building jar: <https://build.geoserver.org/job/geoserver-master/ws/src/extension/importer/rest/target/gs-importer-rest-2.14-SNAPSHOT-test-sources.jar>
[INFO]
[INFO] --- fmt-maven-plugin:2.4.0:check (default) @ gs-importer-rest ---
[debug] Using AOSP style
[INFO] Processed 30 files (0 non-complying).
[INFO]
[INFO] --- maven-install-plugin:2.4:install (default-install) @ gs-importer-rest ---
[INFO] Installing <https://build.geoserver.org/job/geoserver-master/ws/src/extension/importer/rest/target/gs-importer-rest-2.14-SNAPSHOT.jar> to /var/jenkins/.m2/repository/org/geoserver/importer/gs-importer-rest/2.14-SNAPSHOT/gs-importer-rest-2.14-SNAPSHOT.jar
[INFO] Installing <https://build.geoserver.org/job/geoserver-master/ws/src/extension/importer/rest/pom.xml> to /var/jenkins/.m2/repository/org/geoserver/importer/gs-importer-rest/2.14-SNAPSHOT/gs-importer-rest-2.14-SNAPSHOT.pom
[INFO] Installing <https://build.geoserver.org/job/geoserver-master/ws/src/extension/importer/rest/target/gs-importer-rest-2.14-SNAPSHOT-tests.jar> to /var/jenkins/.m2/repository/org/geoserver/importer/gs-importer-rest/2.14-SNAPSHOT/gs-importer-rest-2.14-SNAPSHOT-tests.jar
[INFO] Installing <https://build.geoserver.org/job/geoserver-master/ws/src/extension/importer/rest/target/gs-importer-rest-2.14-SNAPSHOT-sources.jar> to /var/jenkins/.m2/repository/org/geoserver/importer/gs-importer-rest/2.14-SNAPSHOT/gs-importer-rest-2.14-SNAPSHOT-sources.jar
[INFO] Installing <https://build.geoserver.org/job/geoserver-master/ws/src/extension/importer/rest/target/gs-importer-rest-2.14-SNAPSHOT-test-sources.jar> to /var/jenkins/.m2/repository/org/geoserver/importer/gs-importer-rest/2.14-SNAPSHOT/gs-importer-rest-2.14-SNAPSHOT-test-sources.jar
[INFO] ------------------------------------------------------------------------
[INFO] Reactor Summary:
[INFO]
[INFO] GeoServer .......................................... SUCCESS [  5.380 s]
[INFO] Core Platform Module ............................... SUCCESS [ 13.024 s]
[INFO] Open Web Service Module ............................ SUCCESS [ 11.091 s]
[INFO] Main Module ........................................ SUCCESS [01:02 min]
[INFO] GeoServer Security Modules ......................... SUCCESS [  0.067 s]
[INFO] GeoServer Security Tests Module .................... SUCCESS [01:17 min]
[INFO] GeoServer JDBC Security Module ..................... SUCCESS [ 34.363 s]
[INFO] GeoServer LDAP Security Module ..................... SUCCESS [ 20.189 s]
[INFO] Web Coverage Service Module ........................ SUCCESS [  3.952 s]
[INFO] Web Coverage Service 1.0 Module .................... SUCCESS [ 15.363 s]
[INFO] Web Coverage Service 1.1 Module .................... SUCCESS [ 19.485 s]
[INFO] Web Coverage Service 2.0 Module .................... SUCCESS [ 38.190 s]
[INFO] Web Feature Service Module ......................... SUCCESS [01:35 min]
[INFO] Web Map Service Module ............................. SUCCESS [01:56 min]
[INFO] KML support for GeoServer .......................... SUCCESS [ 28.814 s]
[INFO] gs-rest ............................................ SUCCESS [ 16.159 s]
[INFO] GeoWebCache (GWC) Module ........................... FAILURE [02:19 min]
[INFO] gs-restconfig ...................................... SUCCESS [01:21 min]
[INFO] gs-restconfig-wcs .................................. SUCCESS [ 18.044 s]
[INFO] gs-restconfig-wfs .................................. SUCCESS [ 17.543 s]
[INFO] gs-restconfig-wms .................................. SUCCESS [ 12.322 s]
[INFO] GeoServer Web Modules .............................. SUCCESS [  0.101 s]
[INFO] Core UI Module ..................................... SUCCESS [01:08 min]
[INFO] WMS UI Module ...................................... SUCCESS [ 31.044 s]
[INFO] GWC UI Module ...................................... SKIPPED
[INFO] WFS UI Module ...................................... SUCCESS [ 10.074 s]
[INFO] Demos Module ....................................... SUCCESS [ 17.012 s]
[INFO] WCS UI Module ...................................... SUCCESS [ 11.812 s]
[INFO] Security UI Modules ................................ SUCCESS [  0.048 s]
[INFO] Security UI Core Module ............................ SUCCESS [01:32 min]
[INFO] Security UI JDBC Module ............................ SUCCESS [01:07 min]
[INFO] Security UI LDAP Module ............................ SUCCESS [ 18.381 s]
[INFO] REST UI Module ..................................... SUCCESS [ 10.570 s]
[INFO] GeoServer Extensions ............................... SUCCESS [  0.060 s]
[INFO] Printing Module .................................... SUCCESS [ 11.633 s]
[INFO] GeoServer Web Application .......................... SKIPPED
[INFO] Community Space .................................... SUCCESS [  0.031 s]
[INFO] Application Schema Support ......................... SUCCESS [  0.027 s]
[INFO] Application Schema Integration Test ................ SUCCESS [02:30 min]
[INFO] Sample DataAccess Integration Test ................. SUCCESS [  9.655 s]
[INFO] ArcSDE DataStore Extension ......................... SUCCESS [ 11.191 s]
[INFO] H2 DataStore Extension ............................. SUCCESS [ 10.768 s]
[INFO] SQL Server DataStore Extension ..................... SUCCESS [  0.915 s]
[INFO] Oracle DataStore Extension ......................... SUCCESS [  0.393 s]
[INFO] MySQL DataStore Extension .......................... SUCCESS [  0.206 s]
[INFO] DB2 DataStore Extension ............................ SUCCESS [  0.199 s]
[INFO] ImageMap Output Format ............................. SUCCESS [  7.896 s]
[INFO] ImageI/O-Ext GDAL Coverage Extension ............... SUCCESS [  4.316 s]
[INFO] JP2K Coverage Extension ............................ SUCCESS [  0.230 s]
[INFO] OGR parent ......................................... SUCCESS [  0.018 s]
[INFO] OGR CORE ........................................... SUCCESS [  2.124 s]
[INFO] OGR WFS ............................................ SUCCESS [  8.846 s]
[INFO] Web Processing Service parent ...................... SUCCESS [  0.023 s]
[INFO] Web Processing Service Module ...................... SUCCESS [01:10 min]
[INFO] OGR WPS ............................................ SUCCESS [ 10.877 s]
[INFO] Excel Output Format ................................ SUCCESS [ 11.703 s]
[INFO] Chart external graphics support .................... SUCCESS [  0.537 s]
[INFO] Feature Generalization Extension ................... SUCCESS [  2.025 s]
[INFO] Image Mosaic JDBC Extension ........................ SUCCESS [  0.472 s]
[INFO] OWS request flow controller ........................ SUCCESS [ 17.182 s]
[INFO] Web process status sharing with Hazelcast .......... SUCCESS [ 19.274 s]
[INFO] Web Processing Service GUI ......................... SUCCESS [ 22.949 s]
[INFO] GeoServer Layer Querying filter functions .......... SUCCESS [ 12.983 s]
[INFO] Teradata DataStore Extension ....................... SUCCESS [  2.010 s]
[INFO] GeoServer Monitor Extensions ....................... SUCCESS [  0.048 s]
[INFO] Core Monitor Extension ............................. SKIPPED
[INFO] GeoServer Security Extension Modules ............... SUCCESS [  0.034 s]
[INFO] GeoServer CAS Security Module ...................... SUCCESS [  8.258 s]
[INFO] GeoServer Security Extension Web Modules ........... SUCCESS [  0.033 s]
[INFO] GeoServer CAS Security Web Module .................. SUCCESS [  2.043 s]
[INFO] XLST based WFS output format ....................... SUCCESS [ 17.315 s]
[INFO] GeoServer INSPIRE Extensions ....................... SKIPPED
[INFO] GeoServer CSS Styling .............................. SUCCESS [ 15.486 s]
[INFO] Catalog Services for the Web parent ................ SUCCESS [  0.044 s]
[INFO] Catalog Services for the Web interfaces ............ SUCCESS [  9.089 s]
[INFO] Catalog Services for the Web - Simple CatalogStore implementation SUCCESS [  8.309 s]
[INFO] Catalog Services for the Web core module ........... SUCCESS [ 31.070 s]
[INFO] CSW UI Module ...................................... SUCCESS [ 11.988 s]
[INFO] DXF WFS output format and WPS PPIO ................. SUCCESS [  0.047 s]
[INFO] DXF WFS output format .............................. SUCCESS [ 11.765 s]
[INFO] DXF WPS PPIO ....................................... SUCCESS [  8.663 s]
[INFO] GeoServer WCS 2.0 Earth Observation Extensions ..... SUCCESS [  0.039 s]
[INFO] Web Coverage Service 2.0 Earth Observation extensions SUCCESS [ 16.236 s]
[INFO] Web Coverage Service 2.0 Earth Observation GUI extension SUCCESS [ 11.848 s]
[INFO] GeoServer libjpeg-turbo Module ..................... SUCCESS [  8.274 s]
[INFO] GeoServer Data Importer ............................ SUCCESS [  0.031 s]
[INFO] Importer Core Module ............................... SUCCESS [ 50.031 s]
[INFO] Importer REST Api Module-ng ........................ SUCCESS [ 42.342 s]
[INFO] Importer Berkley DB Persistence Module ............. SUCCESS [ 13.133 s]
[INFO] Importer Web UI Module ............................. SUCCESS [ 13.446 s]
[INFO] GRIB Coverage Format ............................... SUCCESS [ 14.450 s]
[INFO] NetCDF Coverage format ............................. SUCCESS [ 15.899 s]
[INFO] WCS NetCDF output Module ........................... SUCCESS [ 52.677 s]
[INFO] Vector Tiles ....................................... SUCCESS [ 14.294 s]
[INFO] Ysld GeoServer Plugin .............................. SKIPPED
[INFO] MongoDB Data Store ................................. SUCCESS [  1.798 s]
[INFO] ------------------------------------------------------------------------
[INFO] BUILD FAILURE
[INFO] ------------------------------------------------------------------------
[INFO] Total time: 16:47 min (Wall Clock)
[INFO] Finished at: 2018-06-13T11:44:55+00:00
[INFO] Final Memory: 137M/1325M
[INFO] ------------------------------------------------------------------------
[ERROR] Failed to execute goal org.apache.maven.plugins:maven-surefire-plugin:2.12.3:test (default-test) on project gs-gwc: There are test failures.
[ERROR]
[ERROR] Please refer to <https://build.geoserver.org/job/geoserver-master/ws/src/gwc/target/surefire-reports> for the individual test results.
[ERROR] -> [Help 1]
[ERROR]
[ERROR] To see the full stack trace of the errors, re-run Maven with the -e switch.
[ERROR] Re-run Maven using the -X switch to enable full debug logging.
[ERROR]
[ERROR] For more information about the errors and possible solutions, please read the following articles:
[ERROR] [Help 1] http://cwiki.apache.org/confluence/display/MAVEN/MojoFailureException
[ERROR]
[ERROR] After correcting the problems, you can resume the build with the command
[ERROR]   mvn <goals> -rf :gs-gwc
Build step 'Invoke top-level Maven targets' marked build as failure
Not sending mail to unregistered user [hidden email]

------------------------------------------------------------------------------
Check out the vibrant tech community on one of the world's most
engaging tech sites, Slashdot.org! http://sdm.link/slashdot
_______________________________________________
Geoserver-devel mailing list
[hidden email]
https://lists.sourceforge.net/lists/listinfo/geoserver-devel
Reply | Threaded
Open this post in threaded view
|

Build failed in Jenkins: geoserver-master #5920

monitor
See <https://build.geoserver.org/job/geoserver-master/5920/display/redirect?page=changes>

Changes:

[Andrea Aime] [GEOS-8785] Cannot access or delete single granule via REST when using

------------------------------------------
[...truncated 11.14 MB...]
        at org.apache.maven.surefire.util.ReflectionUtils.invokeMethodWithArray(ReflectionUtils.java:189)
        at org.apache.maven.surefire.booter.ProviderFactory$ProviderProxy.invoke(ProviderFactory.java:165)
        at org.apache.maven.surefire.booter.ProviderFactory.invokeProvider(ProviderFactory.java:85)
        at org.apache.maven.surefire.booter.ForkedBooter.runSuitesInProcess(ForkedBooter.java:115)
        at org.apache.maven.surefire.booter.ForkedBooter.main(ForkedBooter.java:75)
Jun 13, 2018 12:48:53 PM org.geoserver.importer.Importer copyFromFeatureReader
INFO: load to target took 17
Jun 13, 2018 12:48:55 PM org.geoserver.catalog.ResourcePool getFeatureType
WARNING: Error while getting feature type, flushing cache and retrying: Failed to find the datastore factory for dummy, did you forget to install the store extension jar?
Jun 13, 2018 12:48:56 PM org.geoserver.importer.Importer copyFromFeatureReader
INFO: load to target took 15
13 Jun 12:48:56 ERROR [geoserver.rest] - No such import: 0
org.geoserver.rest.RestException 404 NOT_FOUND: No such import: 0
        at org.geoserver.importer.rest.ImportBaseController.context(ImportBaseController.java:43)
        at org.geoserver.importer.rest.ImportBaseController.context(ImportBaseController.java:27)
        at org.geoserver.importer.rest.ImportBaseController.context(ImportBaseController.java:23)
        at org.geoserver.importer.rest.ImportController.getImports(ImportController.java:107)
        at sun.reflect.GeneratedMethodAccessor261.invoke(Unknown Source)
        at sun.reflect.DelegatingMethodAccessorImpl.invoke(DelegatingMethodAccessorImpl.java:43)
        at java.lang.reflect.Method.invoke(Method.java:498)
        at org.springframework.web.method.support.InvocableHandlerMethod.doInvoke(InvocableHandlerMethod.java:205)
        at org.springframework.web.method.support.InvocableHandlerMethod.invokeForRequest(InvocableHandlerMethod.java:133)
        at org.springframework.web.servlet.mvc.method.annotation.ServletInvocableHandlerMethod.invokeAndHandle(ServletInvocableHandlerMethod.java:97)
        at org.springframework.web.servlet.mvc.method.annotation.RequestMappingHandlerAdapter.invokeHandlerMethod(RequestMappingHandlerAdapter.java:827)
        at org.springframework.web.servlet.mvc.method.annotation.RequestMappingHandlerAdapter.handleInternal(RequestMappingHandlerAdapter.java:738)
        at org.springframework.web.servlet.mvc.method.AbstractHandlerMethodAdapter.handle(AbstractHandlerMethodAdapter.java:85)
        at org.springframework.web.servlet.DispatcherServlet.doDispatch(DispatcherServlet.java:967)
        at org.springframework.web.servlet.DispatcherServlet.doService(DispatcherServlet.java:901)
        at org.springframework.web.servlet.FrameworkServlet.processRequest(FrameworkServlet.java:970)
        at org.springframework.web.servlet.FrameworkServlet.doGet(FrameworkServlet.java:861)
        at javax.servlet.http.HttpServlet.service(HttpServlet.java:668)
        at org.springframework.web.servlet.FrameworkServlet.service(FrameworkServlet.java:846)
        at javax.servlet.http.HttpServlet.service(HttpServlet.java:770)
        at org.geoserver.test.GeoServerSystemTestSupport$2.service(GeoServerSystemTestSupport.java:1636)
        at javax.servlet.http.HttpServlet.service(HttpServlet.java:770)
        at org.springframework.mock.web.MockFilterChain$ServletFilterProxy.doFilter(MockFilterChain.java:160)
        at org.springframework.mock.web.MockFilterChain.doFilter(MockFilterChain.java:127)
        at org.geoserver.test.GeoServerSystemTestSupport.dispatch(GeoServerSystemTestSupport.java:1665)
        at org.geoserver.test.GeoServerSystemTestSupport.dispatch(GeoServerSystemTestSupport.java:1576)
        at org.geoserver.test.GeoServerSystemTestSupport.getAsServletResponse(GeoServerSystemTestSupport.java:1048)
        at org.geoserver.test.GeoServerSystemTestSupport.getAsServletResponse(GeoServerSystemTestSupport.java:1031)
        at org.geoserver.importer.rest.ImporterIntegrationTest.testDirectExecuteInternal(ImporterIntegrationTest.java:337)
        at org.geoserver.importer.rest.ImporterIntegrationTest.testDirectExecuteSync(ImporterIntegrationTest.java:255)
        at sun.reflect.NativeMethodAccessorImpl.invoke0(Native Method)
        at sun.reflect.NativeMethodAccessorImpl.invoke(NativeMethodAccessorImpl.java:62)
        at sun.reflect.DelegatingMethodAccessorImpl.invoke(DelegatingMethodAccessorImpl.java:43)
        at java.lang.reflect.Method.invoke(Method.java:498)
        at org.junit.runners.model.FrameworkMethod$1.runReflectiveCall(FrameworkMethod.java:47)
        at org.junit.internal.runners.model.ReflectiveCallable.run(ReflectiveCallable.java:12)
        at org.junit.runners.model.FrameworkMethod.invokeExplosively(FrameworkMethod.java:44)
        at org.junit.internal.runners.statements.InvokeMethod.evaluate(InvokeMethod.java:17)
        at org.junit.internal.runners.statements.RunBefores.evaluate(RunBefores.java:26)
        at org.junit.internal.runners.statements.RunAfters.evaluate(RunAfters.java:27)
        at org.junit.rules.RunRules.evaluate(RunRules.java:20)
        at org.junit.runners.ParentRunner.runLeaf(ParentRunner.java:271)
        at org.junit.runners.BlockJUnit4ClassRunner.runChild(BlockJUnit4ClassRunner.java:70)
        at org.junit.runners.BlockJUnit4ClassRunner.runChild(BlockJUnit4ClassRunner.java:50)
        at org.junit.runners.ParentRunner$3.run(ParentRunner.java:238)
        at org.junit.runners.ParentRunner$1.schedule(ParentRunner.java:63)
        at org.junit.runners.ParentRunner.runChildren(ParentRunner.java:236)
        at org.junit.runners.ParentRunner.access$000(ParentRunner.java:53)
        at org.junit.runners.ParentRunner$2.evaluate(ParentRunner.java:229)
        at org.junit.internal.runners.statements.RunBefores.evaluate(RunBefores.java:26)
        at org.junit.internal.runners.statements.RunAfters.evaluate(RunAfters.java:27)
        at org.junit.runners.ParentRunner.run(ParentRunner.java:309)
        at org.apache.maven.surefire.junit4.JUnit4Provider.execute(JUnit4Provider.java:252)
        at org.apache.maven.surefire.junit4.JUnit4Provider.executeTestSet(JUnit4Provider.java:141)
        at org.apache.maven.surefire.junit4.JUnit4Provider.invoke(JUnit4Provider.java:112)
        at sun.reflect.NativeMethodAccessorImpl.invoke0(Native Method)
        at sun.reflect.NativeMethodAccessorImpl.invoke(NativeMethodAccessorImpl.java:62)
        at sun.reflect.DelegatingMethodAccessorImpl.invoke(DelegatingMethodAccessorImpl.java:43)
        at java.lang.reflect.Method.invoke(Method.java:498)
        at org.apache.maven.surefire.util.ReflectionUtils.invokeMethodWithArray(ReflectionUtils.java:189)
        at org.apache.maven.surefire.booter.ProviderFactory$ProviderProxy.invoke(ProviderFactory.java:165)
        at org.apache.maven.surefire.booter.ProviderFactory.invokeProvider(ProviderFactory.java:85)
        at org.apache.maven.surefire.booter.ForkedBooter.runSuitesInProcess(ForkedBooter.java:115)
        at org.apache.maven.surefire.booter.ForkedBooter.main(ForkedBooter.java:75)
Jun 13, 2018 12:48:56 PM org.geoserver.importer.Importer copyFromFeatureReader
INFO: load to target took 13
Jun 13, 2018 12:48:57 PM org.geoserver.catalog.ResourcePool getFeatureType
WARNING: Error while getting feature type, flushing cache and retrying: Failed to find the datastore factory for dummy, did you forget to install the store extension jar?
Jun 13, 2018 12:48:58 PM org.geoserver.catalog.ResourcePool getFeatureType
WARNING: Error while getting feature type, flushing cache and retrying: Failed to find the datastore factory for dummy, did you forget to install the store extension jar?
Jun 13, 2018 12:48:58 PM org.geoserver.catalog.ResourcePool getFeatureType
WARNING: Error while getting feature type, flushing cache and retrying: Failed to find the datastore factory for dummy, did you forget to install the store extension jar?
Tests run: 14, Failures: 0, Errors: 0, Skipped: 0, Time elapsed: 13.411 sec
Running org.geoserver.importer.rest.PostScriptTransformTest
Tests run: 1, Failures: 0, Errors: 0, Skipped: 0, Time elapsed: 0.016 sec
Running org.geoserver.importer.rest.converters.ImportJSONIOTest
Jun 13, 2018 12:48:58 PM org.geoserver.platform.GeoServerExtensions checkContext
WARNING: Extension lookup 'GeoServerSecurityProvider', but ApplicationContext is unset.
Jun 13, 2018 12:48:58 PM org.geoserver.platform.GeoServerExtensions checkContext
WARNING: Extension lookup 'ExtensionFilter', but ApplicationContext is unset.
Jun 13, 2018 12:48:58 PM org.geoserver.platform.GeoServerExtensions checkContext
WARNING: Extension lookup 'ExtensionProvider', but ApplicationContext is unset.
Jun 13, 2018 12:48:58 PM org.geoserver.platform.GeoServerExtensions checkContext
WARNING: Extension lookup 'ExtensionFilter', but ApplicationContext is unset.
Jun 13, 2018 12:48:59 PM org.geoserver.importer.Importer createContextStore
INFO: Enabling import store: memory
Tests run: 4, Failures: 0, Errors: 0, Skipped: 0, Time elapsed: 0.876 sec

Results :

Tests run: 73, Failures: 0, Errors: 0, Skipped: 0

[INFO]
[INFO] --- maven-jar-plugin:2.4:jar (default-jar) @ gs-importer-rest ---
[INFO] Building jar: <https://build.geoserver.org/job/geoserver-master/ws/src/extension/importer/rest/target/gs-importer-rest-2.14-SNAPSHOT.jar>
[INFO]
[INFO] --- maven-jar-plugin:2.4:test-jar (default) @ gs-importer-rest ---
[INFO] Building jar: <https://build.geoserver.org/job/geoserver-master/ws/src/extension/importer/rest/target/gs-importer-rest-2.14-SNAPSHOT-tests.jar>
[INFO]
[INFO] --- maven-source-plugin:2.2.1:jar-no-fork (attach-sources) @ gs-importer-rest ---
[INFO] Building jar: <https://build.geoserver.org/job/geoserver-master/ws/src/extension/importer/rest/target/gs-importer-rest-2.14-SNAPSHOT-sources.jar>
[INFO]
[INFO] --- maven-source-plugin:2.2.1:test-jar-no-fork (attach-sources) @ gs-importer-rest ---
[INFO] Building jar: <https://build.geoserver.org/job/geoserver-master/ws/src/extension/importer/rest/target/gs-importer-rest-2.14-SNAPSHOT-test-sources.jar>
[INFO]
[INFO] --- fmt-maven-plugin:2.4.0:check (default) @ gs-importer-rest ---
[debug] Using AOSP style
[INFO] Processed 30 files (0 non-complying).
[INFO]
[INFO] --- maven-install-plugin:2.4:install (default-install) @ gs-importer-rest ---
[INFO] Installing <https://build.geoserver.org/job/geoserver-master/ws/src/extension/importer/rest/target/gs-importer-rest-2.14-SNAPSHOT.jar> to /var/jenkins/.m2/repository/org/geoserver/importer/gs-importer-rest/2.14-SNAPSHOT/gs-importer-rest-2.14-SNAPSHOT.jar
[INFO] Installing <https://build.geoserver.org/job/geoserver-master/ws/src/extension/importer/rest/pom.xml> to /var/jenkins/.m2/repository/org/geoserver/importer/gs-importer-rest/2.14-SNAPSHOT/gs-importer-rest-2.14-SNAPSHOT.pom
[INFO] Installing <https://build.geoserver.org/job/geoserver-master/ws/src/extension/importer/rest/target/gs-importer-rest-2.14-SNAPSHOT-tests.jar> to /var/jenkins/.m2/repository/org/geoserver/importer/gs-importer-rest/2.14-SNAPSHOT/gs-importer-rest-2.14-SNAPSHOT-tests.jar
[INFO] Installing <https://build.geoserver.org/job/geoserver-master/ws/src/extension/importer/rest/target/gs-importer-rest-2.14-SNAPSHOT-sources.jar> to /var/jenkins/.m2/repository/org/geoserver/importer/gs-importer-rest/2.14-SNAPSHOT/gs-importer-rest-2.14-SNAPSHOT-sources.jar
[INFO] Installing <https://build.geoserver.org/job/geoserver-master/ws/src/extension/importer/rest/target/gs-importer-rest-2.14-SNAPSHOT-test-sources.jar> to /var/jenkins/.m2/repository/org/geoserver/importer/gs-importer-rest/2.14-SNAPSHOT/gs-importer-rest-2.14-SNAPSHOT-test-sources.jar
[INFO] ------------------------------------------------------------------------
[INFO] Reactor Summary:
[INFO]
[INFO] GeoServer .......................................... SUCCESS [  5.921 s]
[INFO] Core Platform Module ............................... SUCCESS [ 12.938 s]
[INFO] Open Web Service Module ............................ SUCCESS [ 12.000 s]
[INFO] Main Module ........................................ SUCCESS [01:01 min]
[INFO] GeoServer Security Modules ......................... SUCCESS [  0.061 s]
[INFO] GeoServer Security Tests Module .................... SUCCESS [01:16 min]
[INFO] GeoServer JDBC Security Module ..................... SUCCESS [ 38.847 s]
[INFO] GeoServer LDAP Security Module ..................... SUCCESS [ 19.849 s]
[INFO] Web Coverage Service Module ........................ SUCCESS [  4.026 s]
[INFO] Web Coverage Service 1.0 Module .................... SUCCESS [ 15.328 s]
[INFO] Web Coverage Service 1.1 Module .................... SUCCESS [ 18.965 s]
[INFO] Web Coverage Service 2.0 Module .................... SUCCESS [ 37.655 s]
[INFO] Web Feature Service Module ......................... SUCCESS [01:31 min]
[INFO] Web Map Service Module ............................. SUCCESS [01:57 min]
[INFO] KML support for GeoServer .......................... SUCCESS [ 28.417 s]
[INFO] gs-rest ............................................ SUCCESS [ 15.882 s]
[INFO] GeoWebCache (GWC) Module ........................... FAILURE [02:14 min]
[INFO] gs-restconfig ...................................... SUCCESS [01:23 min]
[INFO] gs-restconfig-wcs .................................. SUCCESS [ 15.956 s]
[INFO] gs-restconfig-wfs .................................. SUCCESS [ 17.425 s]
[INFO] gs-restconfig-wms .................................. SUCCESS [ 12.289 s]
[INFO] GeoServer Web Modules .............................. SUCCESS [  0.079 s]
[INFO] Core UI Module ..................................... SUCCESS [01:08 min]
[INFO] WMS UI Module ...................................... SUCCESS [ 31.451 s]
[INFO] GWC UI Module ...................................... SKIPPED
[INFO] WFS UI Module ...................................... SUCCESS [ 10.191 s]
[INFO] Demos Module ....................................... SUCCESS [ 17.489 s]
[INFO] WCS UI Module ...................................... SUCCESS [ 12.287 s]
[INFO] Security UI Modules ................................ SUCCESS [  0.095 s]
[INFO] Security UI Core Module ............................ SUCCESS [01:30 min]
[INFO] Security UI JDBC Module ............................ SUCCESS [01:04 min]
[INFO] Security UI LDAP Module ............................ SUCCESS [ 18.448 s]
[INFO] REST UI Module ..................................... SUCCESS [ 10.131 s]
[INFO] GeoServer Extensions ............................... SUCCESS [  0.060 s]
[INFO] Printing Module .................................... SUCCESS [ 12.060 s]
[INFO] GeoServer Web Application .......................... SKIPPED
[INFO] Community Space .................................... SUCCESS [  0.027 s]
[INFO] Application Schema Support ......................... SUCCESS [  0.026 s]
[INFO] Application Schema Integration Test ................ SUCCESS [02:30 min]
[INFO] Sample DataAccess Integration Test ................. SUCCESS [  9.512 s]
[INFO] ArcSDE DataStore Extension ......................... SUCCESS [ 11.335 s]
[INFO] H2 DataStore Extension ............................. SUCCESS [ 10.615 s]
[INFO] SQL Server DataStore Extension ..................... SUCCESS [  0.892 s]
[INFO] Oracle DataStore Extension ......................... SUCCESS [  0.374 s]
[INFO] MySQL DataStore Extension .......................... SUCCESS [  0.225 s]
[INFO] DB2 DataStore Extension ............................ SUCCESS [  0.203 s]
[INFO] ImageMap Output Format ............................. SUCCESS [  7.396 s]
[INFO] ImageI/O-Ext GDAL Coverage Extension ............... SUCCESS [  4.398 s]
[INFO] JP2K Coverage Extension ............................ SUCCESS [  0.249 s]
[INFO] OGR parent ......................................... SUCCESS [  0.053 s]
[INFO] OGR CORE ........................................... SUCCESS [  2.256 s]
[INFO] OGR WFS ............................................ SUCCESS [  8.525 s]
[INFO] Web Processing Service parent ...................... SUCCESS [  0.059 s]
[INFO] Web Processing Service Module ...................... SUCCESS [01:10 min]
[INFO] OGR WPS ............................................ SUCCESS [ 10.995 s]
[INFO] Excel Output Format ................................ SUCCESS [ 11.781 s]
[INFO] Chart external graphics support .................... SUCCESS [  0.415 s]
[INFO] Feature Generalization Extension ................... SUCCESS [  4.075 s]
[INFO] Image Mosaic JDBC Extension ........................ SUCCESS [  0.488 s]
[INFO] OWS request flow controller ........................ SUCCESS [ 17.175 s]
[INFO] Web process status sharing with Hazelcast .......... SUCCESS [ 22.851 s]
[INFO] Web Processing Service GUI ......................... SUCCESS [ 23.085 s]
[INFO] GeoServer Layer Querying filter functions .......... SUCCESS [ 13.209 s]
[INFO] Teradata DataStore Extension ....................... SUCCESS [  2.076 s]
[INFO] GeoServer Monitor Extensions ....................... SUCCESS [  0.051 s]
[INFO] Core Monitor Extension ............................. SKIPPED
[INFO] GeoServer Security Extension Modules ............... SUCCESS [  0.043 s]
[INFO] GeoServer CAS Security Module ...................... SUCCESS [  6.868 s]
[INFO] GeoServer Security Extension Web Modules ........... SUCCESS [  0.041 s]
[INFO] GeoServer CAS Security Web Module .................. SUCCESS [  2.331 s]
[INFO] XLST based WFS output format ....................... SUCCESS [ 16.995 s]
[INFO] GeoServer INSPIRE Extensions ....................... SKIPPED
[INFO] GeoServer CSS Styling .............................. SUCCESS [ 15.157 s]
[INFO] Catalog Services for the Web parent ................ SUCCESS [  0.071 s]
[INFO] Catalog Services for the Web interfaces ............ SUCCESS [  8.966 s]
[INFO] Catalog Services for the Web - Simple CatalogStore implementation SUCCESS [  8.613 s]
[INFO] Catalog Services for the Web core module ........... SUCCESS [ 31.385 s]
[INFO] CSW UI Module ...................................... SUCCESS [ 10.184 s]
[INFO] DXF WFS output format and WPS PPIO ................. SUCCESS [  0.040 s]
[INFO] DXF WFS output format .............................. SUCCESS [ 11.466 s]
[INFO] DXF WPS PPIO ....................................... SUCCESS [  8.549 s]
[INFO] GeoServer WCS 2.0 Earth Observation Extensions ..... SUCCESS [  0.040 s]
[INFO] Web Coverage Service 2.0 Earth Observation extensions SUCCESS [ 19.456 s]
[INFO] Web Coverage Service 2.0 Earth Observation GUI extension SUCCESS [ 14.401 s]
[INFO] GeoServer libjpeg-turbo Module ..................... SUCCESS [  8.305 s]
[INFO] GeoServer Data Importer ............................ SUCCESS [  0.050 s]
[INFO] Importer Core Module ............................... SUCCESS [ 49.624 s]
[INFO] Importer REST Api Module-ng ........................ SUCCESS [ 41.108 s]
[INFO] Importer Berkley DB Persistence Module ............. SUCCESS [ 14.174 s]
[INFO] Importer Web UI Module ............................. SUCCESS [ 13.007 s]
[INFO] GRIB Coverage Format ............................... SUCCESS [ 14.692 s]
[INFO] NetCDF Coverage format ............................. SUCCESS [ 15.919 s]
[INFO] WCS NetCDF output Module ........................... SUCCESS [ 52.050 s]
[INFO] Vector Tiles ....................................... SUCCESS [ 13.924 s]
[INFO] Ysld GeoServer Plugin .............................. SKIPPED
[INFO] MongoDB Data Store ................................. SUCCESS [  1.922 s]
[INFO] ------------------------------------------------------------------------
[INFO] BUILD FAILURE
[INFO] ------------------------------------------------------------------------
[INFO] Total time: 16:46 min (Wall Clock)
[INFO] Finished at: 2018-06-13T12:48:59+00:00
[INFO] Final Memory: 141M/1418M
[INFO] ------------------------------------------------------------------------
[ERROR] Failed to execute goal org.apache.maven.plugins:maven-surefire-plugin:2.12.3:test (default-test) on project gs-gwc: There are test failures.
[ERROR]
[ERROR] Please refer to <https://build.geoserver.org/job/geoserver-master/ws/src/gwc/target/surefire-reports> for the individual test results.
[ERROR] -> [Help 1]
[ERROR]
[ERROR] To see the full stack trace of the errors, re-run Maven with the -e switch.
[ERROR] Re-run Maven using the -X switch to enable full debug logging.
[ERROR]
[ERROR] For more information about the errors and possible solutions, please read the following articles:
[ERROR] [Help 1] http://cwiki.apache.org/confluence/display/MAVEN/MojoFailureException
[ERROR]
[ERROR] After correcting the problems, you can resume the build with the command
[ERROR]   mvn <goals> -rf :gs-gwc
Build step 'Invoke top-level Maven targets' marked build as failure
Not sending mail to unregistered user [hidden email]

------------------------------------------------------------------------------
Check out the vibrant tech community on one of the world's most
engaging tech sites, Slashdot.org! http://sdm.link/slashdot
_______________________________________________
Geoserver-devel mailing list
[hidden email]
https://lists.sourceforge.net/lists/listinfo/geoserver-devel
Reply | Threaded
Open this post in threaded view
|

Build failed in Jenkins: geoserver-master #5921

monitor
See <https://build.geoserver.org/job/geoserver-master/5921/display/redirect>

------------------------------------------
[...truncated 11.11 MB...]
[INFO] --- maven-install-plugin:2.4:install (default-install) @ gs-web-sec-cas ---
[INFO] Installing <https://build.geoserver.org/job/geoserver-master/ws/src/extension/security/web/web-cas/target/gs-web-sec-cas-2.14-SNAPSHOT.jar> to /var/jenkins/.m2/repository/org/geoserver/security/gs-web-sec-cas/2.14-SNAPSHOT/gs-web-sec-cas-2.14-SNAPSHOT.jar
[INFO] Installing <https://build.geoserver.org/job/geoserver-master/ws/src/extension/security/web/web-cas/pom.xml> to /var/jenkins/.m2/repository/org/geoserver/security/gs-web-sec-cas/2.14-SNAPSHOT/gs-web-sec-cas-2.14-SNAPSHOT.pom
[INFO] Installing <https://build.geoserver.org/job/geoserver-master/ws/src/extension/security/web/web-cas/target/gs-web-sec-cas-2.14-SNAPSHOT-tests.jar> to /var/jenkins/.m2/repository/org/geoserver/security/gs-web-sec-cas/2.14-SNAPSHOT/gs-web-sec-cas-2.14-SNAPSHOT-tests.jar
[INFO] Installing <https://build.geoserver.org/job/geoserver-master/ws/src/extension/security/web/web-cas/target/gs-web-sec-cas-2.14-SNAPSHOT-sources.jar> to /var/jenkins/.m2/repository/org/geoserver/security/gs-web-sec-cas/2.14-SNAPSHOT/gs-web-sec-cas-2.14-SNAPSHOT-sources.jar
Jun 14, 2018 5:21:04 PM org.geoserver.importer.Importer copyFromFeatureReader
INFO: load to target took 16
Jun 14, 2018 5:21:06 PM org.geoserver.catalog.ResourcePool getFeatureType
WARNING: Error while getting feature type, flushing cache and retrying: Failed to find the datastore factory for dummy, did you forget to install the store extension jar?
Jun 14, 2018 5:21:06 PM org.geoserver.importer.Importer copyFromFeatureReader
INFO: load to target took 16
14 Jun 17:21:07 ERROR [geoserver.rest] - No such import: 0
org.geoserver.rest.RestException 404 NOT_FOUND: No such import: 0
        at org.geoserver.importer.rest.ImportBaseController.context(ImportBaseController.java:43)
        at org.geoserver.importer.rest.ImportBaseController.context(ImportBaseController.java:27)
        at org.geoserver.importer.rest.ImportBaseController.context(ImportBaseController.java:23)
        at org.geoserver.importer.rest.ImportController.getImports(ImportController.java:107)
        at sun.reflect.GeneratedMethodAccessor259.invoke(Unknown Source)
        at sun.reflect.DelegatingMethodAccessorImpl.invoke(DelegatingMethodAccessorImpl.java:43)
        at java.lang.reflect.Method.invoke(Method.java:498)
        at org.springframework.web.method.support.InvocableHandlerMethod.doInvoke(InvocableHandlerMethod.java:205)
        at org.springframework.web.method.support.InvocableHandlerMethod.invokeForRequest(InvocableHandlerMethod.java:133)
        at org.springframework.web.servlet.mvc.method.annotation.ServletInvocableHandlerMethod.invokeAndHandle(ServletInvocableHandlerMethod.java:97)
        at org.springframework.web.servlet.mvc.method.annotation.RequestMappingHandlerAdapter.invokeHandlerMethod(RequestMappingHandlerAdapter.java:827)
        at org.springframework.web.servlet.mvc.method.annotation.RequestMappingHandlerAdapter.handleInternal(RequestMappingHandlerAdapter.java:738)
        at org.springframework.web.servlet.mvc.method.AbstractHandlerMethodAdapter.handle(AbstractHandlerMethodAdapter.java:85)
        at org.springframework.web.servlet.DispatcherServlet.doDispatch(DispatcherServlet.java:967)
        at org.springframework.web.servlet.DispatcherServlet.doService(DispatcherServlet.java:901)
        at org.springframework.web.servlet.FrameworkServlet.processRequest(FrameworkServlet.java:970)
        at org.springframework.web.servlet.FrameworkServlet.doGet(FrameworkServlet.java:861)
        at javax.servlet.http.HttpServlet.service(HttpServlet.java:668)
        at org.springframework.web.servlet.FrameworkServlet.service(FrameworkServlet.java:846)
        at javax.servlet.http.HttpServlet.service(HttpServlet.java:770)
        at org.geoserver.test.GeoServerSystemTestSupport$2.service(GeoServerSystemTestSupport.java:1636)
        at javax.servlet.http.HttpServlet.service(HttpServlet.java:770)
        at org.springframework.mock.web.MockFilterChain$ServletFilterProxy.doFilter(MockFilterChain.java:160)
        at org.springframework.mock.web.MockFilterChain.doFilter(MockFilterChain.java:127)
        at org.geoserver.test.GeoServerSystemTestSupport.dispatch(GeoServerSystemTestSupport.java:1665)
        at org.geoserver.test.GeoServerSystemTestSupport.dispatch(GeoServerSystemTestSupport.java:1576)
        at org.geoserver.test.GeoServerSystemTestSupport.getAsServletResponse(GeoServerSystemTestSupport.java:1048)
        at org.geoserver.test.GeoServerSystemTestSupport.getAsServletResponse(GeoServerSystemTestSupport.java:1031)
        at org.geoserver.importer.rest.ImporterIntegrationTest.testDirectExecuteInternal(ImporterIntegrationTest.java:337)
        at org.geoserver.importer.rest.ImporterIntegrationTest.testDirectExecuteSync(ImporterIntegrationTest.java:255)
        at sun.reflect.NativeMethodAccessorImpl.invoke0(Native Method)
        at sun.reflect.NativeMethodAccessorImpl.invoke(NativeMethodAccessorImpl.java:62)
        at sun.reflect.DelegatingMethodAccessorImpl.invoke(DelegatingMethodAccessorImpl.java:43)
        at java.lang.reflect.Method.invoke(Method.java:498)
        at org.junit.runners.model.FrameworkMethod$1.runReflectiveCall(FrameworkMethod.java:47)
        at org.junit.internal.runners.model.ReflectiveCallable.run(ReflectiveCallable.java:12)
        at org.junit.runners.model.FrameworkMethod.invokeExplosively(FrameworkMethod.java:44)
        at org.junit.internal.runners.statements.InvokeMethod.evaluate(InvokeMethod.java:17)
        at org.junit.internal.runners.statements.RunBefores.evaluate(RunBefores.java:26)
        at org.junit.internal.runners.statements.RunAfters.evaluate(RunAfters.java:27)
        at org.junit.rules.RunRules.evaluate(RunRules.java:20)
        at org.junit.runners.ParentRunner.runLeaf(ParentRunner.java:271)
        at org.junit.runners.BlockJUnit4ClassRunner.runChild(BlockJUnit4ClassRunner.java:70)
        at org.junit.runners.BlockJUnit4ClassRunner.runChild(BlockJUnit4ClassRunner.java:50)
        at org.junit.runners.ParentRunner$3.run(ParentRunner.java:238)
        at org.junit.runners.ParentRunner$1.schedule(ParentRunner.java:63)
        at org.junit.runners.ParentRunner.runChildren(ParentRunner.java:236)
        at org.junit.runners.ParentRunner.access$000(ParentRunner.java:53)
        at org.junit.runners.ParentRunner$2.evaluate(ParentRunner.java:229)
        at org.junit.internal.runners.statements.RunBefores.evaluate(RunBefores.java:26)
        at org.junit.internal.runners.statements.RunAfters.evaluate(RunAfters.java:27)
        at org.junit.runners.ParentRunner.run(ParentRunner.java:309)
        at org.apache.maven.surefire.junit4.JUnit4Provider.execute(JUnit4Provider.java:252)
        at org.apache.maven.surefire.junit4.JUnit4Provider.executeTestSet(JUnit4Provider.java:141)
        at org.apache.maven.surefire.junit4.JUnit4Provider.invoke(JUnit4Provider.java:112)
        at sun.reflect.NativeMethodAccessorImpl.invoke0(Native Method)
        at sun.reflect.NativeMethodAccessorImpl.invoke(NativeMethodAccessorImpl.java:62)
        at sun.reflect.DelegatingMethodAccessorImpl.invoke(DelegatingMethodAccessorImpl.java:43)
        at java.lang.reflect.Method.invoke(Method.java:498)
        at org.apache.maven.surefire.util.ReflectionUtils.invokeMethodWithArray(ReflectionUtils.java:189)
        at org.apache.maven.surefire.booter.ProviderFactory$ProviderProxy.invoke(ProviderFactory.java:165)
        at org.apache.maven.surefire.booter.ProviderFactory.invokeProvider(ProviderFactory.java:85)
        at org.apache.maven.surefire.booter.ForkedBooter.runSuitesInProcess(ForkedBooter.java:115)
        at org.apache.maven.surefire.booter.ForkedBooter.main(ForkedBooter.java:75)
Jun 14, 2018 5:21:07 PM org.geoserver.importer.Importer copyFromFeatureReader
INFO: load to target took 14
Jun 14, 2018 5:21:08 PM org.geoserver.catalog.ResourcePool getFeatureType
WARNING: Error while getting feature type, flushing cache and retrying: Failed to find the datastore factory for dummy, did you forget to install the store extension jar?
Jun 14, 2018 5:21:09 PM org.geoserver.catalog.ResourcePool getFeatureType
WARNING: Error while getting feature type, flushing cache and retrying: Failed to find the datastore factory for dummy, did you forget to install the store extension jar?
Jun 14, 2018 5:21:09 PM org.geoserver.catalog.ResourcePool getFeatureType
WARNING: Error while getting feature type, flushing cache and retrying: Failed to find the datastore factory for dummy, did you forget to install the store extension jar?
Tests run: 14, Failures: 0, Errors: 0, Skipped: 0, Time elapsed: 13.48 sec
Running org.geoserver.importer.rest.PostScriptTransformTest
Tests run: 1, Failures: 0, Errors: 0, Skipped: 0, Time elapsed: 0.015 sec
Running org.geoserver.importer.rest.converters.ImportJSONIOTest
Jun 14, 2018 5:21:09 PM org.geoserver.platform.GeoServerExtensions checkContext
WARNING: Extension lookup 'GeoServerSecurityProvider', but ApplicationContext is unset.
Jun 14, 2018 5:21:09 PM org.geoserver.platform.GeoServerExtensions checkContext
WARNING: Extension lookup 'ExtensionFilter', but ApplicationContext is unset.
Jun 14, 2018 5:21:09 PM org.geoserver.platform.GeoServerExtensions checkContext
WARNING: Extension lookup 'ExtensionProvider', but ApplicationContext is unset.
Jun 14, 2018 5:21:09 PM org.geoserver.platform.GeoServerExtensions checkContext
WARNING: Extension lookup 'ExtensionFilter', but ApplicationContext is unset.
Jun 14, 2018 5:21:10 PM org.geoserver.importer.Importer createContextStore
INFO: Enabling import store: memory
Tests run: 4, Failures: 0, Errors: 0, Skipped: 0, Time elapsed: 0.768 sec

Results :

Tests run: 73, Failures: 0, Errors: 0, Skipped: 0

[INFO]
[INFO] --- maven-jar-plugin:2.4:jar (default-jar) @ gs-importer-rest ---
[INFO] Building jar: <https://build.geoserver.org/job/geoserver-master/ws/src/extension/importer/rest/target/gs-importer-rest-2.14-SNAPSHOT.jar>
[INFO]
[INFO] --- maven-jar-plugin:2.4:test-jar (default) @ gs-importer-rest ---
[INFO] Building jar: <https://build.geoserver.org/job/geoserver-master/ws/src/extension/importer/rest/target/gs-importer-rest-2.14-SNAPSHOT-tests.jar>
[INFO]
[INFO] --- maven-source-plugin:2.2.1:jar-no-fork (attach-sources) @ gs-importer-rest ---
[INFO] Building jar: <https://build.geoserver.org/job/geoserver-master/ws/src/extension/importer/rest/target/gs-importer-rest-2.14-SNAPSHOT-sources.jar>
[INFO]
[INFO] --- maven-source-plugin:2.2.1:test-jar-no-fork (attach-sources) @ gs-importer-rest ---
[INFO] Building jar: <https://build.geoserver.org/job/geoserver-master/ws/src/extension/importer/rest/target/gs-importer-rest-2.14-SNAPSHOT-test-sources.jar>
[INFO]
[INFO] --- fmt-maven-plugin:2.4.0:check (default) @ gs-importer-rest ---
[debug] Using AOSP style
[INFO] Processed 30 files (0 non-complying).
[INFO]
[INFO] --- maven-install-plugin:2.4:install (default-install) @ gs-importer-rest ---
[INFO] Installing <https://build.geoserver.org/job/geoserver-master/ws/src/extension/importer/rest/target/gs-importer-rest-2.14-SNAPSHOT.jar> to /var/jenkins/.m2/repository/org/geoserver/importer/gs-importer-rest/2.14-SNAPSHOT/gs-importer-rest-2.14-SNAPSHOT.jar
[INFO] Installing <https://build.geoserver.org/job/geoserver-master/ws/src/extension/importer/rest/pom.xml> to /var/jenkins/.m2/repository/org/geoserver/importer/gs-importer-rest/2.14-SNAPSHOT/gs-importer-rest-2.14-SNAPSHOT.pom
[INFO] Installing <https://build.geoserver.org/job/geoserver-master/ws/src/extension/importer/rest/target/gs-importer-rest-2.14-SNAPSHOT-tests.jar> to /var/jenkins/.m2/repository/org/geoserver/importer/gs-importer-rest/2.14-SNAPSHOT/gs-importer-rest-2.14-SNAPSHOT-tests.jar
[INFO] Installing <https://build.geoserver.org/job/geoserver-master/ws/src/extension/importer/rest/target/gs-importer-rest-2.14-SNAPSHOT-sources.jar> to /var/jenkins/.m2/repository/org/geoserver/importer/gs-importer-rest/2.14-SNAPSHOT/gs-importer-rest-2.14-SNAPSHOT-sources.jar
[INFO] Installing <https://build.geoserver.org/job/geoserver-master/ws/src/extension/importer/rest/target/gs-importer-rest-2.14-SNAPSHOT-test-sources.jar> to /var/jenkins/.m2/repository/org/geoserver/importer/gs-importer-rest/2.14-SNAPSHOT/gs-importer-rest-2.14-SNAPSHOT-test-sources.jar
[INFO] ------------------------------------------------------------------------
[INFO] Reactor Summary:
[INFO]
[INFO] GeoServer .......................................... SUCCESS [  6.458 s]
[INFO] Core Platform Module ............................... SUCCESS [ 13.135 s]
[INFO] Open Web Service Module ............................ SUCCESS [ 11.768 s]
[INFO] Main Module ........................................ SUCCESS [01:04 min]
[INFO] GeoServer Security Modules ......................... SUCCESS [  0.065 s]
[INFO] GeoServer Security Tests Module .................... SUCCESS [01:14 min]
[INFO] GeoServer JDBC Security Module ..................... SUCCESS [ 35.321 s]
[INFO] GeoServer LDAP Security Module ..................... SUCCESS [ 19.994 s]
[INFO] Web Coverage Service Module ........................ SUCCESS [  4.427 s]
[INFO] Web Coverage Service 1.0 Module .................... SUCCESS [ 16.077 s]
[INFO] Web Coverage Service 1.1 Module .................... SUCCESS [ 18.717 s]
[INFO] Web Coverage Service 2.0 Module .................... SUCCESS [ 40.143 s]
[INFO] Web Feature Service Module ......................... SUCCESS [01:36 min]
[INFO] Web Map Service Module ............................. SUCCESS [01:55 min]
[INFO] KML support for GeoServer .......................... SUCCESS [ 29.399 s]
[INFO] gs-rest ............................................ SUCCESS [ 15.609 s]
[INFO] GeoWebCache (GWC) Module ........................... FAILURE [02:21 min]
[INFO] gs-restconfig ...................................... SUCCESS [01:24 min]
[INFO] gs-restconfig-wcs .................................. SUCCESS [ 19.705 s]
[INFO] gs-restconfig-wfs .................................. SUCCESS [ 18.026 s]
[INFO] gs-restconfig-wms .................................. SUCCESS [ 12.625 s]
[INFO] GeoServer Web Modules .............................. SUCCESS [  0.067 s]
[INFO] Core UI Module ..................................... SUCCESS [01:08 min]
[INFO] WMS UI Module ...................................... SUCCESS [ 31.469 s]
[INFO] GWC UI Module ...................................... SKIPPED
[INFO] WFS UI Module ...................................... SUCCESS [ 10.326 s]
[INFO] Demos Module ....................................... SUCCESS [ 16.986 s]
[INFO] WCS UI Module ...................................... SUCCESS [ 11.868 s]
[INFO] Security UI Modules ................................ SUCCESS [  0.083 s]
[INFO] Security UI Core Module ............................ SUCCESS [01:34 min]
[INFO] Security UI JDBC Module ............................ SUCCESS [01:08 min]
[INFO] Security UI LDAP Module ............................ SUCCESS [ 18.731 s]
[INFO] REST UI Module ..................................... SUCCESS [ 10.551 s]
[INFO] GeoServer Extensions ............................... SUCCESS [  0.050 s]
[INFO] Printing Module .................................... SUCCESS [ 13.087 s]
[INFO] GeoServer Web Application .......................... SKIPPED
[INFO] Community Space .................................... SUCCESS [  0.061 s]
[INFO] Application Schema Support ......................... SUCCESS [  0.024 s]
[INFO] Application Schema Integration Test ................ SUCCESS [02:30 min]
[INFO] Sample DataAccess Integration Test ................. SUCCESS [  9.754 s]
[INFO] ArcSDE DataStore Extension ......................... SUCCESS [ 10.735 s]
[INFO] H2 DataStore Extension ............................. SUCCESS [ 10.402 s]
[INFO] SQL Server DataStore Extension ..................... SUCCESS [  0.929 s]
[INFO] Oracle DataStore Extension ......................... SUCCESS [  0.380 s]
[INFO] MySQL DataStore Extension .......................... SUCCESS [  0.223 s]
[INFO] DB2 DataStore Extension ............................ SUCCESS [  0.198 s]
[INFO] ImageMap Output Format ............................. SUCCESS [  7.527 s]
[INFO] ImageI/O-Ext GDAL Coverage Extension ............... SUCCESS [  4.574 s]
[INFO] JP2K Coverage Extension ............................ SUCCESS [  0.271 s]
[INFO] OGR parent ......................................... SUCCESS [  0.070 s]
[INFO] OGR CORE ........................................... SUCCESS [  2.328 s]
[INFO] OGR WFS ............................................ SUCCESS [  9.124 s]
[INFO] Web Processing Service parent ...................... SUCCESS [  0.058 s]
[INFO] Web Processing Service Module ...................... SUCCESS [01:09 min]
[INFO] OGR WPS ............................................ SUCCESS [ 10.977 s]
[INFO] Excel Output Format ................................ SUCCESS [ 12.124 s]
[INFO] Chart external graphics support .................... SUCCESS [  0.510 s]
[INFO] Feature Generalization Extension ................... SUCCESS [  2.379 s]
[INFO] Image Mosaic JDBC Extension ........................ SUCCESS [  0.547 s]
[INFO] OWS request flow controller ........................ SUCCESS [ 17.307 s]
[INFO] Web process status sharing with Hazelcast .......... SUCCESS [ 24.848 s]
[INFO] Web Processing Service GUI ......................... SUCCESS [ 23.303 s]
[INFO] GeoServer Layer Querying filter functions .......... SUCCESS [ 13.376 s]
[INFO] Teradata DataStore Extension ....................... SUCCESS [  1.925 s]
[INFO] GeoServer Monitor Extensions ....................... SUCCESS [  0.077 s]
[INFO] Core Monitor Extension ............................. SKIPPED
[INFO] GeoServer Security Extension Modules ............... SUCCESS [  0.035 s]
[INFO] GeoServer CAS Security Module ...................... SUCCESS [  6.877 s]
[INFO] GeoServer Security Extension Web Modules ........... SUCCESS [  0.035 s]
[INFO] GeoServer CAS Security Web Module .................. SUCCESS [  2.196 s]
[INFO] XLST based WFS output format ....................... SUCCESS [ 17.383 s]
[INFO] GeoServer INSPIRE Extensions ....................... SKIPPED
[INFO] GeoServer CSS Styling .............................. SUCCESS [ 15.648 s]
[INFO] Catalog Services for the Web parent ................ SUCCESS [  0.070 s]
[INFO] Catalog Services for the Web interfaces ............ SUCCESS [  9.007 s]
[INFO] Catalog Services for the Web - Simple CatalogStore implementation SUCCESS [  8.379 s]
[INFO] Catalog Services for the Web core module ........... SUCCESS [ 31.760 s]
[INFO] CSW UI Module ...................................... SUCCESS [ 10.866 s]
[INFO] DXF WFS output format and WPS PPIO ................. SUCCESS [  0.060 s]
[INFO] DXF WFS output format .............................. SUCCESS [ 11.757 s]
[INFO] DXF WPS PPIO ....................................... SUCCESS [ 10.788 s]
[INFO] GeoServer WCS 2.0 Earth Observation Extensions ..... SUCCESS [  0.033 s]
[INFO] Web Coverage Service 2.0 Earth Observation extensions SUCCESS [ 15.914 s]
[INFO] Web Coverage Service 2.0 Earth Observation GUI extension SUCCESS [ 12.002 s]
[INFO] GeoServer libjpeg-turbo Module ..................... SUCCESS [  8.921 s]
[INFO] GeoServer Data Importer ............................ SUCCESS [  0.068 s]
[INFO] Importer Core Module ............................... SUCCESS [ 49.610 s]
[INFO] Importer REST Api Module-ng ........................ SUCCESS [ 41.001 s]
[INFO] Importer Berkley DB Persistence Module ............. SUCCESS [ 14.051 s]
[INFO] Importer Web UI Module ............................. SUCCESS [ 14.150 s]
[INFO] GRIB Coverage Format ............................... SUCCESS [ 14.529 s]
[INFO] NetCDF Coverage format ............................. SUCCESS [ 15.784 s]
[INFO] WCS NetCDF output Module ........................... SUCCESS [ 53.652 s]
[INFO] Vector Tiles ....................................... SUCCESS [ 13.661 s]
[INFO] Ysld GeoServer Plugin .............................. SKIPPED
[INFO] MongoDB Data Store ................................. SUCCESS [  1.914 s]
[INFO] ------------------------------------------------------------------------
[INFO] BUILD FAILURE
[INFO] ------------------------------------------------------------------------
[INFO] Total time: 17:02 min (Wall Clock)
[INFO] Finished at: 2018-06-14T17:21:10+00:00
[INFO] Final Memory: 138M/1469M
[INFO] ------------------------------------------------------------------------
[ERROR] Failed to execute goal org.apache.maven.plugins:maven-surefire-plugin:2.12.3:test (default-test) on project gs-gwc: There are test failures.
[ERROR]
[ERROR] Please refer to <https://build.geoserver.org/job/geoserver-master/ws/src/gwc/target/surefire-reports> for the individual test results.
[ERROR] -> [Help 1]
[ERROR]
[ERROR] To see the full stack trace of the errors, re-run Maven with the -e switch.
[ERROR] Re-run Maven using the -X switch to enable full debug logging.
[ERROR]
[ERROR] For more information about the errors and possible solutions, please read the following articles:
[ERROR] [Help 1] http://cwiki.apache.org/confluence/display/MAVEN/MojoFailureException
[ERROR]
[ERROR] After correcting the problems, you can resume the build with the command
[ERROR]   mvn <goals> -rf :gs-gwc
Build step 'Invoke top-level Maven targets' marked build as failure
Not sending mail to unregistered user [hidden email]

------------------------------------------------------------------------------
Check out the vibrant tech community on one of the world's most
engaging tech sites, Slashdot.org! http://sdm.link/slashdot
_______________________________________________
Geoserver-devel mailing list
[hidden email]
https://lists.sourceforge.net/lists/listinfo/geoserver-devel
Reply | Threaded
Open this post in threaded view
|

Build failed in Jenkins: geoserver-master #5922

monitor
See <https://build.geoserver.org/job/geoserver-master/5922/display/redirect>

------------------------------------------
[...truncated 11.11 MB...]
Jun 14, 2018 5:42:08 PM org.geoserver.catalog.ResourcePool getFeatureType
WARNING: Error while getting feature type, flushing cache and retrying: Failed to find the datastore factory for dummy, did you forget to install the store extension jar?
Jun 14, 2018 5:42:08 PM org.geoserver.catalog.ResourcePool getFeatureType
WARNING: Error while getting feature type, flushing cache and retrying: Failed to find the datastore factory for dummy, did you forget to install the store extension jar?
Tests run: 1, Failures: 0, Errors: 0, Skipped: 0, Time elapsed: 4.856 sec

Results :

Tests run: 1, Failures: 0, Errors: 0, Skipped: 0

[INFO]
[INFO] --- maven-jar-plugin:2.4:jar (default-jar) @ gs-web-csw ---
[INFO] Building jar: <https://build.geoserver.org/job/geoserver-master/ws/src/extension/csw/web-csw/target/gs-web-csw-2.14-SNAPSHOT.jar>
[INFO]
[INFO] --- maven-jar-plugin:2.4:test-jar (default) @ gs-web-csw ---
[INFO] Building jar: <https://build.geoserver.org/job/geoserver-master/ws/src/extension/csw/web-csw/target/gs-web-csw-2.14-SNAPSHOT-tests.jar>
[INFO]
[INFO] --- maven-source-plugin:2.2.1:jar-no-fork (attach-sources) @ gs-web-csw ---
[INFO] Building jar: <https://build.geoserver.org/job/geoserver-master/ws/src/extension/csw/web-csw/target/gs-web-csw-2.14-SNAPSHOT-sources.jar>
[INFO]
[INFO] --- maven-source-plugin:2.2.1:test-jar-no-fork (attach-sources) @ gs-web-csw ---
[INFO] Building jar: <https://build.geoserver.org/job/geoserver-master/ws/src/extension/csw/web-csw/target/gs-web-csw-2.14-SNAPSHOT-test-sources.jar>
[INFO]
[INFO] --- fmt-maven-plugin:2.4.0:check (default) @ gs-web-csw ---
[debug] Using AOSP style
Tests run: 14, Failures: 0, Errors: 0, Skipped: 0, Time elapsed: 14.185 sec
Running org.geoserver.importer.rest.PostScriptTransformTest
[INFO] Processed 3 files (0 non-complying).
[INFO]
[INFO] --- maven-install-plugin:2.4:install (default-install) @ gs-web-csw ---
[INFO] Installing <https://build.geoserver.org/job/geoserver-master/ws/src/extension/csw/web-csw/target/gs-web-csw-2.14-SNAPSHOT.jar> to /var/jenkins/.m2/repository/org/geoserver/csw/gs-web-csw/2.14-SNAPSHOT/gs-web-csw-2.14-SNAPSHOT.jar
[INFO] Installing <https://build.geoserver.org/job/geoserver-master/ws/src/extension/csw/web-csw/pom.xml> to /var/jenkins/.m2/repository/org/geoserver/csw/gs-web-csw/2.14-SNAPSHOT/gs-web-csw-2.14-SNAPSHOT.pom
[INFO] Installing <https://build.geoserver.org/job/geoserver-master/ws/src/extension/csw/web-csw/target/gs-web-csw-2.14-SNAPSHOT-tests.jar> to /var/jenkins/.m2/repository/org/geoserver/csw/gs-web-csw/2.14-SNAPSHOT/gs-web-csw-2.14-SNAPSHOT-tests.jar
[INFO] Installing <https://build.geoserver.org/job/geoserver-master/ws/src/extension/csw/web-csw/target/gs-web-csw-2.14-SNAPSHOT-sources.jar> to /var/jenkins/.m2/repository/org/geoserver/csw/gs-web-csw/2.14-SNAPSHOT/gs-web-csw-2.14-SNAPSHOT-sources.jar
[INFO] Installing <https://build.geoserver.org/job/geoserver-master/ws/src/extension/csw/web-csw/target/gs-web-csw-2.14-SNAPSHOT-test-sources.jar> to /var/jenkins/.m2/repository/org/geoserver/csw/gs-web-csw/2.14-SNAPSHOT/gs-web-csw-2.14-SNAPSHOT-test-sources.jar
[INFO]                                                                        
[INFO] ------------------------------------------------------------------------
[INFO] Building GeoServer CAS Security Web Module 2.14-SNAPSHOT
[INFO] ------------------------------------------------------------------------
Tests run: 1, Failures: 0, Errors: 0, Skipped: 0, Time elapsed: 0.016 sec
Running org.geoserver.importer.rest.converters.ImportJSONIOTest
[INFO]
[INFO] --- maven-clean-plugin:2.5:clean (default-clean) @ gs-web-sec-cas ---
[INFO] Deleting <https://build.geoserver.org/job/geoserver-master/ws/src/extension/security/web/web-cas/target>
[INFO]
[INFO] --- git-commit-id-plugin:2.1.15:revision (default) @ gs-web-sec-cas ---
[INFO]
[INFO] --- maven-resources-plugin:2.6:resources (default-resources) @ gs-web-sec-cas ---
[INFO] Using 'UTF-8' encoding to copy filtered resources.
[INFO] Copying 2 resources
[INFO] skip non existing resourceDirectory <https://build.geoserver.org/job/geoserver-master/ws/src/extension/security/web/web-cas/src/main/resources>
[INFO]
[INFO] --- maven-compiler-plugin:2.3.2:compile (default-compile) @ gs-web-sec-cas ---
[INFO] Compiling 2 source files to <https://build.geoserver.org/job/geoserver-master/ws/src/extension/security/web/web-cas/target/classes>
Jun 14, 2018 5:42:08 PM org.geoserver.platform.GeoServerExtensions checkContext
WARNING: Extension lookup 'GeoServerSecurityProvider', but ApplicationContext is unset.
Jun 14, 2018 5:42:08 PM org.geoserver.platform.GeoServerExtensions checkContext
WARNING: Extension lookup 'ExtensionFilter', but ApplicationContext is unset.
Jun 14, 2018 5:42:08 PM org.geoserver.platform.GeoServerExtensions checkContext
WARNING: Extension lookup 'ExtensionProvider', but ApplicationContext is unset.
Jun 14, 2018 5:42:08 PM org.geoserver.platform.GeoServerExtensions checkContext
WARNING: Extension lookup 'ExtensionFilter', but ApplicationContext is unset.
Jun 14, 2018 5:42:09 PM org.geoserver.importer.Importer createContextStore
INFO: Enabling import store: memory
Tests run: 4, Failures: 0, Errors: 0, Skipped: 0, Time elapsed: 1.365 sec

Results :

Tests run: 73, Failures: 0, Errors: 0, Skipped: 0

[INFO]
[INFO] --- maven-jar-plugin:2.4:jar (default-jar) @ gs-importer-rest ---
[INFO] Building jar: <https://build.geoserver.org/job/geoserver-master/ws/src/extension/importer/rest/target/gs-importer-rest-2.14-SNAPSHOT.jar>
[INFO]
[INFO] --- maven-jar-plugin:2.4:test-jar (default) @ gs-importer-rest ---
[INFO] Building jar: <https://build.geoserver.org/job/geoserver-master/ws/src/extension/importer/rest/target/gs-importer-rest-2.14-SNAPSHOT-tests.jar>
[INFO]
[INFO] --- maven-source-plugin:2.2.1:jar-no-fork (attach-sources) @ gs-importer-rest ---
[INFO] Building jar: <https://build.geoserver.org/job/geoserver-master/ws/src/extension/importer/rest/target/gs-importer-rest-2.14-SNAPSHOT-sources.jar>
[INFO]
[INFO] --- maven-source-plugin:2.2.1:test-jar-no-fork (attach-sources) @ gs-importer-rest ---
[INFO] Building jar: <https://build.geoserver.org/job/geoserver-master/ws/src/extension/importer/rest/target/gs-importer-rest-2.14-SNAPSHOT-test-sources.jar>
[INFO]
[INFO] --- fmt-maven-plugin:2.4.0:check (default) @ gs-importer-rest ---
[debug] Using AOSP style
[INFO] Processed 30 files (0 non-complying).
[INFO]
[INFO] --- maven-install-plugin:2.4:install (default-install) @ gs-importer-rest ---
[INFO] Installing <https://build.geoserver.org/job/geoserver-master/ws/src/extension/importer/rest/target/gs-importer-rest-2.14-SNAPSHOT.jar> to /var/jenkins/.m2/repository/org/geoserver/importer/gs-importer-rest/2.14-SNAPSHOT/gs-importer-rest-2.14-SNAPSHOT.jar
[INFO] Installing <https://build.geoserver.org/job/geoserver-master/ws/src/extension/importer/rest/pom.xml> to /var/jenkins/.m2/repository/org/geoserver/importer/gs-importer-rest/2.14-SNAPSHOT/gs-importer-rest-2.14-SNAPSHOT.pom
[INFO] Installing <https://build.geoserver.org/job/geoserver-master/ws/src/extension/importer/rest/target/gs-importer-rest-2.14-SNAPSHOT-tests.jar> to /var/jenkins/.m2/repository/org/geoserver/importer/gs-importer-rest/2.14-SNAPSHOT/gs-importer-rest-2.14-SNAPSHOT-tests.jar
[INFO] Installing <https://build.geoserver.org/job/geoserver-master/ws/src/extension/importer/rest/target/gs-importer-rest-2.14-SNAPSHOT-sources.jar> to /var/jenkins/.m2/repository/org/geoserver/importer/gs-importer-rest/2.14-SNAPSHOT/gs-importer-rest-2.14-SNAPSHOT-sources.jar
[INFO] Installing <https://build.geoserver.org/job/geoserver-master/ws/src/extension/importer/rest/target/gs-importer-rest-2.14-SNAPSHOT-test-sources.jar> to /var/jenkins/.m2/repository/org/geoserver/importer/gs-importer-rest/2.14-SNAPSHOT/gs-importer-rest-2.14-SNAPSHOT-test-sources.jar
[INFO]
[INFO] --- maven-resources-plugin:2.6:testResources (default-testResources) @ gs-web-sec-cas ---
[INFO] Using 'UTF-8' encoding to copy filtered resources.
[INFO] skip non existing resourceDirectory <https://build.geoserver.org/job/geoserver-master/ws/src/extension/security/web/web-cas/src/test/java>
[INFO] skip non existing resourceDirectory <https://build.geoserver.org/job/geoserver-master/ws/src/extension/security/web/web-cas/src/test/resources>
[INFO]
[INFO] --- maven-compiler-plugin:2.3.2:testCompile (default-testCompile) @ gs-web-sec-cas ---
[INFO] No sources to compile
[INFO]
[INFO] --- maven-surefire-plugin:2.12.3:test (default-test) @ gs-web-sec-cas ---
[INFO] No tests to run.
[INFO]
[INFO] --- maven-jar-plugin:2.4:jar (default-jar) @ gs-web-sec-cas ---
[INFO] Building jar: <https://build.geoserver.org/job/geoserver-master/ws/src/extension/security/web/web-cas/target/gs-web-sec-cas-2.14-SNAPSHOT.jar>
[INFO]
[INFO] --- maven-jar-plugin:2.4:test-jar (default) @ gs-web-sec-cas ---
[WARNING] JAR will be empty - no content was marked for inclusion!
[INFO] Building jar: <https://build.geoserver.org/job/geoserver-master/ws/src/extension/security/web/web-cas/target/gs-web-sec-cas-2.14-SNAPSHOT-tests.jar>
[INFO]
[INFO] --- maven-source-plugin:2.2.1:jar-no-fork (attach-sources) @ gs-web-sec-cas ---
[INFO] Building jar: <https://build.geoserver.org/job/geoserver-master/ws/src/extension/security/web/web-cas/target/gs-web-sec-cas-2.14-SNAPSHOT-sources.jar>
[INFO]
[INFO] --- maven-source-plugin:2.2.1:test-jar-no-fork (attach-sources) @ gs-web-sec-cas ---
[INFO] No sources in project. Archive not created.
[INFO]
[INFO] --- fmt-maven-plugin:2.4.0:check (default) @ gs-web-sec-cas ---
[warn] Test source directory '<https://build.geoserver.org/job/geoserver-master/ws/src/extension/security/web/web-cas/src/test/java'> does not exist, ignoring.
[debug] Using AOSP style
[INFO] Processed 2 files (0 non-complying).
[INFO]
[INFO] --- maven-install-plugin:2.4:install (default-install) @ gs-web-sec-cas ---
[INFO] Installing <https://build.geoserver.org/job/geoserver-master/ws/src/extension/security/web/web-cas/target/gs-web-sec-cas-2.14-SNAPSHOT.jar> to /var/jenkins/.m2/repository/org/geoserver/security/gs-web-sec-cas/2.14-SNAPSHOT/gs-web-sec-cas-2.14-SNAPSHOT.jar
[INFO] Installing <https://build.geoserver.org/job/geoserver-master/ws/src/extension/security/web/web-cas/pom.xml> to /var/jenkins/.m2/repository/org/geoserver/security/gs-web-sec-cas/2.14-SNAPSHOT/gs-web-sec-cas-2.14-SNAPSHOT.pom
[INFO] Installing <https://build.geoserver.org/job/geoserver-master/ws/src/extension/security/web/web-cas/target/gs-web-sec-cas-2.14-SNAPSHOT-tests.jar> to /var/jenkins/.m2/repository/org/geoserver/security/gs-web-sec-cas/2.14-SNAPSHOT/gs-web-sec-cas-2.14-SNAPSHOT-tests.jar
[INFO] Installing <https://build.geoserver.org/job/geoserver-master/ws/src/extension/security/web/web-cas/target/gs-web-sec-cas-2.14-SNAPSHOT-sources.jar> to /var/jenkins/.m2/repository/org/geoserver/security/gs-web-sec-cas/2.14-SNAPSHOT/gs-web-sec-cas-2.14-SNAPSHOT-sources.jar
[INFO] ------------------------------------------------------------------------
[INFO] Reactor Summary:
[INFO]
[INFO] GeoServer .......................................... SUCCESS [  5.864 s]
[INFO] Core Platform Module ............................... SUCCESS [ 12.940 s]
[INFO] Open Web Service Module ............................ SUCCESS [ 11.493 s]
[INFO] Main Module ........................................ SUCCESS [01:06 min]
[INFO] GeoServer Security Modules ......................... SUCCESS [  0.070 s]
[INFO] GeoServer Security Tests Module .................... SUCCESS [01:11 min]
[INFO] GeoServer JDBC Security Module ..................... SUCCESS [ 36.140 s]
[INFO] GeoServer LDAP Security Module ..................... SUCCESS [ 20.642 s]
[INFO] Web Coverage Service Module ........................ SUCCESS [  4.469 s]
[INFO] Web Coverage Service 1.0 Module .................... SUCCESS [ 16.836 s]
[INFO] Web Coverage Service 1.1 Module .................... SUCCESS [ 19.450 s]
[INFO] Web Coverage Service 2.0 Module .................... SUCCESS [ 38.924 s]
[INFO] Web Feature Service Module ......................... SUCCESS [01:35 min]
[INFO] Web Map Service Module ............................. SUCCESS [01:55 min]
[INFO] KML support for GeoServer .......................... SUCCESS [ 28.787 s]
[INFO] gs-rest ............................................ SUCCESS [ 15.850 s]
[INFO] GeoWebCache (GWC) Module ........................... FAILURE [02:47 min]
[INFO] gs-restconfig ...................................... SUCCESS [01:26 min]
[INFO] gs-restconfig-wcs .................................. SUCCESS [ 18.307 s]
[INFO] gs-restconfig-wfs .................................. SUCCESS [ 17.822 s]
[INFO] gs-restconfig-wms .................................. SUCCESS [ 12.865 s]
[INFO] GeoServer Web Modules .............................. SUCCESS [  0.084 s]
[INFO] Core UI Module ..................................... SUCCESS [01:08 min]
[INFO] WMS UI Module ...................................... SUCCESS [ 31.477 s]
[INFO] GWC UI Module ...................................... SKIPPED
[INFO] WFS UI Module ...................................... SUCCESS [ 10.195 s]
[INFO] Demos Module ....................................... SUCCESS [ 17.477 s]
[INFO] WCS UI Module ...................................... SUCCESS [ 12.147 s]
[INFO] Security UI Modules ................................ SUCCESS [  0.102 s]
[INFO] Security UI Core Module ............................ SUCCESS [01:33 min]
[INFO] Security UI JDBC Module ............................ SUCCESS [01:06 min]
[INFO] Security UI LDAP Module ............................ SUCCESS [ 18.391 s]
[INFO] REST UI Module ..................................... SUCCESS [ 10.573 s]
[INFO] GeoServer Extensions ............................... SUCCESS [  0.062 s]
[INFO] Printing Module .................................... SUCCESS [ 14.978 s]
[INFO] GeoServer Web Application .......................... SKIPPED
[INFO] Community Space .................................... SUCCESS [  0.034 s]
[INFO] Application Schema Support ......................... SUCCESS [  0.033 s]
[INFO] Application Schema Integration Test ................ SUCCESS [02:30 min]
[INFO] Sample DataAccess Integration Test ................. SUCCESS [  9.646 s]
[INFO] ArcSDE DataStore Extension ......................... SUCCESS [ 11.714 s]
[INFO] H2 DataStore Extension ............................. SUCCESS [ 11.025 s]
[INFO] SQL Server DataStore Extension ..................... SUCCESS [  0.926 s]
[INFO] Oracle DataStore Extension ......................... SUCCESS [  0.408 s]
[INFO] MySQL DataStore Extension .......................... SUCCESS [  0.219 s]
[INFO] DB2 DataStore Extension ............................ SUCCESS [  0.215 s]
[INFO] ImageMap Output Format ............................. SUCCESS [  7.304 s]
[INFO] ImageI/O-Ext GDAL Coverage Extension ............... SUCCESS [  4.128 s]
[INFO] JP2K Coverage Extension ............................ SUCCESS [  0.285 s]
[INFO] OGR parent ......................................... SUCCESS [  0.027 s]
[INFO] OGR CORE ........................................... SUCCESS [  2.304 s]
[INFO] OGR WFS ............................................ SUCCESS [  8.951 s]
[INFO] Web Processing Service parent ...................... SUCCESS [  0.026 s]
[INFO] Web Processing Service Module ...................... SUCCESS [01:02 min]
[INFO] OGR WPS ............................................ SUCCESS [ 10.124 s]
[INFO] Excel Output Format ................................ SUCCESS [ 11.992 s]
[INFO] Chart external graphics support .................... SUCCESS [  0.451 s]
[INFO] Feature Generalization Extension ................... SUCCESS [  2.236 s]
[INFO] Image Mosaic JDBC Extension ........................ SUCCESS [  0.477 s]
[INFO] OWS request flow controller ........................ SUCCESS [ 18.265 s]
[INFO] Web process status sharing with Hazelcast .......... SUCCESS [ 24.293 s]
[INFO] Web Processing Service GUI ......................... SUCCESS [ 22.261 s]
[INFO] GeoServer Layer Querying filter functions .......... SUCCESS [ 13.206 s]
[INFO] Teradata DataStore Extension ....................... SUCCESS [  2.048 s]
[INFO] GeoServer Monitor Extensions ....................... SUCCESS [  0.043 s]
[INFO] Core Monitor Extension ............................. SKIPPED
[INFO] GeoServer Security Extension Modules ............... SUCCESS [  0.039 s]
[INFO] GeoServer CAS Security Module ...................... SUCCESS [  7.007 s]
[INFO] GeoServer Security Extension Web Modules ........... SUCCESS [  0.041 s]
[INFO] GeoServer CAS Security Web Module .................. SUCCESS [  2.113 s]
[INFO] XLST based WFS output format ....................... SUCCESS [ 17.511 s]
[INFO] GeoServer INSPIRE Extensions ....................... SKIPPED
[INFO] GeoServer CSS Styling .............................. SUCCESS [ 15.897 s]
[INFO] Catalog Services for the Web parent ................ SUCCESS [  0.048 s]
[INFO] Catalog Services for the Web interfaces ............ SUCCESS [ 10.945 s]
[INFO] Catalog Services for the Web - Simple CatalogStore implementation SUCCESS [  8.109 s]
[INFO] Catalog Services for the Web core module ........... SUCCESS [ 37.287 s]
[INFO] CSW UI Module ...................................... SUCCESS [  8.818 s]
[INFO] DXF WFS output format and WPS PPIO ................. SUCCESS [  0.020 s]
[INFO] DXF WFS output format .............................. SUCCESS [ 11.748 s]
[INFO] DXF WPS PPIO ....................................... SUCCESS [ 11.143 s]
[INFO] GeoServer WCS 2.0 Earth Observation Extensions ..... SUCCESS [  0.028 s]
[INFO] Web Coverage Service 2.0 Earth Observation extensions SUCCESS [ 15.161 s]
[INFO] Web Coverage Service 2.0 Earth Observation GUI extension SUCCESS [ 12.646 s]
[INFO] GeoServer libjpeg-turbo Module ..................... SUCCESS [  8.881 s]
[INFO] GeoServer Data Importer ............................ SUCCESS [  0.050 s]
[INFO] Importer Core Module ............................... SUCCESS [ 50.421 s]
[INFO] Importer REST Api Module-ng ........................ SUCCESS [ 42.503 s]
[INFO] Importer Berkley DB Persistence Module ............. SUCCESS [ 14.352 s]
[INFO] Importer Web UI Module ............................. SUCCESS [ 13.916 s]
[INFO] GRIB Coverage Format ............................... SUCCESS [ 14.527 s]
[INFO] NetCDF Coverage format ............................. SUCCESS [ 16.381 s]
[INFO] WCS NetCDF output Module ........................... SUCCESS [ 55.759 s]
[INFO] Vector Tiles ....................................... SUCCESS [ 13.826 s]
[INFO] Ysld GeoServer Plugin .............................. SKIPPED
[INFO] MongoDB Data Store ................................. SUCCESS [  1.854 s]
[INFO] ------------------------------------------------------------------------
[INFO] BUILD FAILURE
[INFO] ------------------------------------------------------------------------
[INFO] Total time: 17:13 min (Wall Clock)
[INFO] Finished at: 2018-06-14T17:42:10+00:00
[INFO] Final Memory: 137M/1428M
[INFO] ------------------------------------------------------------------------
[ERROR] Failed to execute goal org.apache.maven.plugins:maven-surefire-plugin:2.12.3:test (default-test) on project gs-gwc: There are test failures.
[ERROR]
[ERROR] Please refer to <https://build.geoserver.org/job/geoserver-master/ws/src/gwc/target/surefire-reports> for the individual test results.
[ERROR] -> [Help 1]
[ERROR]
[ERROR] To see the full stack trace of the errors, re-run Maven with the -e switch.
[ERROR] Re-run Maven using the -X switch to enable full debug logging.
[ERROR]
[ERROR] For more information about the errors and possible solutions, please read the following articles:
[ERROR] [Help 1] http://cwiki.apache.org/confluence/display/MAVEN/MojoFailureException
[ERROR]
[ERROR] After correcting the problems, you can resume the build with the command
[ERROR]   mvn <goals> -rf :gs-gwc
Build step 'Invoke top-level Maven targets' marked build as failure
Not sending mail to unregistered user [hidden email]

------------------------------------------------------------------------------
Check out the vibrant tech community on one of the world's most
engaging tech sites, Slashdot.org! http://sdm.link/slashdot
_______________________________________________
Geoserver-devel mailing list
[hidden email]
https://lists.sourceforge.net/lists/listinfo/geoserver-devel
Reply | Threaded
Open this post in threaded view
|

Build failed in Jenkins: geoserver-master #5923

monitor
See <https://build.geoserver.org/job/geoserver-master/5923/display/redirect?page=changes>

Changes:

[Kevin Smith] Direct link to GWC homepage bypassing redirect

------------------------------------------
[...truncated 11.12 MB...]
        at org.springframework.mock.web.MockFilterChain$ServletFilterProxy.doFilter(MockFilterChain.java:160)
        at org.springframework.mock.web.MockFilterChain.doFilter(MockFilterChain.java:127)
        at org.geoserver.test.GeoServerSystemTestSupport.dispatch(GeoServerSystemTestSupport.java:1665)
        at org.geoserver.test.GeoServerSystemTestSupport.dispatch(GeoServerSystemTestSupport.java:1576)
        at org.geoserver.test.GeoServerSystemTestSupport.getAsServletResponse(GeoServerSystemTestSupport.java:1048)
        at org.geoserver.test.GeoServerSystemTestSupport.getAsServletResponse(GeoServerSystemTestSupport.java:1031)
        at org.geoserver.importer.rest.ImporterIntegrationTest.testDirectExecuteInternal(ImporterIntegrationTest.java:337)
        at org.geoserver.importer.rest.ImporterIntegrationTest.testDirectExecuteSync(ImporterIntegrationTest.java:255)
        at sun.reflect.NativeMethodAccessorImpl.invoke0(Native Method)
        at sun.reflect.NativeMethodAccessorImpl.invoke(NativeMethodAccessorImpl.java:62)
        at sun.reflect.DelegatingMethodAccessorImpl.invoke(DelegatingMethodAccessorImpl.java:43)
        at java.lang.reflect.Method.invoke(Method.java:498)
        at org.junit.runners.model.FrameworkMethod$1.runReflectiveCall(FrameworkMethod.java:47)
        at org.junit.internal.runners.model.ReflectiveCallable.run(ReflectiveCallable.java:12)
        at org.junit.runners.model.FrameworkMethod.invokeExplosively(FrameworkMethod.java:44)
        at org.junit.internal.runners.statements.InvokeMethod.evaluate(InvokeMethod.java:17)
        at org.junit.internal.runners.statements.RunBefores.evaluate(RunBefores.java:26)
        at org.junit.internal.runners.statements.RunAfters.evaluate(RunAfters.java:27)
        at org.junit.rules.RunRules.evaluate(RunRules.java:20)
        at org.junit.runners.ParentRunner.runLeaf(ParentRunner.java:271)
        at org.junit.runners.BlockJUnit4ClassRunner.runChild(BlockJUnit4ClassRunner.java:70)
        at org.junit.runners.BlockJUnit4ClassRunner.runChild(BlockJUnit4ClassRunner.java:50)
        at org.junit.runners.ParentRunner$3.run(ParentRunner.java:238)
        at org.junit.runners.ParentRunner$1.schedule(ParentRunner.java:63)
        at org.junit.runners.ParentRunner.runChildren(ParentRunner.java:236)
        at org.junit.runners.ParentRunner.access$000(ParentRunner.java:53)
        at org.junit.runners.ParentRunner$2.evaluate(ParentRunner.java:229)
        at org.junit.internal.runners.statements.RunBefores.evaluate(RunBefores.java:26)
        at org.junit.internal.runners.statements.RunAfters.evaluate(RunAfters.java:27)
        at org.junit.runners.ParentRunner.run(ParentRunner.java:309)
        at org.apache.maven.surefire.junit4.JUnit4Provider.execute(JUnit4Provider.java:252)
        at org.apache.maven.surefire.junit4.JUnit4Provider.executeTestSet(JUnit4Provider.java:141)
        at org.apache.maven.surefire.junit4.JUnit4Provider.invoke(JUnit4Provider.java:112)
        at sun.reflect.NativeMethodAccessorImpl.invoke0(Native Method)
        at sun.reflect.NativeMethodAccessorImpl.invoke(NativeMethodAccessorImpl.java:62)
        at sun.reflect.DelegatingMethodAccessorImpl.invoke(DelegatingMethodAccessorImpl.java:43)
        at java.lang.reflect.Method.invoke(Method.java:498)
        at org.apache.maven.surefire.util.ReflectionUtils.invokeMethodWithArray(ReflectionUtils.java:189)
        at org.apache.maven.surefire.booter.ProviderFactory$ProviderProxy.invoke(ProviderFactory.java:165)
        at org.apache.maven.surefire.booter.ProviderFactory.invokeProvider(ProviderFactory.java:85)
        at org.apache.maven.surefire.booter.ForkedBooter.runSuitesInProcess(ForkedBooter.java:115)
        at org.apache.maven.surefire.booter.ForkedBooter.main(ForkedBooter.java:75)
Jun 15, 2018 5:59:21 PM org.geoserver.importer.Importer copyFromFeatureReader
INFO: load to target took 46
[INFO]
[INFO] --- maven-resources-plugin:2.6:testResources (default-testResources) @ gs-web-sec-cas ---
[INFO] Using 'UTF-8' encoding to copy filtered resources.
[INFO] skip non existing resourceDirectory <https://build.geoserver.org/job/geoserver-master/ws/src/extension/security/web/web-cas/src/test/java>
[INFO] skip non existing resourceDirectory <https://build.geoserver.org/job/geoserver-master/ws/src/extension/security/web/web-cas/src/test/resources>
[INFO]
[INFO] --- maven-compiler-plugin:2.3.2:testCompile (default-testCompile) @ gs-web-sec-cas ---
[INFO] No sources to compile
[INFO]
[INFO] --- maven-surefire-plugin:2.12.3:test (default-test) @ gs-web-sec-cas ---
[INFO] No tests to run.
[INFO]
[INFO] --- maven-jar-plugin:2.4:jar (default-jar) @ gs-web-sec-cas ---
[INFO] Building jar: <https://build.geoserver.org/job/geoserver-master/ws/src/extension/security/web/web-cas/target/gs-web-sec-cas-2.14-SNAPSHOT.jar>
[INFO]
[INFO] --- maven-jar-plugin:2.4:test-jar (default) @ gs-web-sec-cas ---
[WARNING] JAR will be empty - no content was marked for inclusion!
[INFO] Building jar: <https://build.geoserver.org/job/geoserver-master/ws/src/extension/security/web/web-cas/target/gs-web-sec-cas-2.14-SNAPSHOT-tests.jar>
[INFO]
[INFO] --- maven-source-plugin:2.2.1:jar-no-fork (attach-sources) @ gs-web-sec-cas ---
[INFO] Building jar: <https://build.geoserver.org/job/geoserver-master/ws/src/extension/security/web/web-cas/target/gs-web-sec-cas-2.14-SNAPSHOT-sources.jar>
[INFO]
[INFO] --- maven-source-plugin:2.2.1:test-jar-no-fork (attach-sources) @ gs-web-sec-cas ---
[INFO] No sources in project. Archive not created.
[INFO]
[INFO] --- fmt-maven-plugin:2.4.0:check (default) @ gs-web-sec-cas ---
[warn] Test source directory '<https://build.geoserver.org/job/geoserver-master/ws/src/extension/security/web/web-cas/src/test/java'> does not exist, ignoring.
[debug] Using AOSP style
[INFO] Processed 2 files (0 non-complying).
[INFO]
[INFO] --- maven-install-plugin:2.4:install (default-install) @ gs-web-sec-cas ---
[INFO] Installing <https://build.geoserver.org/job/geoserver-master/ws/src/extension/security/web/web-cas/target/gs-web-sec-cas-2.14-SNAPSHOT.jar> to /var/jenkins/.m2/repository/org/geoserver/security/gs-web-sec-cas/2.14-SNAPSHOT/gs-web-sec-cas-2.14-SNAPSHOT.jar
[INFO] Installing <https://build.geoserver.org/job/geoserver-master/ws/src/extension/security/web/web-cas/pom.xml> to /var/jenkins/.m2/repository/org/geoserver/security/gs-web-sec-cas/2.14-SNAPSHOT/gs-web-sec-cas-2.14-SNAPSHOT.pom
[INFO] Installing <https://build.geoserver.org/job/geoserver-master/ws/src/extension/security/web/web-cas/target/gs-web-sec-cas-2.14-SNAPSHOT-tests.jar> to /var/jenkins/.m2/repository/org/geoserver/security/gs-web-sec-cas/2.14-SNAPSHOT/gs-web-sec-cas-2.14-SNAPSHOT-tests.jar
[INFO] Installing <https://build.geoserver.org/job/geoserver-master/ws/src/extension/security/web/web-cas/target/gs-web-sec-cas-2.14-SNAPSHOT-sources.jar> to /var/jenkins/.m2/repository/org/geoserver/security/gs-web-sec-cas/2.14-SNAPSHOT/gs-web-sec-cas-2.14-SNAPSHOT-sources.jar
Jun 15, 2018 5:59:21 PM org.geoserver.catalog.ResourcePool getFeatureType
WARNING: Error while getting feature type, flushing cache and retrying: Failed to find the datastore factory for dummy, did you forget to install the store extension jar?
Jun 15, 2018 5:59:22 PM org.geoserver.catalog.ResourcePool getFeatureType
WARNING: Error while getting feature type, flushing cache and retrying: Failed to find the datastore factory for dummy, did you forget to install the store extension jar?
Jun 15, 2018 5:59:22 PM org.geoserver.catalog.ResourcePool getFeatureType
WARNING: Error while getting feature type, flushing cache and retrying: Failed to find the datastore factory for dummy, did you forget to install the store extension jar?
Tests run: 14, Failures: 0, Errors: 0, Skipped: 0, Time elapsed: 14.742 sec
Running org.geoserver.importer.rest.PostScriptTransformTest
Tests run: 1, Failures: 0, Errors: 0, Skipped: 0, Time elapsed: 0.012 sec
Running org.geoserver.importer.rest.converters.ImportJSONIOTest
Jun 15, 2018 5:59:23 PM org.geoserver.platform.GeoServerExtensions checkContext
WARNING: Extension lookup 'GeoServerSecurityProvider', but ApplicationContext is unset.
Jun 15, 2018 5:59:23 PM org.geoserver.platform.GeoServerExtensions checkContext
WARNING: Extension lookup 'ExtensionFilter', but ApplicationContext is unset.
Jun 15, 2018 5:59:23 PM org.geoserver.platform.GeoServerExtensions checkContext
WARNING: Extension lookup 'ExtensionProvider', but ApplicationContext is unset.
Jun 15, 2018 5:59:23 PM org.geoserver.platform.GeoServerExtensions checkContext
WARNING: Extension lookup 'ExtensionFilter', but ApplicationContext is unset.
Jun 15, 2018 5:59:23 PM org.geoserver.importer.Importer createContextStore
INFO: Enabling import store: memory
Tests run: 4, Failures: 0, Errors: 0, Skipped: 0, Time elapsed: 0.85 sec

Results :

Tests run: 73, Failures: 0, Errors: 0, Skipped: 0

[INFO]
[INFO] --- maven-jar-plugin:2.4:jar (default-jar) @ gs-importer-rest ---
[INFO] Building jar: <https://build.geoserver.org/job/geoserver-master/ws/src/extension/importer/rest/target/gs-importer-rest-2.14-SNAPSHOT.jar>
[INFO]
[INFO] --- maven-jar-plugin:2.4:test-jar (default) @ gs-importer-rest ---
[INFO] Building jar: <https://build.geoserver.org/job/geoserver-master/ws/src/extension/importer/rest/target/gs-importer-rest-2.14-SNAPSHOT-tests.jar>
[INFO]
[INFO] --- maven-source-plugin:2.2.1:jar-no-fork (attach-sources) @ gs-importer-rest ---
[INFO] Building jar: <https://build.geoserver.org/job/geoserver-master/ws/src/extension/importer/rest/target/gs-importer-rest-2.14-SNAPSHOT-sources.jar>
[INFO]
[INFO] --- maven-source-plugin:2.2.1:test-jar-no-fork (attach-sources) @ gs-importer-rest ---
[INFO] Building jar: <https://build.geoserver.org/job/geoserver-master/ws/src/extension/importer/rest/target/gs-importer-rest-2.14-SNAPSHOT-test-sources.jar>
[INFO]
[INFO] --- fmt-maven-plugin:2.4.0:check (default) @ gs-importer-rest ---
[debug] Using AOSP style
[INFO] Processed 30 files (0 non-complying).
[INFO]
[INFO] --- maven-install-plugin:2.4:install (default-install) @ gs-importer-rest ---
[INFO] Installing <https://build.geoserver.org/job/geoserver-master/ws/src/extension/importer/rest/target/gs-importer-rest-2.14-SNAPSHOT.jar> to /var/jenkins/.m2/repository/org/geoserver/importer/gs-importer-rest/2.14-SNAPSHOT/gs-importer-rest-2.14-SNAPSHOT.jar
[INFO] Installing <https://build.geoserver.org/job/geoserver-master/ws/src/extension/importer/rest/pom.xml> to /var/jenkins/.m2/repository/org/geoserver/importer/gs-importer-rest/2.14-SNAPSHOT/gs-importer-rest-2.14-SNAPSHOT.pom
[INFO] Installing <https://build.geoserver.org/job/geoserver-master/ws/src/extension/importer/rest/target/gs-importer-rest-2.14-SNAPSHOT-tests.jar> to /var/jenkins/.m2/repository/org/geoserver/importer/gs-importer-rest/2.14-SNAPSHOT/gs-importer-rest-2.14-SNAPSHOT-tests.jar
[INFO] Installing <https://build.geoserver.org/job/geoserver-master/ws/src/extension/importer/rest/target/gs-importer-rest-2.14-SNAPSHOT-sources.jar> to /var/jenkins/.m2/repository/org/geoserver/importer/gs-importer-rest/2.14-SNAPSHOT/gs-importer-rest-2.14-SNAPSHOT-sources.jar
[INFO] Installing <https://build.geoserver.org/job/geoserver-master/ws/src/extension/importer/rest/target/gs-importer-rest-2.14-SNAPSHOT-test-sources.jar> to /var/jenkins/.m2/repository/org/geoserver/importer/gs-importer-rest/2.14-SNAPSHOT/gs-importer-rest-2.14-SNAPSHOT-test-sources.jar
[INFO] ------------------------------------------------------------------------
[INFO] Reactor Summary:
[INFO]
[INFO] GeoServer .......................................... SUCCESS [  6.496 s]
[INFO] Core Platform Module ............................... SUCCESS [ 13.012 s]
[INFO] Open Web Service Module ............................ SUCCESS [ 11.675 s]
[INFO] Main Module ........................................ SUCCESS [01:03 min]
[INFO] GeoServer Security Modules ......................... SUCCESS [  0.079 s]
[INFO] GeoServer Security Tests Module .................... SUCCESS [01:13 min]
[INFO] GeoServer JDBC Security Module ..................... SUCCESS [ 35.833 s]
[INFO] GeoServer LDAP Security Module ..................... SUCCESS [ 21.910 s]
[INFO] Web Coverage Service Module ........................ SUCCESS [  4.392 s]
[INFO] Web Coverage Service 1.0 Module .................... SUCCESS [ 16.155 s]
[INFO] Web Coverage Service 1.1 Module .................... SUCCESS [ 18.940 s]
[INFO] Web Coverage Service 2.0 Module .................... SUCCESS [ 38.335 s]
[INFO] Web Feature Service Module ......................... SUCCESS [01:38 min]
[INFO] Web Map Service Module ............................. SUCCESS [01:54 min]
[INFO] KML support for GeoServer .......................... SUCCESS [ 28.071 s]
[INFO] gs-rest ............................................ SUCCESS [ 16.535 s]
[INFO] GeoWebCache (GWC) Module ........................... FAILURE [02:45 min]
[INFO] gs-restconfig ...................................... SUCCESS [01:24 min]
[INFO] gs-restconfig-wcs .................................. SUCCESS [ 19.690 s]
[INFO] gs-restconfig-wfs .................................. SUCCESS [ 18.062 s]
[INFO] gs-restconfig-wms .................................. SUCCESS [ 13.349 s]
[INFO] GeoServer Web Modules .............................. SUCCESS [  0.053 s]
[INFO] Core UI Module ..................................... SUCCESS [01:13 min]
[INFO] WMS UI Module ...................................... SUCCESS [ 31.435 s]
[INFO] GWC UI Module ...................................... SKIPPED
[INFO] WFS UI Module ...................................... SUCCESS [ 10.328 s]
[INFO] Demos Module ....................................... SUCCESS [ 17.076 s]
[INFO] WCS UI Module ...................................... SUCCESS [ 12.095 s]
[INFO] Security UI Modules ................................ SUCCESS [  0.109 s]
[INFO] Security UI Core Module ............................ SUCCESS [01:33 min]
[INFO] Security UI JDBC Module ............................ SUCCESS [01:06 min]
[INFO] Security UI LDAP Module ............................ SUCCESS [ 18.988 s]
[INFO] REST UI Module ..................................... SUCCESS [ 10.353 s]
[INFO] GeoServer Extensions ............................... SUCCESS [  0.032 s]
[INFO] Printing Module .................................... SUCCESS [ 14.932 s]
[INFO] GeoServer Web Application .......................... SKIPPED
[INFO] Community Space .................................... SUCCESS [  0.080 s]
[INFO] Application Schema Support ......................... SUCCESS [  0.032 s]
[INFO] Application Schema Integration Test ................ SUCCESS [02:27 min]
[INFO] Sample DataAccess Integration Test ................. SUCCESS [  9.593 s]
[INFO] ArcSDE DataStore Extension ......................... SUCCESS [ 11.380 s]
[INFO] H2 DataStore Extension ............................. SUCCESS [ 10.532 s]
[INFO] SQL Server DataStore Extension ..................... SUCCESS [  0.926 s]
[INFO] Oracle DataStore Extension ......................... SUCCESS [  0.404 s]
[INFO] MySQL DataStore Extension .......................... SUCCESS [  0.212 s]
[INFO] DB2 DataStore Extension ............................ SUCCESS [  0.221 s]
[INFO] ImageMap Output Format ............................. SUCCESS [  7.719 s]
[INFO] ImageI/O-Ext GDAL Coverage Extension ............... SUCCESS [  4.297 s]
[INFO] JP2K Coverage Extension ............................ SUCCESS [  0.240 s]
[INFO] OGR parent ......................................... SUCCESS [  0.054 s]
[INFO] OGR CORE ........................................... SUCCESS [  3.135 s]
[INFO] OGR WFS ............................................ SUCCESS [  8.941 s]
[INFO] Web Processing Service parent ...................... SUCCESS [  0.062 s]
[INFO] Web Processing Service Module ...................... SUCCESS [01:02 min]
[INFO] OGR WPS ............................................ SUCCESS [  9.827 s]
[INFO] Excel Output Format ................................ SUCCESS [ 11.619 s]
[INFO] Chart external graphics support .................... SUCCESS [  0.481 s]
[INFO] Feature Generalization Extension ................... SUCCESS [  3.418 s]
[INFO] Image Mosaic JDBC Extension ........................ SUCCESS [  0.446 s]
[INFO] OWS request flow controller ........................ SUCCESS [ 17.830 s]
[INFO] Web process status sharing with Hazelcast .......... SUCCESS [ 24.369 s]
[INFO] Web Processing Service GUI ......................... SUCCESS [ 22.859 s]
[INFO] GeoServer Layer Querying filter functions .......... SUCCESS [ 13.216 s]
[INFO] Teradata DataStore Extension ....................... SUCCESS [  2.096 s]
[INFO] GeoServer Monitor Extensions ....................... SUCCESS [  0.053 s]
[INFO] Core Monitor Extension ............................. SKIPPED
[INFO] GeoServer Security Extension Modules ............... SUCCESS [  0.022 s]
[INFO] GeoServer CAS Security Module ...................... SUCCESS [  6.637 s]
[INFO] GeoServer Security Extension Web Modules ........... SUCCESS [  0.047 s]
[INFO] GeoServer CAS Security Web Module .................. SUCCESS [  1.878 s]
[INFO] XLST based WFS output format ....................... SUCCESS [ 17.517 s]
[INFO] GeoServer INSPIRE Extensions ....................... SKIPPED
[INFO] GeoServer CSS Styling .............................. SUCCESS [ 15.235 s]
[INFO] Catalog Services for the Web parent ................ SUCCESS [  0.128 s]
[INFO] Catalog Services for the Web interfaces ............ SUCCESS [ 10.175 s]
[INFO] Catalog Services for the Web - Simple CatalogStore implementation SUCCESS [  8.452 s]
[INFO] Catalog Services for the Web core module ........... SUCCESS [ 36.963 s]
[INFO] CSW UI Module ...................................... SUCCESS [  8.745 s]
[INFO] DXF WFS output format and WPS PPIO ................. SUCCESS [  0.046 s]
[INFO] DXF WFS output format .............................. SUCCESS [ 11.544 s]
[INFO] DXF WPS PPIO ....................................... SUCCESS [ 10.770 s]
[INFO] GeoServer WCS 2.0 Earth Observation Extensions ..... SUCCESS [  0.041 s]
[INFO] Web Coverage Service 2.0 Earth Observation extensions SUCCESS [ 15.451 s]
[INFO] Web Coverage Service 2.0 Earth Observation GUI extension SUCCESS [ 12.174 s]
[INFO] GeoServer libjpeg-turbo Module ..................... SUCCESS [  8.759 s]
[INFO] GeoServer Data Importer ............................ SUCCESS [  0.054 s]
[INFO] Importer Core Module ............................... SUCCESS [ 51.011 s]
[INFO] Importer REST Api Module-ng ........................ SUCCESS [ 43.076 s]
[INFO] Importer Berkley DB Persistence Module ............. SUCCESS [ 14.339 s]
[INFO] Importer Web UI Module ............................. SUCCESS [ 13.368 s]
[INFO] GRIB Coverage Format ............................... SUCCESS [ 14.627 s]
[INFO] NetCDF Coverage format ............................. SUCCESS [ 16.044 s]
[INFO] WCS NetCDF output Module ........................... SUCCESS [ 53.501 s]
[INFO] Vector Tiles ....................................... SUCCESS [ 13.921 s]
[INFO] Ysld GeoServer Plugin .............................. SKIPPED
[INFO] MongoDB Data Store ................................. SUCCESS [  1.869 s]
[INFO] ------------------------------------------------------------------------
[INFO] BUILD FAILURE
[INFO] ------------------------------------------------------------------------
[INFO] Total time: 17:11 min (Wall Clock)
[INFO] Finished at: 2018-06-15T17:59:23+00:00
[INFO] Final Memory: 141M/1470M
[INFO] ------------------------------------------------------------------------
[ERROR] Failed to execute goal org.apache.maven.plugins:maven-surefire-plugin:2.12.3:test (default-test) on project gs-gwc: There are test failures.
[ERROR]
[ERROR] Please refer to <https://build.geoserver.org/job/geoserver-master/ws/src/gwc/target/surefire-reports> for the individual test results.
[ERROR] -> [Help 1]
[ERROR]
[ERROR] To see the full stack trace of the errors, re-run Maven with the -e switch.
[ERROR] Re-run Maven using the -X switch to enable full debug logging.
[ERROR]
[ERROR] For more information about the errors and possible solutions, please read the following articles:
[ERROR] [Help 1] http://cwiki.apache.org/confluence/display/MAVEN/MojoFailureException
[ERROR]
[ERROR] After correcting the problems, you can resume the build with the command
[ERROR]   mvn <goals> -rf :gs-gwc
Build step 'Invoke top-level Maven targets' marked build as failure
Not sending mail to unregistered user [hidden email]

------------------------------------------------------------------------------
Check out the vibrant tech community on one of the world's most
engaging tech sites, Slashdot.org! http://sdm.link/slashdot
_______________________________________________
Geoserver-devel mailing list
[hidden email]
https://lists.sourceforge.net/lists/listinfo/geoserver-devel
Reply | Threaded
Open this post in threaded view
|

Jenkins build is back to normal : geoserver-master #5924

monitor
See <https://build.geoserver.org/job/geoserver-master/5924/display/redirect>


------------------------------------------------------------------------------
Check out the vibrant tech community on one of the world's most
engaging tech sites, Slashdot.org! http://sdm.link/slashdot
_______________________________________________
Geoserver-devel mailing list
[hidden email]
https://lists.sourceforge.net/lists/listinfo/geoserver-devel