Build failed in Jenkins: geoserver-java11-qa #104

classic Classic list List threaded Threaded
2 messages Options
Reply | Threaded
Open this post in threaded view
|

Build failed in Jenkins: geoserver-java11-qa #104

Jenkins-2
See <http://build.geoserver.org/job/geoserver-java11-qa/104/display/redirect?page=changes>

Changes:

[Jody Garnett] Fix GWC RESTIntegration test to work after recent Spring MVC fix

------------------------------------------
[...truncated 659.04 KB...]
[ERROR] <http://build.geoserver.org/job/geoserver-java11-qa/ws/src/extension/app-schema/app-schema-test/src/test/java/org/geoserver/test/onlineTest/DataReferenceWfsOnlineTest.java>:[1992,84] cannot find symbol
  symbol:   method getPattern()
  location: class org.geotools.filter.LikeFilterImpl
[INFO] 12 errors
[INFO] -------------------------------------------------------------
[INFO] ------------------------------------------------------------------------
[INFO] Reactor Summary for GeoServer Extensions 2.16-SNAPSHOT:
[INFO]
[INFO] GeoServer Extensions ............................... SUCCESS [  5.606 s]
[INFO] Application Schema Support ......................... SUCCESS [  0.162 s]
[INFO] Application Schema Integration Test ................ FAILURE [  1.465 s]
[INFO] Sample DataAccess Integration Test ................. FAILURE [  0.737 s]
[INFO] ArcSDE DataStore Extension ......................... FAILURE [ 12.715 s]
[INFO] H2 DataStore Extension ............................. FAILURE [ 10.106 s]
[INFO] SQL Server DataStore Extension ..................... FAILURE [  0.357 s]
[INFO] Oracle DataStore Extension ......................... FAILURE [  0.365 s]
[INFO] MySQL DataStore Extension .......................... FAILURE [  0.339 s]
[INFO] DB2 DataStore Extension ............................ FAILURE [  0.317 s]
[INFO] ImageMap Output Format ............................. FAILURE [  1.579 s]
[INFO] ImageI/O-Ext GDAL Coverage Extension ............... FAILURE [  1.771 s]
[INFO] JP2K Coverage Extension ............................ FAILURE [  0.247 s]
[INFO] OGR parent ......................................... FAILURE [  0.035 s]
[INFO] OGR CORE ........................................... SKIPPED
[INFO] OGR WFS ............................................ SKIPPED
[INFO] Web Processing Service parent ...................... FAILURE [  0.031 s]
[INFO] Web Processing Service Module ...................... SKIPPED
[INFO] OGR WPS ............................................ SKIPPED
[INFO] Excel Output Format ................................ FAILURE [  1.472 s]
[INFO] Chart external graphics support .................... FAILURE [  0.255 s]
[INFO] Feature Generalization Extension ................... FAILURE [  0.623 s]
[INFO] Image Mosaic JDBC Extension ........................ FAILURE [  0.236 s]
[INFO] OWS request flow controller ........................ FAILURE [  4.269 s]
[INFO] Web process status sharing with Hazelcast .......... SKIPPED
[INFO] Web Processing Service GUI ......................... SKIPPED
[INFO] GeoServer Layer Querying filter functions .......... FAILURE [  2.195 s]
[INFO] Teradata DataStore Extension ....................... FAILURE [  1.776 s]
[INFO] GeoServer Monitor Extensions ....................... FAILURE [  0.213 s]
[INFO] Core Monitor Extension ............................. SKIPPED
[INFO] GeoServer Security Extension Modules ............... FAILURE [  0.163 s]
[INFO] GeoServer CAS Security Module ...................... SKIPPED
[INFO] GeoServer Security Extension Web Modules ........... SKIPPED
[INFO] GeoServer CAS Security Web Module .................. SKIPPED
[INFO] XLST based WFS output format ....................... FAILURE [  0.875 s]
[INFO] GeoServer INSPIRE Extensions ....................... FAILURE [  4.592 s]
[INFO] GeoServer CSS Styling .............................. FAILURE [  1.458 s]
[INFO] Catalog Services for the Web parent ................ FAILURE [  0.079 s]
[INFO] Catalog Services for the Web interfaces ............ SKIPPED
[INFO] Catalog Services for the Web - Simple CatalogStore implementation SKIPPED
[INFO] Catalog Services for the Web core module ........... SKIPPED
[INFO] CSW UI Module ...................................... SKIPPED
[INFO] DXF WFS output format and WPS PPIO ................. FAILURE [  0.066 s]
[INFO] DXF WFS output format .............................. SKIPPED
[INFO] DXF WPS PPIO ....................................... SKIPPED
[INFO] Printing Module .................................... FAILURE [  0.693 s]
[INFO] GeoServer WCS 2.0 Earth Observation Extensions ..... FAILURE [  0.040 s]
[INFO] Web Coverage Service 2.0 Earth Observation extensions SKIPPED
[INFO] Web Coverage Service 2.0 Earth Observation GUI extension SKIPPED
[INFO] GeoServer libjpeg-turbo Module ..................... FAILURE [  2.546 s]
[INFO] GeoServer Data Importer ............................ FAILURE [  0.067 s]
[INFO] Importer Core Module ............................... SKIPPED
[INFO] Importer REST Api Module-ng ........................ SKIPPED
[INFO] Importer Berkley DB Persistence Module ............. SKIPPED
[INFO] Importer Web UI Module ............................. SKIPPED
[INFO] GRIB Coverage Format ............................... FAILURE [  3.958 s]
[INFO] NetCDF Coverage format ............................. FAILURE [  3.339 s]
[INFO] WCS NetCDF output Module ........................... SKIPPED
[INFO] Vector Tiles ....................................... FAILURE [  0.914 s]
[INFO] Ysld GeoServer Plugin .............................. FAILURE [  0.800 s]
[INFO] MongoDB Data Store ................................. FAILURE [  0.419 s]
[INFO] REST SLD service ................................... SKIPPED
[INFO] GeoFence security integration ...................... FAILURE [  0.879 s]
[INFO] GeoFence Server .................................... SKIPPED
[INFO] ------------------------------------------------------------------------
[INFO] BUILD FAILURE
[INFO] ------------------------------------------------------------------------
[INFO] Total time:  38.013 s (Wall Clock)
[INFO] Finished at: 2019-06-04T00:57:18Z
[INFO] ------------------------------------------------------------------------
[ERROR] Failed to execute goal org.apache.maven.plugins:maven-checkstyle-plugin:3.0.0:check (default) on project gs-h2: Failed during checkstyle execution: Unable to find configuration file at location: <http://build.geoserver.org/job/geoserver-java11-qa/ws/src/../build/qa/checkstyle.xml>: Could not find resource '<http://build.geoserver.org/job/geoserver-java11-qa/ws/src/../build/qa/checkstyle.xml'.> -> [Help 1]
[ERROR] Failed to execute goal org.apache.maven.plugins:maven-pmd-plugin:3.11.0:pmd (pmd) on project gs-sqlserver: Execution pmd of goal org.apache.maven.plugins:maven-pmd-plugin:3.11.0:pmd failed: org.apache.maven.reporting.MavenReportException: Could not find resource '<http://build.geoserver.org/job/geoserver-java11-qa/ws/src/../build/qa/pmd-ruleset.xml'.> -> [Help 2]
[ERROR] Failed to execute goal org.apache.maven.plugins:maven-pmd-plugin:3.11.0:pmd (pmd) on project gs-oracle: Execution pmd of goal org.apache.maven.plugins:maven-pmd-plugin:3.11.0:pmd failed: org.apache.maven.reporting.MavenReportException: Could not find resource '<http://build.geoserver.org/job/geoserver-java11-qa/ws/src/../build/qa/pmd-ruleset.xml'.> -> [Help 2]
[ERROR] Failed to execute goal org.apache.maven.plugins:maven-pmd-plugin:3.11.0:pmd (pmd) on project gs-mysql: Execution pmd of goal org.apache.maven.plugins:maven-pmd-plugin:3.11.0:pmd failed: org.apache.maven.reporting.MavenReportException: Could not find resource '<http://build.geoserver.org/job/geoserver-java11-qa/ws/src/../build/qa/pmd-ruleset.xml'.> -> [Help 2]
[ERROR] Failed to execute goal org.apache.maven.plugins:maven-pmd-plugin:3.11.0:pmd (pmd) on project gs-db2: Execution pmd of goal org.apache.maven.plugins:maven-pmd-plugin:3.11.0:pmd failed: org.apache.maven.reporting.MavenReportException: Could not find resource '<http://build.geoserver.org/job/geoserver-java11-qa/ws/src/../build/qa/pmd-ruleset.xml'.> -> [Help 2]
[ERROR] Failed to execute goal org.apache.maven.plugins:maven-checkstyle-plugin:3.0.0:check (default) on project gs-arcsde: Failed during checkstyle execution: Unable to find configuration file at location: <http://build.geoserver.org/job/geoserver-java11-qa/ws/src/../build/qa/checkstyle.xml>: Could not find resource '<http://build.geoserver.org/job/geoserver-java11-qa/ws/src/../build/qa/checkstyle.xml'.> -> [Help 1]
[ERROR] Failed to execute goal org.apache.maven.plugins:maven-compiler-plugin:3.8.0:compile (default-compile) on project gs-imagemap: Compilation failure: Compilation failure:
[ERROR] <http://build.geoserver.org/job/geoserver-java11-qa/ws/src/extension/imagemap/src/main/java/org/vfny/geoserver/wms/responses/map/htmlimagemap/EncodeHTMLImageMap.java>:[16,25] cannot find symbol
[ERROR]   symbol:   class DefaultQuery
[ERROR]   location: package org.geotools.data
[ERROR] <http://build.geoserver.org/job/geoserver-java11-qa/ws/src/extension/imagemap/src/main/java/org/vfny/geoserver/wms/responses/map/htmlimagemap/EncodeHTMLImageMap.java>:[128,37] cannot find symbol
[ERROR]   symbol:   method getRules()
[ERROR]   location: variable style of type org.geotools.styling.FeatureTypeStyle
[ERROR] <http://build.geoserver.org/job/geoserver-java11-qa/ws/src/extension/imagemap/src/main/java/org/vfny/geoserver/wms/responses/map/htmlimagemap/EncodeHTMLImageMap.java>:[137,26] cannot find symbol
[ERROR]   symbol:   method hasElseFilter()
[ERROR]   location: variable r of type org.geotools.styling.Rule
[ERROR] <http://build.geoserver.org/job/geoserver-java11-qa/ws/src/extension/imagemap/src/main/java/org/vfny/geoserver/wms/responses/map/htmlimagemap/EncodeHTMLImageMap.java>:[188,53] cannot find symbol
[ERROR]   symbol:   method getFeatureTypeStyles()
[ERROR]   location: variable style of type org.geotools.styling.Style
[ERROR] <http://build.geoserver.org/job/geoserver-java11-qa/ws/src/extension/imagemap/src/main/java/org/vfny/geoserver/wms/responses/map/htmlimagemap/EncodeHTMLImageMap.java>:[198,54] cannot find symbol
[ERROR]   symbol:   method getFeatureTypeName()
[ERROR]   location: variable featureTypeStyle of type org.geotools.styling.FeatureTypeStyle
[ERROR] <http://build.geoserver.org/job/geoserver-java11-qa/ws/src/extension/imagemap/src/main/java/org/vfny/geoserver/wms/responses/map/htmlimagemap/EncodeHTMLImageMap.java>:[199,44] cannot find symbol
[ERROR]   symbol:   method getRules()
[ERROR]   location: variable featureTypeStyle of type org.geotools.styling.FeatureTypeStyle
[ERROR] <http://build.geoserver.org/job/geoserver-java11-qa/ws/src/extension/imagemap/src/main/java/org/vfny/geoserver/wms/responses/map/htmlimagemap/EncodeHTMLImageMap.java>:[205,29] cannot find symbol
[ERROR]   symbol:   method setRules(org.geotools.styling.Rule[])
[ERROR]   location: variable featureTypeStyle of type org.geotools.styling.FeatureTypeStyle
[ERROR] <http://build.geoserver.org/job/geoserver-java11-qa/ws/src/extension/imagemap/src/main/java/org/vfny/geoserver/wms/responses/map/htmlimagemap/EncodeHTMLImageMap.java>:[334,29] cannot find symbol
[ERROR]   symbol:   class DefaultQuery
[ERROR]   location: class org.vfny.geoserver.wms.responses.map.htmlimagemap.EncodeHTMLImageMap
[ERROR] <http://build.geoserver.org/job/geoserver-java11-qa/ws/src/extension/imagemap/src/main/java/org/vfny/geoserver/wms/responses/map/htmlimagemap/HTMLImageMapWriter.java>:[215,40] cannot find symbol
[ERROR]   symbol:   method getRules()
[ERROR]   location: variable featureTypeStyle of type org.geotools.styling.FeatureTypeStyle
[ERROR] <http://build.geoserver.org/job/geoserver-java11-qa/ws/src/extension/imagemap/src/main/java/org/vfny/geoserver/wms/responses/map/htmlimagemap/HTMLImageMapWriter.java>:[232,21] cannot find symbol
[ERROR]   symbol:   method hasElseFilter()
[ERROR]   location: variable rule of type org.geotools.styling.Rule
[ERROR] <http://build.geoserver.org/job/geoserver-java11-qa/ws/src/extension/imagemap/src/main/java/org/vfny/geoserver/wms/responses/map/htmlimagemap/HTMLImageMapWriter.java>:[271,25] cannot find symbol
[ERROR]   symbol:   method hasElseFilter()
[ERROR]   location: variable rule of type org.geotools.styling.Rule
[ERROR] -> [Help 3]
[ERROR] Failed to execute goal org.apache.maven.plugins:maven-pmd-plugin:3.11.0:pmd (pmd) on project gs-jp2k: Execution pmd of goal org.apache.maven.plugins:maven-pmd-plugin:3.11.0:pmd failed: org.apache.maven.reporting.MavenReportException: Could not find resource '<http://build.geoserver.org/job/geoserver-java11-qa/ws/src/../build/qa/pmd-ruleset.xml'.> -> [Help 2]
[ERROR] Failed to execute goal org.apache.maven.plugins:maven-checkstyle-plugin:3.0.0:check (default) on project gs-ogr: Failed during checkstyle execution: Unable to find configuration file at location: <http://build.geoserver.org/job/geoserver-java11-qa/ws/src/../build/qa/checkstyle.xml>: Could not find resource '<http://build.geoserver.org/job/geoserver-java11-qa/ws/src/../build/qa/checkstyle.xml'.> -> [Help 1]
[ERROR] Failed to execute goal org.apache.maven.plugins:maven-checkstyle-plugin:3.0.0:check (default) on project gs-wps: Failed during checkstyle execution: Unable to find configuration file at location: <http://build.geoserver.org/job/geoserver-java11-qa/ws/src/../build/qa/checkstyle.xml>: Could not find resource '<http://build.geoserver.org/job/geoserver-java11-qa/ws/src/../build/qa/checkstyle.xml'.> -> [Help 1]
[ERROR] Failed to execute goal org.apache.maven.plugins:maven-pmd-plugin:3.11.0:pmd (pmd) on project gs-gdal: Execution pmd of goal org.apache.maven.plugins:maven-pmd-plugin:3.11.0:pmd failed: org.apache.maven.reporting.MavenReportException: Could not find resource '<http://build.geoserver.org/job/geoserver-java11-qa/ws/src/../build/qa/pmd-ruleset.xml'.> -> [Help 2]
[ERROR] Failed to execute goal org.apache.maven.plugins:maven-pmd-plugin:3.11.0:pmd (pmd) on project gs-charts: Execution pmd of goal org.apache.maven.plugins:maven-pmd-plugin:3.11.0:pmd failed: org.apache.maven.reporting.MavenReportException: Could not find resource '<http://build.geoserver.org/job/geoserver-java11-qa/ws/src/../build/qa/pmd-ruleset.xml'.> -> [Help 2]
[ERROR] Failed to execute goal org.apache.maven.plugins:maven-compiler-plugin:3.8.0:testCompile (default-testCompile) on project gs-excel: Compilation failure
[ERROR] warnings found and -Werror specified
[ERROR] -> [Help 3]
[ERROR] Failed to execute goal org.apache.maven.plugins:maven-pmd-plugin:3.11.0:pmd (pmd) on project gs-imagemosaic-jdbc: Execution pmd of goal org.apache.maven.plugins:maven-pmd-plugin:3.11.0:pmd failed: org.apache.maven.reporting.MavenReportException: Could not find resource '<http://build.geoserver.org/job/geoserver-java11-qa/ws/src/../build/qa/pmd-ruleset.xml'.> -> [Help 2]
[ERROR] Failed to execute goal org.apache.maven.plugins:maven-compiler-plugin:3.8.0:compile (default-compile) on project gs-feature-pregeneralized: Compilation failure: Compilation failure:
[ERROR] <http://build.geoserver.org/job/geoserver-java11-qa/ws/src/extension/feature-pregeneralized/src/main/java/org/geoserver/data/gen/info/GeneralizationInfosProviderImpl.java>:[35,28] cannot find symbol
[ERROR]   symbol:   method url(java.lang.String)
[ERROR]   location: variable loader of type org.geoserver.platform.GeoServerResourceLoader
[ERROR] <http://build.geoserver.org/job/geoserver-java11-qa/ws/src/extension/feature-pregeneralized/src/main/java/org/geoserver/data/gen/DSFinderRepository.java>:[38,24] cannot find symbol
[ERROR]   symbol:   method url(java.lang.String)
[ERROR]   location: variable loader of type org.geoserver.platform.GeoServerResourceLoader
[ERROR] -> [Help 3]
[ERROR] Failed to execute goal org.apache.maven.plugins:maven-pmd-plugin:3.11.0:pmd (pmd) on project gs-querylayer: Execution pmd of goal org.apache.maven.plugins:maven-pmd-plugin:3.11.0:pmd failed: org.apache.maven.reporting.MavenReportException: Could not find resource '<http://build.geoserver.org/job/geoserver-java11-qa/ws/src/../build/qa/pmd-ruleset.xml'.> -> [Help 2]
[ERROR] Failed to execute goal org.apache.maven.plugins:maven-pmd-plugin:3.11.0:pmd (pmd) on project gs-teradata: Execution pmd of goal org.apache.maven.plugins:maven-pmd-plugin:3.11.0:pmd failed: org.apache.maven.reporting.MavenReportException: Could not find resource '<http://build.geoserver.org/job/geoserver-java11-qa/ws/src/../build/qa/pmd-ruleset.xml'.> -> [Help 2]
[ERROR] Failed to execute goal org.apache.maven.plugins:maven-pmd-plugin:3.11.0:pmd (pmd) on project gs-control-flow: Execution pmd of goal org.apache.maven.plugins:maven-pmd-plugin:3.11.0:pmd failed: org.apache.maven.reporting.MavenReportException: Could not find resource '<http://build.geoserver.org/job/geoserver-java11-qa/ws/src/../build/qa/pmd-ruleset.xml'.> -> [Help 2]
[ERROR] Failed to execute goal org.apache.maven.plugins:maven-checkstyle-plugin:3.0.0:check (default) on project gs-monitor: Failed during checkstyle execution: Unable to find configuration file at location: <http://build.geoserver.org/job/geoserver-java11-qa/ws/src/../build/qa/checkstyle.xml>: Could not find resource '<http://build.geoserver.org/job/geoserver-java11-qa/ws/src/../build/qa/checkstyle.xml'.> -> [Help 1]
[ERROR] Failed to execute goal org.apache.maven.plugins:maven-checkstyle-plugin:3.0.0:check (default) on project gs-security: Failed during checkstyle execution: Unable to find configuration file at location: <http://build.geoserver.org/job/geoserver-java11-qa/ws/src/../build/qa/checkstyle.xml>: Could not find resource '<http://build.geoserver.org/job/geoserver-java11-qa/ws/src/../build/qa/checkstyle.xml'.> -> [Help 1]
[ERROR] Failed to execute goal org.apache.maven.plugins:maven-compiler-plugin:3.8.0:compile (default-compile) on project gs-xslt: Compilation failure
[ERROR] <http://build.geoserver.org/job/geoserver-java11-qa/ws/src/extension/xslt/src/main/java/org/geoserver/wfs/xslt/config/TransformRepository.java>: warnings found and -Werror specified
[ERROR] -> [Help 3]
[ERROR] Failed to execute goal org.apache.maven.plugins:maven-compiler-plugin:3.8.0:compile (default-compile) on project gs-css: Compilation failure
[ERROR] <http://build.geoserver.org/job/geoserver-java11-qa/ws/src/extension/css/src/main/java/org/geoserver/community/css/web/CssHandler.java>: warnings found and -Werror specified
[ERROR] -> [Help 3]
[ERROR] Failed to execute goal org.apache.maven.plugins:maven-checkstyle-plugin:3.0.0:check (default) on project gs-csw: Failed during checkstyle execution: Unable to find configuration file at location: <http://build.geoserver.org/job/geoserver-java11-qa/ws/src/../build/qa/checkstyle.xml>: Could not find resource '<http://build.geoserver.org/job/geoserver-java11-qa/ws/src/../build/qa/checkstyle.xml'.> -> [Help 1]
[ERROR] Failed to execute goal org.apache.maven.plugins:maven-checkstyle-plugin:3.0.0:check (default) on project gs-dxf: Failed during checkstyle execution: Unable to find configuration file at location: <http://build.geoserver.org/job/geoserver-java11-qa/ws/src/../build/qa/checkstyle.xml>: Could not find resource '<http://build.geoserver.org/job/geoserver-java11-qa/ws/src/../build/qa/checkstyle.xml'.> -> [Help 1]
[ERROR] Failed to execute goal org.apache.maven.plugins:maven-compiler-plugin:3.8.0:compile (default-compile) on project gs-printing: Compilation failure: Compilation failure:
[ERROR] <http://build.geoserver.org/job/geoserver-java11-qa/ws/src/extension/printing/src/main/java/org/geoserver/printing/PrintingServletWrappingController.java>:[11,31] cannot find symbol
[ERROR]   symbol:   class IOUtils
[ERROR]   location: package org.geoserver.data.util
[ERROR] <http://build.geoserver.org/job/geoserver-java11-qa/ws/src/extension/printing/src/main/java/org/geoserver/printing/PrintingServletWrappingController.java>:[42,17] cannot find symbol
[ERROR]   symbol:   variable IOUtils
[ERROR]   location: class org.geoserver.printing.PrintingServletWrappingController
[ERROR] -> [Help 3]
[ERROR] Failed to execute goal org.apache.maven.plugins:maven-checkstyle-plugin:3.0.0:check (default) on project gs-wcs2_0-eo: Failed during checkstyle execution: Unable to find configuration file at location: <http://build.geoserver.org/job/geoserver-java11-qa/ws/src/../build/qa/checkstyle.xml>: Could not find resource '<http://build.geoserver.org/job/geoserver-java11-qa/ws/src/../build/qa/checkstyle.xml'.> -> [Help 1]
[ERROR] Failed to execute goal org.apache.maven.plugins:maven-pmd-plugin:3.11.0:pmd (pmd) on project gs-inspire: Execution pmd of goal org.apache.maven.plugins:maven-pmd-plugin:3.11.0:pmd failed: org.apache.maven.reporting.MavenReportException: Could not find resource '<http://build.geoserver.org/job/geoserver-java11-qa/ws/src/../build/qa/pmd-ruleset.xml'.> -> [Help 2]
[ERROR] Failed to execute goal org.apache.maven.plugins:maven-checkstyle-plugin:3.0.0:check (default) on project gs-importer: Failed during checkstyle execution: Unable to find configuration file at location: <http://build.geoserver.org/job/geoserver-java11-qa/ws/src/../build/qa/checkstyle.xml>: Could not find resource '<http://build.geoserver.org/job/geoserver-java11-qa/ws/src/../build/qa/checkstyle.xml'.> -> [Help 1]
[ERROR] Failed to execute goal org.apache.maven.plugins:maven-pmd-plugin:3.11.0:pmd (pmd) on project gs-libjpeg-turbo: Execution pmd of goal org.apache.maven.plugins:maven-pmd-plugin:3.11.0:pmd failed: org.apache.maven.reporting.MavenReportException: Could not find resource '<http://build.geoserver.org/job/geoserver-java11-qa/ws/src/../build/qa/pmd-ruleset.xml'.> -> [Help 2]
[ERROR] Failed to execute goal org.apache.maven.plugins:maven-pmd-plugin:3.11.0:pmd (pmd) on project gs-grib: Execution pmd of goal org.apache.maven.plugins:maven-pmd-plugin:3.11.0:pmd failed: org.apache.maven.reporting.MavenReportException: Could not find resource '<http://build.geoserver.org/job/geoserver-java11-qa/ws/src/../build/qa/pmd-ruleset.xml'.> -> [Help 2]
[ERROR] Failed to execute goal org.apache.maven.plugins:maven-pmd-plugin:3.11.0:pmd (pmd) on project gs-netcdf: Execution pmd of goal org.apache.maven.plugins:maven-pmd-plugin:3.11.0:pmd failed: org.apache.maven.reporting.MavenReportException: Could not find resource '<http://build.geoserver.org/job/geoserver-java11-qa/ws/src/../build/qa/pmd-ruleset.xml'.> -> [Help 2]
[ERROR] Failed to execute goal org.apache.maven.plugins:maven-compiler-plugin:3.8.0:compile (default-compile) on project gs-vectortiles: Compilation failure: Compilation failure:
[ERROR] <http://build.geoserver.org/job/geoserver-java11-qa/ws/src/extension/vectortiles/src/main/java/org/geoserver/wms/topojson/TopologyBuilder.java>: warnings found and -Werror specified
[ERROR] <http://build.geoserver.org/job/geoserver-java11-qa/ws/src/extension/vectortiles/src/main/java/org/geotools/renderer/lite/VectorMapRenderUtils.java>:[442,62] cannot find symbol
[ERROR]   symbol:   method getFeatureTypeName()
[ERROR]   location: variable fts of type org.geotools.styling.FeatureTypeStyle
[ERROR] <http://build.geoserver.org/job/geoserver-java11-qa/ws/src/extension/vectortiles/src/main/java/org/geotools/renderer/lite/VectorMapRenderUtils.java>:[444,57] cannot find symbol
[ERROR]   symbol:   method getFeatureTypeName()
[ERROR]   location: variable fts of type org.geotools.styling.FeatureTypeStyle
[ERROR] -> [Help 3]
[ERROR] Failed to execute goal org.apache.maven.plugins:maven-compiler-plugin:3.8.0:compile (default-compile) on project gs-ysld: Compilation failure
[ERROR] <http://build.geoserver.org/job/geoserver-java11-qa/ws/src/extension/ysld/src/main/java/org/geoserver/ysld/YsldHandler.java>: warnings found and -Werror specified
[ERROR] -> [Help 3]
[ERROR] Failed to execute goal org.apache.maven.plugins:maven-pmd-plugin:3.11.0:pmd (pmd) on project gs-mongodb: Execution pmd of goal org.apache.maven.plugins:maven-pmd-plugin:3.11.0:pmd failed: org.apache.maven.reporting.MavenReportException: Could not find resource '<http://build.geoserver.org/job/geoserver-java11-qa/ws/src/../build/qa/pmd-ruleset.xml'.> -> [Help 2]
[ERROR] Failed to execute goal org.apache.maven.plugins:maven-compiler-plugin:3.8.0:compile (default-compile) on project gs-geofence: Compilation failure: Compilation failure:
[ERROR] <http://build.geoserver.org/job/geoserver-java11-qa/ws/src/extension/geofence/src/main/java/org/geoserver/geofence/config/GeoFenceConfigurationManager.java>: warnings found and -Werror specified
[ERROR] <http://build.geoserver.org/job/geoserver-java11-qa/ws/src/extension/geofence/src/main/java/org/geoserver/geofence/GeofenceAccessManager.java>:[302,33] cannot find symbol
[ERROR]   symbol:   method getPrefixedName()
[ERROR]   location: variable resource of type org.geoserver.catalog.ResourceInfo
[ERROR] <http://build.geoserver.org/job/geoserver-java11-qa/ws/src/extension/geofence/src/main/java/org/geoserver/geofence/GeofenceAccessManager.java>:[375,47] cannot find symbol
[ERROR]   symbol:   method getPrefixedName()
[ERROR]   location: variable resource of type org.geoserver.catalog.ResourceInfo
[ERROR] -> [Help 3]
[ERROR] Failed to execute goal org.apache.maven.plugins:maven-compiler-plugin:3.8.0:testCompile (default-testCompile) on project gs-sample-data-access-test: Compilation failure: Compilation failure:
[ERROR] <http://build.geoserver.org/job/geoserver-java11-qa/ws/src/extension/app-schema/sample-data-access-test/src/test/java/org/geoserver/test/SampleDataAccessMockData.java>:[20,31] cannot find symbol
[ERROR]   symbol:   class IOUtils
[ERROR]   location: package org.geoserver.data.util
[ERROR] <http://build.geoserver.org/job/geoserver-java11-qa/ws/src/extension/app-schema/sample-data-access-test/src/test/java/org/geoserver/test/SampleDataAccessMockData.java>:[64,16] cannot find symbol
[ERROR]   symbol:   variable IOUtils
[ERROR]   location: class org.geoserver.test.SampleDataAccessMockData
[ERROR] <http://build.geoserver.org/job/geoserver-java11-qa/ws/src/extension/app-schema/sample-data-access-test/src/test/java/org/geoserver/test/SampleDataAccessMockData.java>:[123,9] cannot find symbol
[ERROR]   symbol:   variable IOUtils
[ERROR]   location: class org.geoserver.test.SampleDataAccessMockData
[ERROR] <http://build.geoserver.org/job/geoserver-java11-qa/ws/src/extension/app-schema/sample-data-access-test/src/test/java/org/geoserver/test/SampleDataAccessMockData.java>:[170,9] cannot find symbol
[ERROR]   symbol:   variable IOUtils
[ERROR]   location: class org.geoserver.test.SampleDataAccessMockData
[ERROR] -> [Help 3]
[ERROR] Failed to execute goal org.apache.maven.plugins:maven-compiler-plugin:3.8.0:testCompile (default-testCompile) on project gs-app-schema-test: Compilation failure: Compilation failure:
[ERROR] <http://build.geoserver.org/job/geoserver-java11-qa/ws/src/extension/app-schema/app-schema-test/src/test/java/org/geoserver/test/AbstractAppSchemaMockData.java>:[29,31] cannot find symbol
[ERROR]   symbol:   class IOUtils
[ERROR]   location: package org.geoserver.data.util
[ERROR] <http://build.geoserver.org/job/geoserver-java11-qa/ws/src/extension/app-schema/app-schema-test/src/test/java/org/geoserver/test/RestconfigWfsTest.java>:[32,31] cannot find symbol
[ERROR]   symbol:   class IOUtils
[ERROR]   location: package org.geoserver.data.util
[ERROR] <http://build.geoserver.org/job/geoserver-java11-qa/ws/src/extension/app-schema/app-schema-test/src/test/java/org/geoserver/test/onlineTest/setup/AppSchemaTestOracleSetup.java>:[17,28] cannot find symbol
[ERROR]   symbol:   class IllegalAttributeException
[ERROR]   location: package org.geotools.feature
[ERROR] <http://build.geoserver.org/job/geoserver-java11-qa/ws/src/extension/app-schema/app-schema-test/src/test/java/org/geoserver/test/onlineTest/setup/AppSchemaTestOracleSetup.java>:[133,20] cannot find symbol
[ERROR]   symbol:   class IllegalAttributeException
[ERROR]   location: class org.geoserver.test.onlineTest.setup.AppSchemaTestOracleSetup
[ERROR] <http://build.geoserver.org/job/geoserver-java11-qa/ws/src/extension/app-schema/app-schema-test/src/test/java/org/geoserver/test/AbstractAppSchemaMockData.java>:[159,20] cannot find symbol
[ERROR]   symbol:   variable IOUtils
[ERROR]   location: class org.geoserver.test.AbstractAppSchemaMockData
[ERROR] <http://build.geoserver.org/job/geoserver-java11-qa/ws/src/extension/app-schema/app-schema-test/src/test/java/org/geoserver/test/AbstractAppSchemaMockData.java>:[323,13] cannot find symbol
[ERROR]   symbol:   variable IOUtils
[ERROR]   location: class org.geoserver.test.AbstractAppSchemaMockData
[ERROR] <http://build.geoserver.org/job/geoserver-java11-qa/ws/src/extension/app-schema/app-schema-test/src/test/java/org/geoserver/test/AbstractAppSchemaMockData.java>:[356,13] cannot find symbol
[ERROR]   symbol:   variable IOUtils
[ERROR]   location: class org.geoserver.test.AbstractAppSchemaMockData
[ERROR] <http://build.geoserver.org/job/geoserver-java11-qa/ws/src/extension/app-schema/app-schema-test/src/test/java/org/geoserver/test/AbstractAppSchemaMockData.java>:[577,13] cannot find symbol
[ERROR]   symbol:   variable IOUtils
[ERROR]   location: class org.geoserver.test.AbstractAppSchemaMockData
[ERROR] <http://build.geoserver.org/job/geoserver-java11-qa/ws/src/extension/app-schema/app-schema-test/src/test/java/org/geoserver/test/RestconfigWfsTest.java>:[69,27] cannot find symbol
[ERROR]   symbol:   method unregisterAll()
[ERROR]   location: class org.geotools.data.complex.DataAccessRegistry
[ERROR] <http://build.geoserver.org/job/geoserver-java11-qa/ws/src/extension/app-schema/app-schema-test/src/test/java/org/geoserver/test/RestconfigWfsTest.java>:[230,9] cannot find symbol
[ERROR]   symbol:   variable IOUtils
[ERROR]   location: class org.geoserver.test.RestconfigWfsTest
[ERROR] <http://build.geoserver.org/job/geoserver-java11-qa/ws/src/extension/app-schema/app-schema-test/src/test/java/org/geoserver/test/RestconfigWfsTest.java>:[259,9] cannot find symbol
[ERROR]   symbol:   variable IOUtils
[ERROR]   location: class org.geoserver.test.RestconfigWfsTest
[ERROR] <http://build.geoserver.org/job/geoserver-java11-qa/ws/src/extension/app-schema/app-schema-test/src/test/java/org/geoserver/test/onlineTest/DataReferenceWfsOnlineTest.java>:[1992,84] cannot find symbol
[ERROR]   symbol:   method getPattern()
[ERROR]   location: class org.geotools.filter.LikeFilterImpl
[ERROR] -> [Help 3]
[ERROR]
[ERROR] To see the full stack trace of the errors, re-run Maven with the -e switch.
[ERROR] Re-run Maven using the -X switch to enable full debug logging.
[ERROR]
[ERROR] For more information about the errors and possible solutions, please read the following articles:
[ERROR] [Help 1] http://cwiki.apache.org/confluence/display/MAVEN/MojoExecutionException
[ERROR] [Help 2] http://cwiki.apache.org/confluence/display/MAVEN/PluginExecutionException
[ERROR] [Help 3] http://cwiki.apache.org/confluence/display/MAVEN/MojoFailureException
[ERROR]
[ERROR] After correcting the problems, you can resume the build with the command
[ERROR]   mvn <goals> -rf :gs-h2
Build step 'Invoke top-level Maven targets' marked build as failure


_______________________________________________
Geoserver-devel mailing list
[hidden email]
https://lists.sourceforge.net/lists/listinfo/geoserver-devel
Reply | Threaded
Open this post in threaded view
|

Jenkins build is back to normal : geoserver-java11-qa #105

Jenkins-2