Build failed in Jenkins: geoserver-java11 #560

classic Classic list List threaded Threaded
6 messages Options
Reply | Threaded
Open this post in threaded view
|

Build failed in Jenkins: geoserver-java11 #560

Jenkins-2
See <http://build.geoserver.org/job/geoserver-java11/560/display/redirect?page=changes>

Changes:

[Andrea Aime] Makng GeoServer compile after removal of deprecated methods/objects in

[Andrea Aime] Removing/replacing all deprecated calls to IOUtils.closeQuietly

[Andrea Aime] Switching from old junit assert to the current one

[Andrea Aime] Removing easymock classpath extension, is deprecated and has been merged

[Andrea Aime] Removing RequestUtils deprecated method

[Andrea Aime] Removing HTTPServletAware and its usage points

[Andrea Aime] Replacing deprecated DefaultServiceExceptionHandler with its superclass

[Andrea Aime] Completing cleanup of the gs-ows module, removed the deprecated OWS

[Andrea Aime] Replacing commons deprecated MultiHashMap with MultiValueHashMap

[Andrea Aime] Replacing deprecated Wrapper and AbstractCatalogDecorator with the

[Andrea Aime] Bye bye DataAccessManager

[Andrea Aime] Sweeping under the rug a bit of deprecatd org.vfny stuff, unfortunately

[Andrea Aime] Replacing deprecated Spring Base64 class with java own

[Andrea Aime] Resource step one

[Andrea Aime] Replacing deprecated url method in GeoServerResourceLoader

[Andrea Aime] Cleaning up GeoServerDataDirectory deprecated methods

[Andrea Aime] Removing deprecated ResourceInfo.getPrefixedName

[Andrea Aime] Removing deprecated methods from Catalog

[Andrea Aime] Removing deprecated prefixedName from PublishedInfo

[Andrea Aime] Removing deprecated methods from ContactInfo and GeoServerInfo

[Andrea Aime] Removing deprecated methods from JAIInfo

[Andrea Aime] The concurrent operation registry is in jai-ext

[Andrea Aime] Fixing IOUtils.write calls and removing GeoServeFeatureLocking

[Andrea Aime] Replacing calls to Throwables deprecated methods

[Andrea Aime] Dude, this is the two arguments constructor....

[Andrea Aime] Fixing deprecated calls to Spring Assert methos, use junit assert in

[Andrea Aime] Removing CatalogFacade deprecated method

[Andrea Aime] Removing StyleInfo deprecated methods

[Andrea Aime] Removing deprecated methods from template loader

[Andrea Aime] Resolving assorted deprecations in gs-main tests, fixing pmd and

[Andrea Aime] Fixing deprecated calls to Capture

[Andrea Aime] Removing PropertyFileWatcher deprecated constructor

[Andrea Aime] Removing deprecated methods from FileWatcher and friends

[Andrea Aime] Fixing deprecated class usage in LDAP module... finger crossed, I don't

[Andrea Aime] Fixing deprecated calls to readFileToString

[Andrea Aime] Fixed usage of deprecated SimpleEnumerationType

[Andrea Aime] Removed dodgy deprecation, was deprecated but GMLInfo was not given a

[Andrea Aime] Goodbye TransactionPlugin

[Andrea Aime] Removing deprecated method from Response

[Andrea Aime] Removing usage of deprecated EMFUtils.clone method

[Andrea Aime] Fixing calls to URLDecoder.decode deprecated method version

[Andrea Aime] Fixing deprecated point constructor call

[Andrea Aime] Removing ShapeZipOutputFormat deprecated constructor

[Andrea Aime] Small deprecation and PMD fixes

[Andrea Aime] Removing deprecated call to ExpressionDOMParser static method

[Andrea Aime] GetLegendGraphicRequest deprecated methods removal

[Andrea Aime] Ignore deprecatins in MockHttpClientConnectionManager, nothing we can do

[Andrea Aime] Completing WMS small cleanups

[Andrea Aime] Fixing deprecated calls to FileUtils.write

[Andrea Aime] Fixing usage of deprecated constructor of

[Andrea Aime] Removing deprecated methods in GeoServerTileLayer

[Andrea Aime] Handling assorted deprecations in gwc src/main

[Andrea Aime] Assorted deprecation fixes. Some are just suppressions, the author of

[Andrea Aime] Assorted deprecated call fixes in restconfig

[Andrea Aime] Fixing assorted deprecations in web/core

[Andrea Aime] Removing deprecated method from GeoServerSecurityManager

[Andrea Aime] Ignoring deprecation on wicket method call that has no obvious

[Andrea Aime] web/app deprecation fixes. Start.java uses a bunch of deprecated

[Andrea Aime] Removing deprecated IOUtils class, switch usage points to its superclass

[Andrea Aime] Completing app-schema-test cleanup

[Andrea Aime] Cleaning up html image map

[Andrea Aime] Fixing ogr output format

[Andrea Aime] Cleaning up GSProcess usage

[Andrea Aime] Assorted minor fixes in wps

[Andrea Aime] Cleaning up geofence and monitoring

[Andrea Aime] Follow up on GeoTools changes

[Andrea Aime] Making community modules in communityRelease compile

[Andrea Aime] Fixing build after deprecated method removal in GeoWebCache

[Andrea Aime] Deprecated API checkpoint on main, more deprecated API yet to remove

[Andrea Aime] Closing up main

[Andrea Aime] Make community modules compile

[Andrea Aime] java 11 fixes

[Andrea Aime] More java 11 fixes. WCS 1.1 has the same 'fix' as CQL, cannot have

[Andrea Aime] Add extensibility of common preview formats via beans (#3521)

[Andrea Aime] GEOS-9184 style image upload: NPE if new style (#3443)

[Andrea Aime] Revert "Resource step one"

[Andrea Aime] Resources.find( resource, force ) javadoc Implement

------------------------------------------
[...truncated 201.26 KB...]
[INFO] This project has been banned from the build due to previous failures.
[INFO] ------------------------------------------------------------------------
[INFO]
[INFO] ------------------------------------------------------------------------
[INFO] Skipping WCS NetCDF output Module
[INFO] This project has been banned from the build due to previous failures.
[INFO] ------------------------------------------------------------------------
[INFO]
[INFO] ------------------------------------------------------------------------
[INFO] Skipping GeoServer CSS Styling
[INFO] This project has been banned from the build due to previous failures.
[INFO] ------------------------------------------------------------------------
[INFO]
[INFO]
[INFO] ------------------------------------------------------------------------
[INFO] Skipping Security UI JDBC Module
[INFO] This project has been banned from the build due to previous failures.
[INFO] ------------------------------------------------------------------------
[INFO] ------------------------------------------------------------------------
[INFO] Skipping Security UI LDAP Module
[INFO] This project has been banned from the build due to previous failures.
[INFO]
[INFO] ------------------------------------------------------------------------
[INFO] ------------------------------------------------------------------------
[INFO] Skipping GeoServer Security Extension Modules
[INFO] This project has been banned from the build due to previous failures.
[INFO]
[INFO] ------------------------------------------------------------------------
[INFO] ------------------------------------------------------------------------
[INFO] Skipping GeoFence security integration
[INFO] This project has been banned from the build due to previous failures.
[INFO] ------------------------------------------------------------------------
[INFO]
[INFO] ------------------------------------------------------------------------
[INFO] Skipping REST SLD service
[INFO] This project has been banned from the build due to previous failures.
[INFO] ------------------------------------------------------------------------
[INFO]
[INFO] ------------------------------------------------------------------------
[INFO] Skipping Catalog Services for the Web core module
[INFO] This project has been banned from the build due to previous failures.
[INFO] ------------------------------------------------------------------------
[INFO]
[INFO] ------------------------------------------------------------------------
[INFO] Skipping OGR WPS
[INFO] This project has been banned from the build due to previous failures.
[INFO] ------------------------------------------------------------------------
[INFO]
[INFO] ------------------------------------------------------------------------
[INFO] Skipping Web process status sharing with Hazelcast
[INFO] This project has been banned from the build due to previous failures.
[INFO]
[INFO] ------------------------------------------------------------------------
[INFO] ------------------------------------------------------------------------
[INFO] Skipping Web Processing Service GUI
[INFO] This project has been banned from the build due to previous failures.
[INFO]
[INFO] ------------------------------------------------------------------------
[INFO] ------------------------------------------------------------------------
[INFO] Skipping DXF WPS PPIO
[INFO] This project has been banned from the build due to previous failures.
[INFO]
[INFO] ------------------------------------------------------------------------
[INFO] ------------------------------------------------------------------------
[INFO] Skipping Web Coverage Service 2.0 Earth Observation GUI extension
[INFO] This project has been banned from the build due to previous failures.
[INFO] ------------------------------------------------------------------------
[INFO]
[INFO]
[INFO] ------------------------------------------------------------------------
[INFO] ------------------------------------------------------------------------
[INFO] Skipping Importer REST Api Module-ng
[INFO] This project has been banned from the build due to previous failures.
[INFO] Skipping Importer Berkley DB Persistence Module
[INFO] This project has been banned from the build due to previous failures.
[INFO] ------------------------------------------------------------------------
[INFO] ------------------------------------------------------------------------
[INFO]
[INFO] ------------------------------------------------------------------------
[INFO] Skipping Importer Web UI Module
[INFO] This project has been banned from the build due to previous failures.
[INFO] ------------------------------------------------------------------------
[INFO]
[INFO] ------------------------------------------------------------------------
[INFO] Skipping GeoServer Web Application
[INFO] This project has been banned from the build due to previous failures.
[INFO] ------------------------------------------------------------------------
[INFO]
[INFO] ------------------------------------------------------------------------
[INFO]
[INFO] Skipping GeoServer CAS Security Module
[INFO] This project has been banned from the build due to previous failures.
[INFO] ------------------------------------------------------------------------
[INFO] ------------------------------------------------------------------------
[INFO] Skipping GeoServer Security Extension Web Modules
[INFO] This project has been banned from the build due to previous failures.
[INFO]
[INFO] ------------------------------------------------------------------------
[INFO] ------------------------------------------------------------------------
[INFO] Skipping GeoFence Server
[INFO] This project has been banned from the build due to previous failures.
[INFO]
[INFO] ------------------------------------------------------------------------
[INFO] ------------------------------------------------------------------------
[INFO] Skipping CSW UI Module
[INFO] This project has been banned from the build due to previous failures.
[INFO] ------------------------------------------------------------------------
[INFO]
[INFO] ------------------------------------------------------------------------
[INFO] Skipping GeoServer CAS Security Web Module
[INFO] This project has been banned from the build due to previous failures.
[INFO] ------------------------------------------------------------------------
[INFO] ------------------------------------------------------------------------
[INFO] Reactor Summary for GeoServer 2.16-SNAPSHOT:
[INFO]
[INFO] GeoServer .......................................... SUCCESS [  3.325 s]
[INFO] Core Platform Module ............................... SUCCESS [ 10.743 s]
[INFO] Open Web Service Module ............................ SUCCESS [  3.906 s]
[INFO] Main Module ........................................ FAILURE [  5.751 s]
[INFO] GeoServer Security Modules ......................... SKIPPED
[INFO] GeoServer Security Tests Module .................... SKIPPED
[INFO] GeoServer JDBC Security Module ..................... SKIPPED
[INFO] GeoServer LDAP Security Module ..................... SKIPPED
[INFO] Web Coverage Service Module ........................ SKIPPED
[INFO] Web Coverage Service 1.0 Module .................... SKIPPED
[INFO] Web Coverage Service 1.1 Module .................... SKIPPED
[INFO] Web Coverage Service 2.0 Module .................... SKIPPED
[INFO] Web Feature Service Module ......................... SKIPPED
[INFO] Web Map Service Module ............................. SKIPPED
[INFO] KML support for GeoServer .......................... SKIPPED
[INFO] gs-rest ............................................ SKIPPED
[INFO] GeoWebCache (GWC) Module ........................... SKIPPED
[INFO] gs-restconfig ...................................... SKIPPED
[INFO] gs-restconfig-wcs .................................. SKIPPED
[INFO] gs-restconfig-wfs .................................. SKIPPED
[INFO] gs-restconfig-wms .................................. SKIPPED
[INFO] GeoServer Web Modules .............................. SUCCESS [  0.051 s]
[INFO] Core UI Module ..................................... SKIPPED
[INFO] WMS UI Module ...................................... SKIPPED
[INFO] GWC UI Module ...................................... SKIPPED
[INFO] WFS UI Module ...................................... SKIPPED
[INFO] Demos Module ....................................... SKIPPED
[INFO] WCS UI Module ...................................... SKIPPED
[INFO] Security UI Modules ................................ SKIPPED
[INFO] Security UI Core Module ............................ SKIPPED
[INFO] Security UI JDBC Module ............................ SKIPPED
[INFO] Security UI LDAP Module ............................ SKIPPED
[INFO] REST UI Module ..................................... SKIPPED
[INFO] GeoServer Extensions ............................... SUCCESS [  0.029 s]
[INFO] Printing Module .................................... SKIPPED
[INFO] GeoServer Web Application .......................... SKIPPED
[INFO] Community Space .................................... SUCCESS [  0.022 s]
[INFO] Application Schema Support ......................... SUCCESS [  0.021 s]
[INFO] Application Schema Integration Test ................ SKIPPED
[INFO] Sample DataAccess Integration Test ................. SKIPPED
[INFO] ArcSDE DataStore Extension ......................... SKIPPED
[INFO] H2 DataStore Extension ............................. SKIPPED
[INFO] SQL Server DataStore Extension ..................... SUCCESS [  0.050 s]
[INFO] Oracle DataStore Extension ......................... SUCCESS [  0.070 s]
[INFO] MySQL DataStore Extension .......................... SUCCESS [  0.144 s]
[INFO] DB2 DataStore Extension ............................ SUCCESS [  0.091 s]
[INFO] ImageMap Output Format ............................. SKIPPED
[INFO] ImageI/O-Ext GDAL Coverage Extension ............... SUCCESS [  1.046 s]
[INFO] JP2K Coverage Extension ............................ SUCCESS [  0.062 s]
[INFO] OGR parent ......................................... SUCCESS [  0.023 s]
[INFO] OGR CORE ........................................... SKIPPED
[INFO] OGR WFS ............................................ SKIPPED
[INFO] Web Processing Service parent ...................... SUCCESS [  0.018 s]
[INFO] Web Processing Service Module ...................... SKIPPED
[INFO] OGR WPS ............................................ SKIPPED
[INFO] Excel Output Format ................................ SKIPPED
[INFO] Chart external graphics support .................... SUCCESS [  0.052 s]
[INFO] Feature Generalization Extension ................... SKIPPED
[INFO] Image Mosaic JDBC Extension ........................ SUCCESS [  0.059 s]
[INFO] OWS request flow controller ........................ SKIPPED
[INFO] Web process status sharing with Hazelcast .......... SKIPPED
[INFO] Web Processing Service GUI ......................... SKIPPED
[INFO] GeoServer Layer Querying filter functions .......... SKIPPED
[INFO] Teradata DataStore Extension ....................... SKIPPED
[INFO] GeoServer Monitor Extensions ....................... SKIPPED
[INFO] Core Monitor Extension ............................. SKIPPED
[INFO] GeoServer Security Extension Modules ............... SKIPPED
[INFO] GeoServer CAS Security Module ...................... SKIPPED
[INFO] GeoServer Security Extension Web Modules ........... SKIPPED
[INFO] GeoServer CAS Security Web Module .................. SKIPPED
[INFO] XLST based WFS output format ....................... SKIPPED
[INFO] GeoServer INSPIRE Extensions ....................... SKIPPED
[INFO] GeoServer CSS Styling .............................. SKIPPED
[INFO] Catalog Services for the Web parent ................ SKIPPED
[INFO] Catalog Services for the Web interfaces ............ SKIPPED
[INFO] Catalog Services for the Web - Simple CatalogStore implementation SKIPPED
[INFO] Catalog Services for the Web core module ........... SKIPPED
[INFO] CSW UI Module ...................................... SKIPPED
[INFO] DXF WFS output format and WPS PPIO ................. SUCCESS [  0.021 s]
[INFO] DXF WFS output format .............................. SKIPPED
[INFO] DXF WPS PPIO ....................................... SKIPPED
[INFO] GeoServer WCS 2.0 Earth Observation Extensions ..... SUCCESS [  0.021 s]
[INFO] Web Coverage Service 2.0 Earth Observation extensions SKIPPED
[INFO] Web Coverage Service 2.0 Earth Observation GUI extension SKIPPED
[INFO] GeoServer libjpeg-turbo Module ..................... SKIPPED
[INFO] GeoServer Data Importer ............................ SKIPPED
[INFO] Importer Core Module ............................... SKIPPED
[INFO] Importer REST Api Module-ng ........................ SKIPPED
[INFO] Importer Berkley DB Persistence Module ............. SKIPPED
[INFO] Importer Web UI Module ............................. SKIPPED
[INFO] GRIB Coverage Format ............................... SKIPPED
[INFO] NetCDF Coverage format ............................. SKIPPED
[INFO] WCS NetCDF output Module ........................... SKIPPED
[INFO] Vector Tiles ....................................... SKIPPED
[INFO] Ysld GeoServer Plugin .............................. SKIPPED
[INFO] MongoDB Data Store ................................. SUCCESS [  0.070 s]
[INFO] REST SLD service ................................... SKIPPED
[INFO] GeoFence security integration ...................... SKIPPED
[INFO] GeoFence Server .................................... SKIPPED
[INFO] ------------------------------------------------------------------------
[INFO] BUILD FAILURE
[INFO] ------------------------------------------------------------------------
[INFO] Total time:  25.076 s (Wall Clock)
[INFO] Finished at: 2019-06-01T17:21:31Z
[INFO] ------------------------------------------------------------------------
[ERROR] Failed to execute goal org.apache.maven.plugins:maven-compiler-plugin:3.8.0:compile (default-compile) on project gs-main: Compilation failure: Compilation failure:
[ERROR] <http://build.geoserver.org/job/geoserver-java11/ws/src/main/src/main/java/org/vfny/geoserver/global/GeoServerFeatureStore.java>:[36,8] org.vfny.geoserver.global.GeoServerFeatureStore is not abstract and does not override abstract method modifyFeatures(org.opengis.feature.type.AttributeDescriptor,java.lang.Object,org.opengis.filter.Filter) in org.geotools.data.FeatureStore
[ERROR] <http://build.geoserver.org/job/geoserver-java11/ws/src/main/src/main/java/org/vfny/geoserver/global/GeoServerFeatureLocking.java>:[31,8] org.vfny.geoserver.global.GeoServerFeatureLocking is not abstract and does not override abstract method modifyFeatures(org.opengis.feature.type.AttributeDescriptor,java.lang.Object,org.opengis.filter.Filter) in org.geotools.data.FeatureStore
[ERROR] <http://build.geoserver.org/job/geoserver-java11/ws/src/main/src/main/java/org/geoserver/security/decorators/SecuredStructuredGridCoverage2DReader.java>:[21,8] org.geoserver.security.decorators.SecuredStructuredGridCoverage2DReader is not abstract and does not override abstract method removeCoverage(java.lang.String) in org.geotools.coverage.grid.io.StructuredGridCoverage2DReader
[ERROR] <http://build.geoserver.org/job/geoserver-java11/ws/src/main/src/main/java/org/geoserver/catalog/CoverageDimensionCustomizerReader.java>:[67,8] org.geoserver.catalog.CoverageDimensionCustomizerReader is not abstract and does not override abstract method getNumOverviews(java.lang.String) in org.geotools.coverage.grid.io.GridCoverage2DReader
[ERROR] <http://build.geoserver.org/job/geoserver-java11/ws/src/main/src/main/java/org/geoserver/catalog/CoverageDimensionCustomizerReader.java>:[77,12] org.geoserver.catalog.CoverageDimensionCustomizerReader.CoverageDimensionCustomizerStructuredReader is not abstract and does not override abstract method removeCoverage(java.lang.String) in org.geotools.coverage.grid.io.StructuredGridCoverage2DReader
[ERROR] <http://build.geoserver.org/job/geoserver-java11/ws/src/main/src/main/java/org/geoserver/catalog/SingleGridCoverage2DReader.java>:[29,8] org.geoserver.catalog.SingleGridCoverage2DReader is not abstract and does not override abstract method getNumOverviews(java.lang.String) in org.geotools.coverage.grid.io.GridCoverage2DReader
[ERROR] <http://build.geoserver.org/job/geoserver-java11/ws/src/main/src/main/java/org/geoserver/security/decorators/SecuredFeatureStore.java>:[42,8] org.geoserver.security.decorators.SecuredFeatureStore is not abstract and does not override abstract method modifyFeatures(org.opengis.feature.type.AttributeDescriptor,java.lang.Object,org.opengis.filter.Filter) in org.geotools.data.FeatureStore
[ERROR] <http://build.geoserver.org/job/geoserver-java11/ws/src/main/src/main/java/org/geoserver/security/decorators/SecuredFeatureLocking.java>:[26,8] org.geoserver.security.decorators.SecuredFeatureLocking is not abstract and does not override abstract method modifyFeatures(org.opengis.feature.type.AttributeDescriptor,java.lang.Object,org.opengis.filter.Filter) in org.geotools.data.FeatureStore
[ERROR] <http://build.geoserver.org/job/geoserver-java11/ws/src/main/src/main/java/org/geoserver/security/decorators/SecuredSimpleFeatureLocking.java>:[31,8] org.geoserver.security.decorators.SecuredSimpleFeatureLocking is not abstract and does not override abstract method modifyFeatures(org.opengis.feature.type.AttributeDescriptor,java.lang.Object,org.opengis.filter.Filter) in org.geotools.data.FeatureStore
[ERROR] <http://build.geoserver.org/job/geoserver-java11/ws/src/main/src/main/java/org/geoserver/catalog/StructuredSingleGridCoverage2DReader.java>:[23,8] org.geoserver.catalog.StructuredSingleGridCoverage2DReader is not abstract and does not override abstract method removeCoverage(java.lang.String) in org.geotools.coverage.grid.io.StructuredGridCoverage2DReader
[ERROR] <http://build.geoserver.org/job/geoserver-java11/ws/src/main/src/main/java/org/geoserver/feature/retype/RetypingFeatureStore.java>:[33,8] org.geoserver.feature.retype.RetypingFeatureStore is not abstract and does not override abstract method modifyFeatures(org.opengis.feature.type.AttributeDescriptor,java.lang.Object,org.opengis.filter.Filter) in org.geotools.data.FeatureStore
[ERROR] <http://build.geoserver.org/job/geoserver-java11/ws/src/main/src/main/java/org/geoserver/feature/retype/RetypingFeatureLocking.java>:[19,1] org.geoserver.feature.retype.RetypingFeatureLocking is not abstract and does not override abstract method modifyFeatures(org.opengis.feature.type.AttributeDescriptor,java.lang.Object,org.opengis.filter.Filter) in org.geotools.data.FeatureStore
[ERROR] <http://build.geoserver.org/job/geoserver-java11/ws/src/main/src/main/java/org/geoserver/catalog/CoverageViewReader.java>:[85,8] org.geoserver.catalog.CoverageViewReader is not abstract and does not override abstract method getNumOverviews(java.lang.String) in org.geotools.coverage.grid.io.GridCoverage2DReader
[ERROR] <http://build.geoserver.org/job/geoserver-java11/ws/src/main/src/main/java/org/geoserver/catalog/StructuredCoverageViewReader.java>:[43,8] org.geoserver.catalog.StructuredCoverageViewReader is not abstract and does not override abstract method removeCoverage(java.lang.String) in org.geotools.coverage.grid.io.StructuredGridCoverage2DReader
[ERROR] <http://build.geoserver.org/job/geoserver-java11/ws/src/main/src/main/java/org/geoserver/feature/retype/WrappingFeatureListener.java>:[26,62] incompatible types: org.geotools.data.FeatureEvent.Type cannot be converted to int
[ERROR] <http://build.geoserver.org/job/geoserver-java11/ws/src/main/src/main/java/org/geoserver/security/decorators/SecuredGridCoverage2DReader.java>:[41,8] org.geoserver.security.decorators.SecuredGridCoverage2DReader is not abstract and does not override abstract method getNumOverviews(java.lang.String) in org.geotools.coverage.grid.io.GridCoverage2DReader
[ERROR] <http://build.geoserver.org/job/geoserver-java11/ws/src/main/src/main/java/org/geoserver/security/decorators/SecuredSimpleFeatureStore.java>:[30,8] org.geoserver.security.decorators.SecuredSimpleFeatureStore is not abstract and does not override abstract method modifyFeatures(org.opengis.feature.type.AttributeDescriptor,java.lang.Object,org.opengis.filter.Filter) in org.geotools.data.FeatureStore
[ERROR] -> [Help 1]
[ERROR]
[ERROR] To see the full stack trace of the errors, re-run Maven with the -e switch.
[ERROR] Re-run Maven using the -X switch to enable full debug logging.
[ERROR]
[ERROR] For more information about the errors and possible solutions, please read the following articles:
[ERROR] [Help 1] http://cwiki.apache.org/confluence/display/MAVEN/MojoFailureException
[ERROR]
[ERROR] After correcting the problems, you can resume the build with the command
[ERROR]   mvn <goals> -rf :gs-main
Build step 'Invoke top-level Maven targets' marked build as failure


_______________________________________________
Geoserver-devel mailing list
[hidden email]
https://lists.sourceforge.net/lists/listinfo/geoserver-devel
Reply | Threaded
Open this post in threaded view
|

Build failed in Jenkins: geoserver-java11 #561

Jenkins-2
See <http://build.geoserver.org/job/geoserver-java11/561/display/redirect>

------------------------------------------
[...truncated 1.95 MB...]
        at org.junit.internal.runners.statements.RunAfters.evaluate(RunAfters.java:27)
        at org.junit.rules.ExternalResource$1.evaluate(ExternalResource.java:48)
        at org.junit.rules.RunRules.evaluate(RunRules.java:20)
        at org.junit.runners.ParentRunner.runLeaf(ParentRunner.java:325)
        at org.junit.runners.BlockJUnit4ClassRunner.runChild(BlockJUnit4ClassRunner.java:78)
        at org.junit.runners.BlockJUnit4ClassRunner.runChild(BlockJUnit4ClassRunner.java:57)
        at org.junit.runners.ParentRunner$3.run(ParentRunner.java:290)
        at org.junit.runners.ParentRunner$1.schedule(ParentRunner.java:71)
        at org.junit.runners.ParentRunner.runChildren(ParentRunner.java:288)
        at org.junit.runners.ParentRunner.access$000(ParentRunner.java:58)
        at org.junit.runners.ParentRunner$2.evaluate(ParentRunner.java:268)
        at org.junit.internal.runners.statements.RunBefores.evaluate(RunBefores.java:26)
        at org.junit.internal.runners.statements.RunAfters.evaluate(RunAfters.java:27)
        at org.junit.runners.ParentRunner.run(ParentRunner.java:363)
        at org.apache.maven.surefire.junit4.JUnit4Provider.execute(JUnit4Provider.java:252)
        at org.apache.maven.surefire.junit4.JUnit4Provider.executeTestSet(JUnit4Provider.java:141)
        at org.apache.maven.surefire.junit4.JUnit4Provider.invoke(JUnit4Provider.java:112)
        at org.apache.maven.surefire.util.ReflectionUtils.invokeMethodWithArray(ReflectionUtils.java:189)
Tests run: 2, Failures: 0, Errors: 0, Skipped: 0, Time elapsed: 5.474 sec

Results :

Tests run: 3, Failures: 0, Errors: 0, Skipped: 0

[INFO]
[INFO] --- maven-jar-plugin:2.4:jar (default-jar) @ gs-importer-web ---
[INFO] Building jar: <http://build.geoserver.org/job/geoserver-java11/ws/src/extension/importer/web/target/gs-importer-web-2.16-SNAPSHOT.jar>
[INFO]
[INFO] --- maven-jar-plugin:2.4:test-jar (default) @ gs-importer-web ---
[INFO] Building jar: <http://build.geoserver.org/job/geoserver-java11/ws/src/extension/importer/web/target/gs-importer-web-2.16-SNAPSHOT-tests.jar>
[INFO]
[INFO] --- maven-source-plugin:2.2.1:jar-no-fork (attach-sources) @ gs-importer-web ---
[INFO] Building jar: <http://build.geoserver.org/job/geoserver-java11/ws/src/extension/importer/web/target/gs-importer-web-2.16-SNAPSHOT-sources.jar>
[INFO]
[INFO] --- maven-source-plugin:2.2.1:test-jar-no-fork (attach-sources) @ gs-importer-web ---
[INFO] Building jar: <http://build.geoserver.org/job/geoserver-java11/ws/src/extension/importer/web/target/gs-importer-web-2.16-SNAPSHOT-test-sources.jar>
[INFO]
[INFO] --- maven-install-plugin:2.4:install (default-install) @ gs-importer-web ---
[INFO] Installing <http://build.geoserver.org/job/geoserver-java11/ws/src/extension/importer/web/target/gs-importer-web-2.16-SNAPSHOT.jar> to <http://build.geoserver.org/job/geoserver-java11/ws/m2/org/geoserver/importer/gs-importer-web/2.16-SNAPSHOT/gs-importer-web-2.16-SNAPSHOT.jar>
[INFO] Installing <http://build.geoserver.org/job/geoserver-java11/ws/src/extension/importer/web/pom.xml> to <http://build.geoserver.org/job/geoserver-java11/ws/m2/org/geoserver/importer/gs-importer-web/2.16-SNAPSHOT/gs-importer-web-2.16-SNAPSHOT.pom>
[INFO] Installing <http://build.geoserver.org/job/geoserver-java11/ws/src/extension/importer/web/target/gs-importer-web-2.16-SNAPSHOT-tests.jar> to <http://build.geoserver.org/job/geoserver-java11/ws/m2/org/geoserver/importer/gs-importer-web/2.16-SNAPSHOT/gs-importer-web-2.16-SNAPSHOT-tests.jar>
[INFO] Installing <http://build.geoserver.org/job/geoserver-java11/ws/src/extension/importer/web/target/gs-importer-web-2.16-SNAPSHOT-sources.jar> to <http://build.geoserver.org/job/geoserver-java11/ws/m2/org/geoserver/importer/gs-importer-web/2.16-SNAPSHOT/gs-importer-web-2.16-SNAPSHOT-sources.jar>
[INFO] Installing <http://build.geoserver.org/job/geoserver-java11/ws/src/extension/importer/web/target/gs-importer-web-2.16-SNAPSHOT-test-sources.jar> to <http://build.geoserver.org/job/geoserver-java11/ws/m2/org/geoserver/importer/gs-importer-web/2.16-SNAPSHOT/gs-importer-web-2.16-SNAPSHOT-test-sources.jar>
[INFO]
[INFO] ---------------< org.geoserver.security:gs-web-sec-cas >----------------
[INFO] Building GeoServer CAS Security Web Module 2.16-SNAPSHOT         [94/99]
[INFO] --------------------------------[ jar ]---------------------------------
[INFO]
[INFO] --- maven-clean-plugin:2.5:clean (default-clean) @ gs-web-sec-cas ---
[INFO]
[INFO] --- git-commit-id-plugin:2.1.15:revision (default) @ gs-web-sec-cas ---
[INFO]
[INFO] --- directory-maven-plugin:0.3.1:highest-basedir (directories) @ gs-web-sec-cas ---
[INFO] Highest basedir set to: <http://build.geoserver.org/job/geoserver-java11/ws/src>
[INFO]
[INFO] --- fmt-maven-plugin:2.4.0:format (default) @ gs-web-sec-cas ---
[warn] Test source directory '<http://build.geoserver.org/job/geoserver-java11/ws/src/extension/security/web/web-cas/src/test/java'> does not exist, ignoring.
[debug] Using AOSP style
[INFO] Processed 2 files (0 reformatted).
[INFO]
[INFO] --- maven-resources-plugin:2.6:resources (default-resources) @ gs-web-sec-cas ---
[INFO] Using 'UTF-8' encoding to copy filtered resources.
[INFO] Copying 2 resources
[INFO] skip non existing resourceDirectory <http://build.geoserver.org/job/geoserver-java11/ws/src/extension/security/web/web-cas/src/main/resources>
[INFO]
[INFO] --- maven-compiler-plugin:3.8.0:compile (default-compile) @ gs-web-sec-cas ---
[INFO] Changes detected - recompiling the module!
[INFO] Compiling 2 source files to <http://build.geoserver.org/job/geoserver-java11/ws/src/extension/security/web/web-cas/target/classes>
[INFO]
[INFO] --- maven-resources-plugin:2.6:testResources (default-testResources) @ gs-web-sec-cas ---
[INFO] Using 'UTF-8' encoding to copy filtered resources.
[INFO] skip non existing resourceDirectory <http://build.geoserver.org/job/geoserver-java11/ws/src/extension/security/web/web-cas/src/test/java>
[INFO] skip non existing resourceDirectory <http://build.geoserver.org/job/geoserver-java11/ws/src/extension/security/web/web-cas/src/test/resources>
[INFO]
[INFO] --- maven-compiler-plugin:3.8.0:testCompile (default-testCompile) @ gs-web-sec-cas ---
[INFO] No sources to compile
[INFO]
[INFO] --- maven-surefire-plugin:2.12.3:test (default-test) @ gs-web-sec-cas ---
[INFO] No tests to run.
[INFO]
[INFO] --- maven-jar-plugin:2.4:jar (default-jar) @ gs-web-sec-cas ---
[INFO] Building jar: <http://build.geoserver.org/job/geoserver-java11/ws/src/extension/security/web/web-cas/target/gs-web-sec-cas-2.16-SNAPSHOT.jar>
[INFO]
[INFO] --- maven-jar-plugin:2.4:test-jar (default) @ gs-web-sec-cas ---
[WARNING] JAR will be empty - no content was marked for inclusion!
[INFO] Building jar: <http://build.geoserver.org/job/geoserver-java11/ws/src/extension/security/web/web-cas/target/gs-web-sec-cas-2.16-SNAPSHOT-tests.jar>
[INFO]
[INFO] --- maven-source-plugin:2.2.1:jar-no-fork (attach-sources) @ gs-web-sec-cas ---
[INFO] Building jar: <http://build.geoserver.org/job/geoserver-java11/ws/src/extension/security/web/web-cas/target/gs-web-sec-cas-2.16-SNAPSHOT-sources.jar>
[INFO]
[INFO] --- maven-source-plugin:2.2.1:test-jar-no-fork (attach-sources) @ gs-web-sec-cas ---
[INFO] No sources in project. Archive not created.
[INFO]
[INFO] --- maven-install-plugin:2.4:install (default-install) @ gs-web-sec-cas ---
[INFO] Installing <http://build.geoserver.org/job/geoserver-java11/ws/src/extension/security/web/web-cas/target/gs-web-sec-cas-2.16-SNAPSHOT.jar> to <http://build.geoserver.org/job/geoserver-java11/ws/m2/org/geoserver/security/gs-web-sec-cas/2.16-SNAPSHOT/gs-web-sec-cas-2.16-SNAPSHOT.jar>
[INFO] Installing <http://build.geoserver.org/job/geoserver-java11/ws/src/extension/security/web/web-cas/pom.xml> to <http://build.geoserver.org/job/geoserver-java11/ws/m2/org/geoserver/security/gs-web-sec-cas/2.16-SNAPSHOT/gs-web-sec-cas-2.16-SNAPSHOT.pom>
[INFO] Installing <http://build.geoserver.org/job/geoserver-java11/ws/src/extension/security/web/web-cas/target/gs-web-sec-cas-2.16-SNAPSHOT-tests.jar> to <http://build.geoserver.org/job/geoserver-java11/ws/m2/org/geoserver/security/gs-web-sec-cas/2.16-SNAPSHOT/gs-web-sec-cas-2.16-SNAPSHOT-tests.jar>
[INFO] Installing <http://build.geoserver.org/job/geoserver-java11/ws/src/extension/security/web/web-cas/target/gs-web-sec-cas-2.16-SNAPSHOT-sources.jar> to <http://build.geoserver.org/job/geoserver-java11/ws/m2/org/geoserver/security/gs-web-sec-cas/2.16-SNAPSHOT/gs-web-sec-cas-2.16-SNAPSHOT-sources.jar>
Tests run: 12, Failures: 0, Errors: 0, Skipped: 0, Time elapsed: 206.807 sec
Running org.geoserver.importer.bdb.SerialVersionSafeSerialBindingTest
Tests run: 1, Failures: 0, Errors: 0, Skipped: 0, Time elapsed: 0.335 sec
Running org.geoserver.importer.bdb.XStreamInfoSerialBindingTest
Tests run: 2, Failures: 0, Errors: 0, Skipped: 0, Time elapsed: 2.026 sec

Results :

Tests run: 15, Failures: 0, Errors: 0, Skipped: 0

[INFO]
[INFO] --- maven-jar-plugin:2.4:jar (default-jar) @ gs-importer-bdb ---
[INFO] Building jar: <http://build.geoserver.org/job/geoserver-java11/ws/src/extension/importer/bdb/target/gs-importer-bdb-2.16-SNAPSHOT.jar>
[INFO]
[INFO] --- maven-jar-plugin:2.4:test-jar (default) @ gs-importer-bdb ---
[INFO] Building jar: <http://build.geoserver.org/job/geoserver-java11/ws/src/extension/importer/bdb/target/gs-importer-bdb-2.16-SNAPSHOT-tests.jar>
[INFO]
[INFO] --- maven-source-plugin:2.2.1:jar-no-fork (attach-sources) @ gs-importer-bdb ---
[INFO] Building jar: <http://build.geoserver.org/job/geoserver-java11/ws/src/extension/importer/bdb/target/gs-importer-bdb-2.16-SNAPSHOT-sources.jar>
[INFO]
[INFO] --- maven-source-plugin:2.2.1:test-jar-no-fork (attach-sources) @ gs-importer-bdb ---
[INFO] Building jar: <http://build.geoserver.org/job/geoserver-java11/ws/src/extension/importer/bdb/target/gs-importer-bdb-2.16-SNAPSHOT-test-sources.jar>
[INFO]
[INFO] --- maven-install-plugin:2.4:install (default-install) @ gs-importer-bdb ---
[INFO] Installing <http://build.geoserver.org/job/geoserver-java11/ws/src/extension/importer/bdb/target/gs-importer-bdb-2.16-SNAPSHOT.jar> to <http://build.geoserver.org/job/geoserver-java11/ws/m2/org/geoserver/importer/gs-importer-bdb/2.16-SNAPSHOT/gs-importer-bdb-2.16-SNAPSHOT.jar>
[INFO] Installing <http://build.geoserver.org/job/geoserver-java11/ws/src/extension/importer/bdb/pom.xml> to <http://build.geoserver.org/job/geoserver-java11/ws/m2/org/geoserver/importer/gs-importer-bdb/2.16-SNAPSHOT/gs-importer-bdb-2.16-SNAPSHOT.pom>
[INFO] Installing <http://build.geoserver.org/job/geoserver-java11/ws/src/extension/importer/bdb/target/gs-importer-bdb-2.16-SNAPSHOT-tests.jar> to <http://build.geoserver.org/job/geoserver-java11/ws/m2/org/geoserver/importer/gs-importer-bdb/2.16-SNAPSHOT/gs-importer-bdb-2.16-SNAPSHOT-tests.jar>
[INFO] Installing <http://build.geoserver.org/job/geoserver-java11/ws/src/extension/importer/bdb/target/gs-importer-bdb-2.16-SNAPSHOT-sources.jar> to <http://build.geoserver.org/job/geoserver-java11/ws/m2/org/geoserver/importer/gs-importer-bdb/2.16-SNAPSHOT/gs-importer-bdb-2.16-SNAPSHOT-sources.jar>
[INFO] Installing <http://build.geoserver.org/job/geoserver-java11/ws/src/extension/importer/bdb/target/gs-importer-bdb-2.16-SNAPSHOT-test-sources.jar> to <http://build.geoserver.org/job/geoserver-java11/ws/m2/org/geoserver/importer/gs-importer-bdb/2.16-SNAPSHOT/gs-importer-bdb-2.16-SNAPSHOT-test-sources.jar>
[INFO] ------------------------------------------------------------------------
[INFO] Reactor Summary for GeoServer 2.16-SNAPSHOT:
[INFO]
[INFO] GeoServer .......................................... SUCCESS [  5.827 s]
[INFO] Core Platform Module ............................... SUCCESS [ 14.717 s]
[INFO] Open Web Service Module ............................ SUCCESS [ 11.731 s]
[INFO] Main Module ........................................ SUCCESS [01:02 min]
[INFO] GeoServer Security Modules ......................... SUCCESS [  0.049 s]
[INFO] GeoServer Security Tests Module .................... SUCCESS [01:31 min]
[INFO] GeoServer JDBC Security Module ..................... SUCCESS [ 39.307 s]
[INFO] GeoServer LDAP Security Module ..................... SUCCESS [ 20.243 s]
[INFO] Web Coverage Service Module ........................ SUCCESS [  0.553 s]
[INFO] Web Coverage Service 1.0 Module .................... SUCCESS [ 11.953 s]
[INFO] Web Coverage Service 1.1 Module .................... SUCCESS [ 14.737 s]
[INFO] Web Coverage Service 2.0 Module .................... SUCCESS [03:21 min]
[INFO] Web Feature Service Module ......................... SUCCESS [01:07 min]
[INFO] Web Map Service Module ............................. SUCCESS [01:48 min]
[INFO] KML support for GeoServer .......................... SUCCESS [ 18.526 s]
[INFO] gs-rest ............................................ SUCCESS [  7.572 s]
[INFO] GeoWebCache (GWC) Module ........................... FAILURE [ 47.572 s]
[INFO] gs-restconfig ...................................... SUCCESS [ 57.872 s]
[INFO] gs-restconfig-wcs .................................. SUCCESS [ 11.686 s]
[INFO] gs-restconfig-wfs .................................. SUCCESS [ 14.098 s]
[INFO] gs-restconfig-wms .................................. SUCCESS [  9.346 s]
[INFO] GeoServer Web Modules .............................. SUCCESS [  0.077 s]
[INFO] Core UI Module ..................................... SUCCESS [ 52.572 s]
[INFO] WMS UI Module ...................................... SUCCESS [ 21.774 s]
[INFO] GWC UI Module ...................................... SKIPPED
[INFO] WFS UI Module ...................................... SUCCESS [  6.889 s]
[INFO] Demos Module ....................................... SUCCESS [ 11.448 s]
[INFO] WCS UI Module ...................................... SUCCESS [  8.370 s]
[INFO] Security UI Modules ................................ SUCCESS [  0.034 s]
[INFO] Security UI Core Module ............................ SUCCESS [01:01 min]
[INFO] Security UI JDBC Module ............................ SUCCESS [04:45 min]
[INFO] Security UI LDAP Module ............................ SUCCESS [ 14.683 s]
[INFO] REST UI Module ..................................... SUCCESS [  7.213 s]
[INFO] GeoServer Extensions ............................... SUCCESS [  0.034 s]
[INFO] Printing Module .................................... SUCCESS [ 24.605 s]
[INFO] GeoServer Web Application .......................... SKIPPED
[INFO] Community Space .................................... SUCCESS [  0.023 s]
[INFO] Application Schema Support ......................... SUCCESS [  0.024 s]
[INFO] Application Schema Integration Test ................ SUCCESS [01:45 min]
[INFO] Sample DataAccess Integration Test ................. SUCCESS [  7.575 s]
[INFO] ArcSDE DataStore Extension ......................... SUCCESS [  8.092 s]
[INFO] H2 DataStore Extension ............................. SUCCESS [  7.477 s]
[INFO] SQL Server DataStore Extension ..................... SUCCESS [  1.415 s]
[INFO] Oracle DataStore Extension ......................... SUCCESS [  0.570 s]
[INFO] MySQL DataStore Extension .......................... SUCCESS [  0.893 s]
[INFO] DB2 DataStore Extension ............................ SUCCESS [  0.244 s]
[INFO] ImageMap Output Format ............................. SUCCESS [  4.366 s]
[INFO] ImageI/O-Ext GDAL Coverage Extension ............... SUCCESS [  2.528 s]
[INFO] JP2K Coverage Extension ............................ SUCCESS [  0.327 s]
[INFO] OGR parent ......................................... SUCCESS [  0.022 s]
[INFO] OGR CORE ........................................... SUCCESS [  0.378 s]
[INFO] OGR WFS ............................................ SUCCESS [  4.890 s]
[INFO] Web Processing Service parent ...................... SUCCESS [  0.021 s]
[INFO] Web Processing Service Module ...................... SUCCESS [01:04 min]
[INFO] OGR WPS ............................................ SUCCESS [  5.691 s]
[INFO] Excel Output Format ................................ SUCCESS [ 11.155 s]
[INFO] Chart external graphics support .................... SUCCESS [  2.691 s]
[INFO] Feature Generalization Extension ................... SUCCESS [  0.570 s]
[INFO] Image Mosaic JDBC Extension ........................ SUCCESS [  2.597 s]
[INFO] OWS request flow controller ........................ SUCCESS [ 10.828 s]
[INFO] Web process status sharing with Hazelcast .......... SUCCESS [ 15.892 s]
[INFO] Web Processing Service GUI ......................... SUCCESS [ 17.031 s]
[INFO] GeoServer Layer Querying filter functions .......... SUCCESS [  9.369 s]
[INFO] Teradata DataStore Extension ....................... SUCCESS [  0.651 s]
[INFO] GeoServer Monitor Extensions ....................... SUCCESS [  0.030 s]
[INFO] Core Monitor Extension ............................. SKIPPED
[INFO] GeoServer Security Extension Modules ............... SUCCESS [  0.030 s]
[INFO] GeoServer CAS Security Module ...................... SUCCESS [  6.170 s]
[INFO] GeoServer Security Extension Web Modules ........... SUCCESS [  0.029 s]
[INFO] GeoServer CAS Security Web Module .................. SUCCESS [  0.396 s]
[INFO] XLST based WFS output format ....................... SUCCESS [ 12.391 s]
[INFO] GeoServer INSPIRE Extensions ....................... SKIPPED
[INFO] GeoServer CSS Styling .............................. SUCCESS [ 14.987 s]
[INFO] Catalog Services for the Web parent ................ SUCCESS [  0.032 s]
[INFO] Catalog Services for the Web interfaces ............ SUCCESS [  6.342 s]
[INFO] Catalog Services for the Web - Simple CatalogStore implementation SUCCESS [  4.979 s]
[INFO] Catalog Services for the Web core module ........... SUCCESS [05:41 min]
[INFO] CSW UI Module ...................................... SUCCESS [  5.262 s]
[INFO] DXF WFS output format and WPS PPIO ................. SUCCESS [  0.023 s]
[INFO] DXF WFS output format .............................. SUCCESS [  7.495 s]
[INFO] DXF WPS PPIO ....................................... SUCCESS [  6.361 s]
[INFO] GeoServer WCS 2.0 Earth Observation Extensions ..... SUCCESS [  0.026 s]
[INFO] Web Coverage Service 2.0 Earth Observation extensions SUCCESS [ 10.742 s]
[INFO] Web Coverage Service 2.0 Earth Observation GUI extension SUCCESS [05:04 min]
[INFO] GeoServer libjpeg-turbo Module ..................... SUCCESS [  5.522 s]
[INFO] GeoServer Data Importer ............................ SUCCESS [  3.668 s]
[INFO] Importer Core Module ............................... SUCCESS [ 29.869 s]
[INFO] Importer REST Api Module-ng ........................ SUCCESS [ 31.111 s]
[INFO] Importer Berkley DB Persistence Module ............. SUCCESS [03:32 min]
[INFO] Importer Web UI Module ............................. SUCCESS [ 10.002 s]
[INFO] GRIB Coverage Format ............................... SUCCESS [ 18.258 s]
[INFO] NetCDF Coverage format ............................. SUCCESS [ 19.457 s]
[INFO] WCS NetCDF output Module ........................... SUCCESS [ 23.873 s]
[INFO] Vector Tiles ....................................... SUCCESS [ 15.649 s]
[INFO] Ysld GeoServer Plugin .............................. SKIPPED
[INFO] MongoDB Data Store ................................. SUCCESS [  2.452 s]
[INFO] REST SLD service ................................... SUCCESS [05:29 min]
[INFO] GeoFence security integration ...................... SUCCESS [04:39 min]
[INFO] GeoFence Server .................................... SUCCESS [05:08 min]
[INFO] ------------------------------------------------------------------------
[INFO] BUILD FAILURE
[INFO] ------------------------------------------------------------------------
[INFO] Total time:  32:14 min (Wall Clock)
[INFO] Finished at: 2019-06-02T08:01:07Z
[INFO] ------------------------------------------------------------------------
[ERROR] Failed to execute goal org.apache.maven.plugins:maven-surefire-plugin:2.12.3:test (default-test) on project gs-gwc: There are test failures.
[ERROR]
[ERROR] Please refer to <http://build.geoserver.org/job/geoserver-java11/ws/src/gwc/target/surefire-reports> for the individual test results.
[ERROR] -> [Help 1]
[ERROR]
[ERROR] To see the full stack trace of the errors, re-run Maven with the -e switch.
[ERROR] Re-run Maven using the -X switch to enable full debug logging.
[ERROR]
[ERROR] For more information about the errors and possible solutions, please read the following articles:
[ERROR] [Help 1] http://cwiki.apache.org/confluence/display/MAVEN/MojoFailureException
[ERROR]
[ERROR] After correcting the problems, you can resume the build with the command
[ERROR]   mvn <goals> -rf :gs-gwc
Build step 'Invoke top-level Maven targets' marked build as failure


_______________________________________________
Geoserver-devel mailing list
[hidden email]
https://lists.sourceforge.net/lists/listinfo/geoserver-devel
Reply | Threaded
Open this post in threaded view
|

Re: Build failed in Jenkins: geoserver-java11 #561

geowolf
Checked, the failure is bizarre:

Tests run: 21, Failures: 2, Errors: 0, Skipped: 0, Time elapsed: 2.041 sec <<< FAILURE!
testPutBadLayerEndpoint(org.geoserver.gwc.RESTIntegrationTest)  Time elapsed: 12 sec  <<< FAILURE!
org.junit.ComparisonFailure: expected:<[T]here is a mismatch b...> but was:<[]here is a mismatch b...>
	at org.junit.Assert.assertEquals(Assert.java:115)
	at org.junit.Assert.assertEquals(Assert.java:144)
	at org.geoserver.gwc.RESTIntegrationTest.testPutBadLayerEndpoint(RESTIntegrationTest.java:213)

I cannot reproduce locally using Java 11. Lack of a single char... maybe a charset related issue?

Cheers
Andrea

On Sun, Jun 2, 2019 at 10:01 AM Jenkins <[hidden email]> wrote:
See <http://build.geoserver.org/job/geoserver-java11/561/display/redirect>

------------------------------------------
[...truncated 1.95 MB...]
        at org.junit.internal.runners.statements.RunAfters.evaluate(RunAfters.java:27)
        at org.junit.rules.ExternalResource$1.evaluate(ExternalResource.java:48)
        at org.junit.rules.RunRules.evaluate(RunRules.java:20)
        at org.junit.runners.ParentRunner.runLeaf(ParentRunner.java:325)
        at org.junit.runners.BlockJUnit4ClassRunner.runChild(BlockJUnit4ClassRunner.java:78)
        at org.junit.runners.BlockJUnit4ClassRunner.runChild(BlockJUnit4ClassRunner.java:57)
        at org.junit.runners.ParentRunner$3.run(ParentRunner.java:290)
        at org.junit.runners.ParentRunner$1.schedule(ParentRunner.java:71)
        at org.junit.runners.ParentRunner.runChildren(ParentRunner.java:288)
        at org.junit.runners.ParentRunner.access$000(ParentRunner.java:58)
        at org.junit.runners.ParentRunner$2.evaluate(ParentRunner.java:268)
        at org.junit.internal.runners.statements.RunBefores.evaluate(RunBefores.java:26)
        at org.junit.internal.runners.statements.RunAfters.evaluate(RunAfters.java:27)
        at org.junit.runners.ParentRunner.run(ParentRunner.java:363)
        at org.apache.maven.surefire.junit4.JUnit4Provider.execute(JUnit4Provider.java:252)
        at org.apache.maven.surefire.junit4.JUnit4Provider.executeTestSet(JUnit4Provider.java:141)
        at org.apache.maven.surefire.junit4.JUnit4Provider.invoke(JUnit4Provider.java:112)
        at org.apache.maven.surefire.util.ReflectionUtils.invokeMethodWithArray(ReflectionUtils.java:189)
Tests run: 2, Failures: 0, Errors: 0, Skipped: 0, Time elapsed: 5.474 sec

Results :

Tests run: 3, Failures: 0, Errors: 0, Skipped: 0

[INFO]
[INFO] --- maven-jar-plugin:2.4:jar (default-jar) @ gs-importer-web ---
[INFO] Building jar: <http://build.geoserver.org/job/geoserver-java11/ws/src/extension/importer/web/target/gs-importer-web-2.16-SNAPSHOT.jar>
[INFO]
[INFO] --- maven-jar-plugin:2.4:test-jar (default) @ gs-importer-web ---
[INFO] Building jar: <http://build.geoserver.org/job/geoserver-java11/ws/src/extension/importer/web/target/gs-importer-web-2.16-SNAPSHOT-tests.jar>
[INFO]
[INFO] --- maven-source-plugin:2.2.1:jar-no-fork (attach-sources) @ gs-importer-web ---
[INFO] Building jar: <http://build.geoserver.org/job/geoserver-java11/ws/src/extension/importer/web/target/gs-importer-web-2.16-SNAPSHOT-sources.jar>
[INFO]
[INFO] --- maven-source-plugin:2.2.1:test-jar-no-fork (attach-sources) @ gs-importer-web ---
[INFO] Building jar: <http://build.geoserver.org/job/geoserver-java11/ws/src/extension/importer/web/target/gs-importer-web-2.16-SNAPSHOT-test-sources.jar>
[INFO]
[INFO] --- maven-install-plugin:2.4:install (default-install) @ gs-importer-web ---
[INFO] Installing <http://build.geoserver.org/job/geoserver-java11/ws/src/extension/importer/web/target/gs-importer-web-2.16-SNAPSHOT.jar> to <http://build.geoserver.org/job/geoserver-java11/ws/m2/org/geoserver/importer/gs-importer-web/2.16-SNAPSHOT/gs-importer-web-2.16-SNAPSHOT.jar>
[INFO] Installing <http://build.geoserver.org/job/geoserver-java11/ws/src/extension/importer/web/pom.xml> to <http://build.geoserver.org/job/geoserver-java11/ws/m2/org/geoserver/importer/gs-importer-web/2.16-SNAPSHOT/gs-importer-web-2.16-SNAPSHOT.pom>
[INFO] Installing <http://build.geoserver.org/job/geoserver-java11/ws/src/extension/importer/web/target/gs-importer-web-2.16-SNAPSHOT-tests.jar> to <http://build.geoserver.org/job/geoserver-java11/ws/m2/org/geoserver/importer/gs-importer-web/2.16-SNAPSHOT/gs-importer-web-2.16-SNAPSHOT-tests.jar>
[INFO] Installing <http://build.geoserver.org/job/geoserver-java11/ws/src/extension/importer/web/target/gs-importer-web-2.16-SNAPSHOT-sources.jar> to <http://build.geoserver.org/job/geoserver-java11/ws/m2/org/geoserver/importer/gs-importer-web/2.16-SNAPSHOT/gs-importer-web-2.16-SNAPSHOT-sources.jar>
[INFO] Installing <http://build.geoserver.org/job/geoserver-java11/ws/src/extension/importer/web/target/gs-importer-web-2.16-SNAPSHOT-test-sources.jar> to <http://build.geoserver.org/job/geoserver-java11/ws/m2/org/geoserver/importer/gs-importer-web/2.16-SNAPSHOT/gs-importer-web-2.16-SNAPSHOT-test-sources.jar>
[INFO]
[INFO] ---------------< org.geoserver.security:gs-web-sec-cas >----------------
[INFO] Building GeoServer CAS Security Web Module 2.16-SNAPSHOT         [94/99]
[INFO] --------------------------------[ jar ]---------------------------------
[INFO]
[INFO] --- maven-clean-plugin:2.5:clean (default-clean) @ gs-web-sec-cas ---
[INFO]
[INFO] --- git-commit-id-plugin:2.1.15:revision (default) @ gs-web-sec-cas ---
[INFO]
[INFO] --- directory-maven-plugin:0.3.1:highest-basedir (directories) @ gs-web-sec-cas ---
[INFO] Highest basedir set to: <http://build.geoserver.org/job/geoserver-java11/ws/src>
[INFO]
[INFO] --- fmt-maven-plugin:2.4.0:format (default) @ gs-web-sec-cas ---
[warn] Test source directory '<http://build.geoserver.org/job/geoserver-java11/ws/src/extension/security/web/web-cas/src/test/java'> does not exist, ignoring.
[debug] Using AOSP style
[INFO] Processed 2 files (0 reformatted).
[INFO]
[INFO] --- maven-resources-plugin:2.6:resources (default-resources) @ gs-web-sec-cas ---
[INFO] Using 'UTF-8' encoding to copy filtered resources.
[INFO] Copying 2 resources
[INFO] skip non existing resourceDirectory <http://build.geoserver.org/job/geoserver-java11/ws/src/extension/security/web/web-cas/src/main/resources>
[INFO]
[INFO] --- maven-compiler-plugin:3.8.0:compile (default-compile) @ gs-web-sec-cas ---
[INFO] Changes detected - recompiling the module!
[INFO] Compiling 2 source files to <http://build.geoserver.org/job/geoserver-java11/ws/src/extension/security/web/web-cas/target/classes>
[INFO]
[INFO] --- maven-resources-plugin:2.6:testResources (default-testResources) @ gs-web-sec-cas ---
[INFO] Using 'UTF-8' encoding to copy filtered resources.
[INFO] skip non existing resourceDirectory <http://build.geoserver.org/job/geoserver-java11/ws/src/extension/security/web/web-cas/src/test/java>
[INFO] skip non existing resourceDirectory <http://build.geoserver.org/job/geoserver-java11/ws/src/extension/security/web/web-cas/src/test/resources>
[INFO]
[INFO] --- maven-compiler-plugin:3.8.0:testCompile (default-testCompile) @ gs-web-sec-cas ---
[INFO] No sources to compile
[INFO]
[INFO] --- maven-surefire-plugin:2.12.3:test (default-test) @ gs-web-sec-cas ---
[INFO] No tests to run.
[INFO]
[INFO] --- maven-jar-plugin:2.4:jar (default-jar) @ gs-web-sec-cas ---
[INFO] Building jar: <http://build.geoserver.org/job/geoserver-java11/ws/src/extension/security/web/web-cas/target/gs-web-sec-cas-2.16-SNAPSHOT.jar>
[INFO]
[INFO] --- maven-jar-plugin:2.4:test-jar (default) @ gs-web-sec-cas ---
[WARNING] JAR will be empty - no content was marked for inclusion!
[INFO] Building jar: <http://build.geoserver.org/job/geoserver-java11/ws/src/extension/security/web/web-cas/target/gs-web-sec-cas-2.16-SNAPSHOT-tests.jar>
[INFO]
[INFO] --- maven-source-plugin:2.2.1:jar-no-fork (attach-sources) @ gs-web-sec-cas ---
[INFO] Building jar: <http://build.geoserver.org/job/geoserver-java11/ws/src/extension/security/web/web-cas/target/gs-web-sec-cas-2.16-SNAPSHOT-sources.jar>
[INFO]
[INFO] --- maven-source-plugin:2.2.1:test-jar-no-fork (attach-sources) @ gs-web-sec-cas ---
[INFO] No sources in project. Archive not created.
[INFO]
[INFO] --- maven-install-plugin:2.4:install (default-install) @ gs-web-sec-cas ---
[INFO] Installing <http://build.geoserver.org/job/geoserver-java11/ws/src/extension/security/web/web-cas/target/gs-web-sec-cas-2.16-SNAPSHOT.jar> to <http://build.geoserver.org/job/geoserver-java11/ws/m2/org/geoserver/security/gs-web-sec-cas/2.16-SNAPSHOT/gs-web-sec-cas-2.16-SNAPSHOT.jar>
[INFO] Installing <http://build.geoserver.org/job/geoserver-java11/ws/src/extension/security/web/web-cas/pom.xml> to <http://build.geoserver.org/job/geoserver-java11/ws/m2/org/geoserver/security/gs-web-sec-cas/2.16-SNAPSHOT/gs-web-sec-cas-2.16-SNAPSHOT.pom>
[INFO] Installing <http://build.geoserver.org/job/geoserver-java11/ws/src/extension/security/web/web-cas/target/gs-web-sec-cas-2.16-SNAPSHOT-tests.jar> to <http://build.geoserver.org/job/geoserver-java11/ws/m2/org/geoserver/security/gs-web-sec-cas/2.16-SNAPSHOT/gs-web-sec-cas-2.16-SNAPSHOT-tests.jar>
[INFO] Installing <http://build.geoserver.org/job/geoserver-java11/ws/src/extension/security/web/web-cas/target/gs-web-sec-cas-2.16-SNAPSHOT-sources.jar> to <http://build.geoserver.org/job/geoserver-java11/ws/m2/org/geoserver/security/gs-web-sec-cas/2.16-SNAPSHOT/gs-web-sec-cas-2.16-SNAPSHOT-sources.jar>
Tests run: 12, Failures: 0, Errors: 0, Skipped: 0, Time elapsed: 206.807 sec
Running org.geoserver.importer.bdb.SerialVersionSafeSerialBindingTest
Tests run: 1, Failures: 0, Errors: 0, Skipped: 0, Time elapsed: 0.335 sec
Running org.geoserver.importer.bdb.XStreamInfoSerialBindingTest
Tests run: 2, Failures: 0, Errors: 0, Skipped: 0, Time elapsed: 2.026 sec

Results :

Tests run: 15, Failures: 0, Errors: 0, Skipped: 0

[INFO]
[INFO] --- maven-jar-plugin:2.4:jar (default-jar) @ gs-importer-bdb ---
[INFO] Building jar: <http://build.geoserver.org/job/geoserver-java11/ws/src/extension/importer/bdb/target/gs-importer-bdb-2.16-SNAPSHOT.jar>
[INFO]
[INFO] --- maven-jar-plugin:2.4:test-jar (default) @ gs-importer-bdb ---
[INFO] Building jar: <http://build.geoserver.org/job/geoserver-java11/ws/src/extension/importer/bdb/target/gs-importer-bdb-2.16-SNAPSHOT-tests.jar>
[INFO]
[INFO] --- maven-source-plugin:2.2.1:jar-no-fork (attach-sources) @ gs-importer-bdb ---
[INFO] Building jar: <http://build.geoserver.org/job/geoserver-java11/ws/src/extension/importer/bdb/target/gs-importer-bdb-2.16-SNAPSHOT-sources.jar>
[INFO]
[INFO] --- maven-source-plugin:2.2.1:test-jar-no-fork (attach-sources) @ gs-importer-bdb ---
[INFO] Building jar: <http://build.geoserver.org/job/geoserver-java11/ws/src/extension/importer/bdb/target/gs-importer-bdb-2.16-SNAPSHOT-test-sources.jar>
[INFO]
[INFO] --- maven-install-plugin:2.4:install (default-install) @ gs-importer-bdb ---
[INFO] Installing <http://build.geoserver.org/job/geoserver-java11/ws/src/extension/importer/bdb/target/gs-importer-bdb-2.16-SNAPSHOT.jar> to <http://build.geoserver.org/job/geoserver-java11/ws/m2/org/geoserver/importer/gs-importer-bdb/2.16-SNAPSHOT/gs-importer-bdb-2.16-SNAPSHOT.jar>
[INFO] Installing <http://build.geoserver.org/job/geoserver-java11/ws/src/extension/importer/bdb/pom.xml> to <http://build.geoserver.org/job/geoserver-java11/ws/m2/org/geoserver/importer/gs-importer-bdb/2.16-SNAPSHOT/gs-importer-bdb-2.16-SNAPSHOT.pom>
[INFO] Installing <http://build.geoserver.org/job/geoserver-java11/ws/src/extension/importer/bdb/target/gs-importer-bdb-2.16-SNAPSHOT-tests.jar> to <http://build.geoserver.org/job/geoserver-java11/ws/m2/org/geoserver/importer/gs-importer-bdb/2.16-SNAPSHOT/gs-importer-bdb-2.16-SNAPSHOT-tests.jar>
[INFO] Installing <http://build.geoserver.org/job/geoserver-java11/ws/src/extension/importer/bdb/target/gs-importer-bdb-2.16-SNAPSHOT-sources.jar> to <http://build.geoserver.org/job/geoserver-java11/ws/m2/org/geoserver/importer/gs-importer-bdb/2.16-SNAPSHOT/gs-importer-bdb-2.16-SNAPSHOT-sources.jar>
[INFO] Installing <http://build.geoserver.org/job/geoserver-java11/ws/src/extension/importer/bdb/target/gs-importer-bdb-2.16-SNAPSHOT-test-sources.jar> to <http://build.geoserver.org/job/geoserver-java11/ws/m2/org/geoserver/importer/gs-importer-bdb/2.16-SNAPSHOT/gs-importer-bdb-2.16-SNAPSHOT-test-sources.jar>
[INFO] ------------------------------------------------------------------------
[INFO] Reactor Summary for GeoServer 2.16-SNAPSHOT:
[INFO]
[INFO] GeoServer .......................................... SUCCESS [  5.827 s]
[INFO] Core Platform Module ............................... SUCCESS [ 14.717 s]
[INFO] Open Web Service Module ............................ SUCCESS [ 11.731 s]
[INFO] Main Module ........................................ SUCCESS [01:02 min]
[INFO] GeoServer Security Modules ......................... SUCCESS [  0.049 s]
[INFO] GeoServer Security Tests Module .................... SUCCESS [01:31 min]
[INFO] GeoServer JDBC Security Module ..................... SUCCESS [ 39.307 s]
[INFO] GeoServer LDAP Security Module ..................... SUCCESS [ 20.243 s]
[INFO] Web Coverage Service Module ........................ SUCCESS [  0.553 s]
[INFO] Web Coverage Service 1.0 Module .................... SUCCESS [ 11.953 s]
[INFO] Web Coverage Service 1.1 Module .................... SUCCESS [ 14.737 s]
[INFO] Web Coverage Service 2.0 Module .................... SUCCESS [03:21 min]
[INFO] Web Feature Service Module ......................... SUCCESS [01:07 min]
[INFO] Web Map Service Module ............................. SUCCESS [01:48 min]
[INFO] KML support for GeoServer .......................... SUCCESS [ 18.526 s]
[INFO] gs-rest ............................................ SUCCESS [  7.572 s]
[INFO] GeoWebCache (GWC) Module ........................... FAILURE [ 47.572 s]
[INFO] gs-restconfig ...................................... SUCCESS [ 57.872 s]
[INFO] gs-restconfig-wcs .................................. SUCCESS [ 11.686 s]
[INFO] gs-restconfig-wfs .................................. SUCCESS [ 14.098 s]
[INFO] gs-restconfig-wms .................................. SUCCESS [  9.346 s]
[INFO] GeoServer Web Modules .............................. SUCCESS [  0.077 s]
[INFO] Core UI Module ..................................... SUCCESS [ 52.572 s]
[INFO] WMS UI Module ...................................... SUCCESS [ 21.774 s]
[INFO] GWC UI Module ...................................... SKIPPED
[INFO] WFS UI Module ...................................... SUCCESS [  6.889 s]
[INFO] Demos Module ....................................... SUCCESS [ 11.448 s]
[INFO] WCS UI Module ...................................... SUCCESS [  8.370 s]
[INFO] Security UI Modules ................................ SUCCESS [  0.034 s]
[INFO] Security UI Core Module ............................ SUCCESS [01:01 min]
[INFO] Security UI JDBC Module ............................ SUCCESS [04:45 min]
[INFO] Security UI LDAP Module ............................ SUCCESS [ 14.683 s]
[INFO] REST UI Module ..................................... SUCCESS [  7.213 s]
[INFO] GeoServer Extensions ............................... SUCCESS [  0.034 s]
[INFO] Printing Module .................................... SUCCESS [ 24.605 s]
[INFO] GeoServer Web Application .......................... SKIPPED
[INFO] Community Space .................................... SUCCESS [  0.023 s]
[INFO] Application Schema Support ......................... SUCCESS [  0.024 s]
[INFO] Application Schema Integration Test ................ SUCCESS [01:45 min]
[INFO] Sample DataAccess Integration Test ................. SUCCESS [  7.575 s]
[INFO] ArcSDE DataStore Extension ......................... SUCCESS [  8.092 s]
[INFO] H2 DataStore Extension ............................. SUCCESS [  7.477 s]
[INFO] SQL Server DataStore Extension ..................... SUCCESS [  1.415 s]
[INFO] Oracle DataStore Extension ......................... SUCCESS [  0.570 s]
[INFO] MySQL DataStore Extension .......................... SUCCESS [  0.893 s]
[INFO] DB2 DataStore Extension ............................ SUCCESS [  0.244 s]
[INFO] ImageMap Output Format ............................. SUCCESS [  4.366 s]
[INFO] ImageI/O-Ext GDAL Coverage Extension ............... SUCCESS [  2.528 s]
[INFO] JP2K Coverage Extension ............................ SUCCESS [  0.327 s]
[INFO] OGR parent ......................................... SUCCESS [  0.022 s]
[INFO] OGR CORE ........................................... SUCCESS [  0.378 s]
[INFO] OGR WFS ............................................ SUCCESS [  4.890 s]
[INFO] Web Processing Service parent ...................... SUCCESS [  0.021 s]
[INFO] Web Processing Service Module ...................... SUCCESS [01:04 min]
[INFO] OGR WPS ............................................ SUCCESS [  5.691 s]
[INFO] Excel Output Format ................................ SUCCESS [ 11.155 s]
[INFO] Chart external graphics support .................... SUCCESS [  2.691 s]
[INFO] Feature Generalization Extension ................... SUCCESS [  0.570 s]
[INFO] Image Mosaic JDBC Extension ........................ SUCCESS [  2.597 s]
[INFO] OWS request flow controller ........................ SUCCESS [ 10.828 s]
[INFO] Web process status sharing with Hazelcast .......... SUCCESS [ 15.892 s]
[INFO] Web Processing Service GUI ......................... SUCCESS [ 17.031 s]
[INFO] GeoServer Layer Querying filter functions .......... SUCCESS [  9.369 s]
[INFO] Teradata DataStore Extension ....................... SUCCESS [  0.651 s]
[INFO] GeoServer Monitor Extensions ....................... SUCCESS [  0.030 s]
[INFO] Core Monitor Extension ............................. SKIPPED
[INFO] GeoServer Security Extension Modules ............... SUCCESS [  0.030 s]
[INFO] GeoServer CAS Security Module ...................... SUCCESS [  6.170 s]
[INFO] GeoServer Security Extension Web Modules ........... SUCCESS [  0.029 s]
[INFO] GeoServer CAS Security Web Module .................. SUCCESS [  0.396 s]
[INFO] XLST based WFS output format ....................... SUCCESS [ 12.391 s]
[INFO] GeoServer INSPIRE Extensions ....................... SKIPPED
[INFO] GeoServer CSS Styling .............................. SUCCESS [ 14.987 s]
[INFO] Catalog Services for the Web parent ................ SUCCESS [  0.032 s]
[INFO] Catalog Services for the Web interfaces ............ SUCCESS [  6.342 s]
[INFO] Catalog Services for the Web - Simple CatalogStore implementation SUCCESS [  4.979 s]
[INFO] Catalog Services for the Web core module ........... SUCCESS [05:41 min]
[INFO] CSW UI Module ...................................... SUCCESS [  5.262 s]
[INFO] DXF WFS output format and WPS PPIO ................. SUCCESS [  0.023 s]
[INFO] DXF WFS output format .............................. SUCCESS [  7.495 s]
[INFO] DXF WPS PPIO ....................................... SUCCESS [  6.361 s]
[INFO] GeoServer WCS 2.0 Earth Observation Extensions ..... SUCCESS [  0.026 s]
[INFO] Web Coverage Service 2.0 Earth Observation extensions SUCCESS [ 10.742 s]
[INFO] Web Coverage Service 2.0 Earth Observation GUI extension SUCCESS [05:04 min]
[INFO] GeoServer libjpeg-turbo Module ..................... SUCCESS [  5.522 s]
[INFO] GeoServer Data Importer ............................ SUCCESS [  3.668 s]
[INFO] Importer Core Module ............................... SUCCESS [ 29.869 s]
[INFO] Importer REST Api Module-ng ........................ SUCCESS [ 31.111 s]
[INFO] Importer Berkley DB Persistence Module ............. SUCCESS [03:32 min]
[INFO] Importer Web UI Module ............................. SUCCESS [ 10.002 s]
[INFO] GRIB Coverage Format ............................... SUCCESS [ 18.258 s]
[INFO] NetCDF Coverage format ............................. SUCCESS [ 19.457 s]
[INFO] WCS NetCDF output Module ........................... SUCCESS [ 23.873 s]
[INFO] Vector Tiles ....................................... SUCCESS [ 15.649 s]
[INFO] Ysld GeoServer Plugin .............................. SKIPPED
[INFO] MongoDB Data Store ................................. SUCCESS [  2.452 s]
[INFO] REST SLD service ................................... SUCCESS [05:29 min]
[INFO] GeoFence security integration ...................... SUCCESS [04:39 min]
[INFO] GeoFence Server .................................... SUCCESS [05:08 min]
[INFO] ------------------------------------------------------------------------
[INFO] BUILD FAILURE
[INFO] ------------------------------------------------------------------------
[INFO] Total time:  32:14 min (Wall Clock)
[INFO] Finished at: 2019-06-02T08:01:07Z
[INFO] ------------------------------------------------------------------------
[ERROR] Failed to execute goal org.apache.maven.plugins:maven-surefire-plugin:2.12.3:test (default-test) on project gs-gwc: There are test failures.
[ERROR]
[ERROR] Please refer to <http://build.geoserver.org/job/geoserver-java11/ws/src/gwc/target/surefire-reports> for the individual test results.
[ERROR] -> [Help 1]
[ERROR]
[ERROR] To see the full stack trace of the errors, re-run Maven with the -e switch.
[ERROR] Re-run Maven using the -X switch to enable full debug logging.
[ERROR]
[ERROR] For more information about the errors and possible solutions, please read the following articles:
[ERROR] [Help 1] http://cwiki.apache.org/confluence/display/MAVEN/MojoFailureException
[ERROR]
[ERROR] After correcting the problems, you can resume the build with the command
[ERROR]   mvn <goals> -rf :gs-gwc
Build step 'Invoke top-level Maven targets' marked build as failure


--

Regards, Andrea Aime == GeoServer Professional Services from the experts! Visit http://goo.gl/it488V for more information. == Ing. Andrea Aime @geowolf Technical Lead GeoSolutions S.A.S. Via di Montramito 3/A 55054 Massarosa (LU) phone: +39 0584 962313 fax: +39 0584 1660272 mob: +39 339 8844549 http://www.geo-solutions.it http://twitter.com/geosolutions_it ------------------------------------------------------- Con riferimento alla normativa sul trattamento dei dati personali (Reg. UE 2016/679 - Regolamento generale sulla protezione dei dati “GDPR”), si precisa che ogni circostanza inerente alla presente email (il suo contenuto, gli eventuali allegati, etc.) è un dato la cui conoscenza è riservata al/i solo/i destinatario/i indicati dallo scrivente. Se il messaggio Le è giunto per errore, è tenuta/o a cancellarlo, ogni altra operazione è illecita. Le sarei comunque grato se potesse darmene notizia. This email is intended only for the person or entity to which it is addressed and may contain information that is privileged, confidential or otherwise protected from disclosure. We remind that - as provided by European Regulation 2016/679 “GDPR” - copying, dissemination or use of this e-mail or the information herein by anyone other than the intended recipient is prohibited. If you have received this email by mistake, please notify us immediately by telephone or e-mail.



_______________________________________________
Geoserver-devel mailing list
[hidden email]
https://lists.sourceforge.net/lists/listinfo/geoserver-devel
Reply | Threaded
Open this post in threaded view
|

Build failed in Jenkins: geoserver-java11 #562

Jenkins-2
In reply to this post by Jenkins-2
See <http://build.geoserver.org/job/geoserver-java11/562/display/redirect?page=changes>

Changes:

[Torben Barsballe] [GEOS-8752] Allow integrated GWC to seed secured layers - Add regression

------------------------------------------
[...truncated 1.43 MB...]
        at org.apache.maven.surefire.junit4.JUnit4Provider.invoke(JUnit4Provider.java:112)
        at org.apache.maven.surefire.util.ReflectionUtils.invokeMethodWithArray(ReflectionUtils.java:189)
Tests run: 2, Failures: 0, Errors: 0, Skipped: 0, Time elapsed: 7.976 sec

Results :

Tests run: 3, Failures: 0, Errors: 0, Skipped: 0

[INFO]
[INFO] --- maven-jar-plugin:2.4:jar (default-jar) @ gs-importer-web ---
[INFO] Building jar: <http://build.geoserver.org/job/geoserver-java11/ws/src/extension/importer/web/target/gs-importer-web-2.16-SNAPSHOT.jar>
[INFO]
[INFO] --- maven-jar-plugin:2.4:test-jar (default) @ gs-importer-web ---
[INFO] Building jar: <http://build.geoserver.org/job/geoserver-java11/ws/src/extension/importer/web/target/gs-importer-web-2.16-SNAPSHOT-tests.jar>
[INFO]
[INFO] --- maven-source-plugin:2.2.1:jar-no-fork (attach-sources) @ gs-importer-web ---
[INFO] Building jar: <http://build.geoserver.org/job/geoserver-java11/ws/src/extension/importer/web/target/gs-importer-web-2.16-SNAPSHOT-sources.jar>
[INFO]
[INFO] --- maven-source-plugin:2.2.1:test-jar-no-fork (attach-sources) @ gs-importer-web ---
[INFO] Building jar: <http://build.geoserver.org/job/geoserver-java11/ws/src/extension/importer/web/target/gs-importer-web-2.16-SNAPSHOT-test-sources.jar>
[INFO]
[INFO] --- maven-install-plugin:2.4:install (default-install) @ gs-importer-web ---
[INFO] Installing <http://build.geoserver.org/job/geoserver-java11/ws/src/extension/importer/web/target/gs-importer-web-2.16-SNAPSHOT.jar> to <http://build.geoserver.org/job/geoserver-java11/ws/m2/org/geoserver/importer/gs-importer-web/2.16-SNAPSHOT/gs-importer-web-2.16-SNAPSHOT.jar>
[INFO] Installing <http://build.geoserver.org/job/geoserver-java11/ws/src/extension/importer/web/pom.xml> to <http://build.geoserver.org/job/geoserver-java11/ws/m2/org/geoserver/importer/gs-importer-web/2.16-SNAPSHOT/gs-importer-web-2.16-SNAPSHOT.pom>
[INFO] Installing <http://build.geoserver.org/job/geoserver-java11/ws/src/extension/importer/web/target/gs-importer-web-2.16-SNAPSHOT-tests.jar> to <http://build.geoserver.org/job/geoserver-java11/ws/m2/org/geoserver/importer/gs-importer-web/2.16-SNAPSHOT/gs-importer-web-2.16-SNAPSHOT-tests.jar>
[INFO] Installing <http://build.geoserver.org/job/geoserver-java11/ws/src/extension/importer/web/target/gs-importer-web-2.16-SNAPSHOT-sources.jar> to <http://build.geoserver.org/job/geoserver-java11/ws/m2/org/geoserver/importer/gs-importer-web/2.16-SNAPSHOT/gs-importer-web-2.16-SNAPSHOT-sources.jar>
[INFO] Installing <http://build.geoserver.org/job/geoserver-java11/ws/src/extension/importer/web/target/gs-importer-web-2.16-SNAPSHOT-test-sources.jar> to <http://build.geoserver.org/job/geoserver-java11/ws/m2/org/geoserver/importer/gs-importer-web/2.16-SNAPSHOT/gs-importer-web-2.16-SNAPSHOT-test-sources.jar>
[INFO]
[INFO] ------------------------------------------------------------------------
[INFO] Skipping GeoServer Web Application
[INFO] This project has been banned from the build due to previous failures.
[INFO] ------------------------------------------------------------------------
[INFO]
[INFO] ---------------< org.geoserver.security:gs-web-sec-cas >----------------
[INFO] Building GeoServer CAS Security Web Module 2.16-SNAPSHOT         [94/99]
[INFO] --------------------------------[ jar ]---------------------------------
[INFO]
[INFO] --- maven-clean-plugin:2.5:clean (default-clean) @ gs-web-sec-cas ---
[INFO] Deleting <http://build.geoserver.org/job/geoserver-java11/ws/src/extension/security/web/web-cas/target>
[INFO]
[INFO] --- git-commit-id-plugin:2.1.15:revision (default) @ gs-web-sec-cas ---
[INFO]
[INFO] --- directory-maven-plugin:0.3.1:highest-basedir (directories) @ gs-web-sec-cas ---
[INFO] Highest basedir set to: <http://build.geoserver.org/job/geoserver-java11/ws/src>
[INFO]
[INFO] --- fmt-maven-plugin:2.4.0:format (default) @ gs-web-sec-cas ---
[warn] Test source directory '<http://build.geoserver.org/job/geoserver-java11/ws/src/extension/security/web/web-cas/src/test/java'> does not exist, ignoring.
[debug] Using AOSP style
[INFO] Processed 2 files (0 reformatted).
[INFO]
[INFO] --- maven-resources-plugin:2.6:resources (default-resources) @ gs-web-sec-cas ---
[INFO] Using 'UTF-8' encoding to copy filtered resources.
[INFO] Copying 2 resources
[INFO] skip non existing resourceDirectory <http://build.geoserver.org/job/geoserver-java11/ws/src/extension/security/web/web-cas/src/main/resources>
[INFO]
[INFO] --- maven-compiler-plugin:3.8.0:compile (default-compile) @ gs-web-sec-cas ---
[INFO] Changes detected - recompiling the module!
[INFO] Compiling 2 source files to <http://build.geoserver.org/job/geoserver-java11/ws/src/extension/security/web/web-cas/target/classes>
[INFO]
[INFO] --- maven-resources-plugin:2.6:testResources (default-testResources) @ gs-web-sec-cas ---
[INFO] Using 'UTF-8' encoding to copy filtered resources.
[INFO] skip non existing resourceDirectory <http://build.geoserver.org/job/geoserver-java11/ws/src/extension/security/web/web-cas/src/test/java>
[INFO] skip non existing resourceDirectory <http://build.geoserver.org/job/geoserver-java11/ws/src/extension/security/web/web-cas/src/test/resources>
[INFO]
[INFO] --- maven-compiler-plugin:3.8.0:testCompile (default-testCompile) @ gs-web-sec-cas ---
[INFO] No sources to compile
[INFO]
[INFO] --- maven-surefire-plugin:2.12.3:test (default-test) @ gs-web-sec-cas ---
[INFO] No tests to run.
[INFO]
[INFO] --- maven-jar-plugin:2.4:jar (default-jar) @ gs-web-sec-cas ---
[INFO] Building jar: <http://build.geoserver.org/job/geoserver-java11/ws/src/extension/security/web/web-cas/target/gs-web-sec-cas-2.16-SNAPSHOT.jar>
[INFO]
[INFO] --- maven-jar-plugin:2.4:test-jar (default) @ gs-web-sec-cas ---
[WARNING] JAR will be empty - no content was marked for inclusion!
[INFO] Building jar: <http://build.geoserver.org/job/geoserver-java11/ws/src/extension/security/web/web-cas/target/gs-web-sec-cas-2.16-SNAPSHOT-tests.jar>
[INFO]
[INFO] --- maven-source-plugin:2.2.1:jar-no-fork (attach-sources) @ gs-web-sec-cas ---
[INFO] Building jar: <http://build.geoserver.org/job/geoserver-java11/ws/src/extension/security/web/web-cas/target/gs-web-sec-cas-2.16-SNAPSHOT-sources.jar>
[INFO]
[INFO] --- maven-source-plugin:2.2.1:test-jar-no-fork (attach-sources) @ gs-web-sec-cas ---
[INFO] No sources in project. Archive not created.
[INFO]
[INFO] --- maven-install-plugin:2.4:install (default-install) @ gs-web-sec-cas ---
[INFO] Installing <http://build.geoserver.org/job/geoserver-java11/ws/src/extension/security/web/web-cas/target/gs-web-sec-cas-2.16-SNAPSHOT.jar> to <http://build.geoserver.org/job/geoserver-java11/ws/m2/org/geoserver/security/gs-web-sec-cas/2.16-SNAPSHOT/gs-web-sec-cas-2.16-SNAPSHOT.jar>
[INFO] Installing <http://build.geoserver.org/job/geoserver-java11/ws/src/extension/security/web/web-cas/pom.xml> to <http://build.geoserver.org/job/geoserver-java11/ws/m2/org/geoserver/security/gs-web-sec-cas/2.16-SNAPSHOT/gs-web-sec-cas-2.16-SNAPSHOT.pom>
[INFO] Installing <http://build.geoserver.org/job/geoserver-java11/ws/src/extension/security/web/web-cas/target/gs-web-sec-cas-2.16-SNAPSHOT-tests.jar> to <http://build.geoserver.org/job/geoserver-java11/ws/m2/org/geoserver/security/gs-web-sec-cas/2.16-SNAPSHOT/gs-web-sec-cas-2.16-SNAPSHOT-tests.jar>
[INFO] Installing <http://build.geoserver.org/job/geoserver-java11/ws/src/extension/security/web/web-cas/target/gs-web-sec-cas-2.16-SNAPSHOT-sources.jar> to <http://build.geoserver.org/job/geoserver-java11/ws/m2/org/geoserver/security/gs-web-sec-cas/2.16-SNAPSHOT/gs-web-sec-cas-2.16-SNAPSHOT-sources.jar>
Tests run: 1, Failures: 0, Errors: 0, Skipped: 0, Time elapsed: 414.368 sec
Running org.geoserver.geofence.rest.AdminRulesRestControllerTest
Skipping test in AdminRulesRestControllerTest as GeoFence service is down: in order to run this test you need the services to be running on port 9191
Tests run: 2, Failures: 0, Errors: 0, Skipped: 0, Time elapsed: 2.255 sec
Running org.geoserver.geofence.rest.MultiPolygonAdapterTest
Tests run: 2, Failures: 0, Errors: 0, Skipped: 0, Time elapsed: 3.376 sec
Running org.geoserver.geofence.rest.RulesRestControllerTest
Skipping test in RulesRestControllerTest as GeoFence service is down: in order to run this test you need the services to be running on port 9191
Tests run: 5, Failures: 0, Errors: 0, Skipped: 0, Time elapsed: 2.827 sec
Running org.geoserver.geofence.web.GeofenceRulesModelTest
Tests run: 1, Failures: 0, Errors: 0, Skipped: 0, Time elapsed: 1.389 sec
Running org.geoserver.geofence.web.GeofenceServerAdminPageTest
Tests run: 1, Failures: 0, Errors: 0, Skipped: 0, Time elapsed: 2.781 sec
Running org.geoserver.geofence.web.GeofenceServerPageTest
Tests run: 1, Failures: 0, Errors: 0, Skipped: 0, Time elapsed: 2.261 sec

Results :

Tests run: 17, Failures: 0, Errors: 0, Skipped: 0

[INFO]
[INFO] --- maven-jar-plugin:2.4:jar (default-jar) @ gs-geofence-server ---
[INFO] Building jar: <http://build.geoserver.org/job/geoserver-java11/ws/src/extension/geofence-server/target/gs-geofence-server-2.16-SNAPSHOT.jar>
[INFO]
[INFO] --- maven-jar-plugin:2.4:test-jar (default) @ gs-geofence-server ---
[INFO] Building jar: <http://build.geoserver.org/job/geoserver-java11/ws/src/extension/geofence-server/target/gs-geofence-server-2.16-SNAPSHOT-tests.jar>
[INFO]
[INFO] --- maven-source-plugin:2.2.1:jar-no-fork (attach-sources) @ gs-geofence-server ---
[INFO] Building jar: <http://build.geoserver.org/job/geoserver-java11/ws/src/extension/geofence-server/target/gs-geofence-server-2.16-SNAPSHOT-sources.jar>
[INFO]
[INFO] --- maven-source-plugin:2.2.1:test-jar-no-fork (attach-sources) @ gs-geofence-server ---
[INFO] Building jar: <http://build.geoserver.org/job/geoserver-java11/ws/src/extension/geofence-server/target/gs-geofence-server-2.16-SNAPSHOT-test-sources.jar>
[INFO]
[INFO] --- maven-install-plugin:2.4:install (default-install) @ gs-geofence-server ---
[INFO] Installing <http://build.geoserver.org/job/geoserver-java11/ws/src/extension/geofence-server/target/gs-geofence-server-2.16-SNAPSHOT.jar> to <http://build.geoserver.org/job/geoserver-java11/ws/m2/org/geoserver/extension/gs-geofence-server/2.16-SNAPSHOT/gs-geofence-server-2.16-SNAPSHOT.jar>
[INFO] Installing <http://build.geoserver.org/job/geoserver-java11/ws/src/extension/geofence-server/pom.xml> to <http://build.geoserver.org/job/geoserver-java11/ws/m2/org/geoserver/extension/gs-geofence-server/2.16-SNAPSHOT/gs-geofence-server-2.16-SNAPSHOT.pom>
[INFO] Installing <http://build.geoserver.org/job/geoserver-java11/ws/src/extension/geofence-server/target/gs-geofence-server-2.16-SNAPSHOT-tests.jar> to <http://build.geoserver.org/job/geoserver-java11/ws/m2/org/geoserver/extension/gs-geofence-server/2.16-SNAPSHOT/gs-geofence-server-2.16-SNAPSHOT-tests.jar>
[INFO] Installing <http://build.geoserver.org/job/geoserver-java11/ws/src/extension/geofence-server/target/gs-geofence-server-2.16-SNAPSHOT-sources.jar> to <http://build.geoserver.org/job/geoserver-java11/ws/m2/org/geoserver/extension/gs-geofence-server/2.16-SNAPSHOT/gs-geofence-server-2.16-SNAPSHOT-sources.jar>
[INFO] Installing <http://build.geoserver.org/job/geoserver-java11/ws/src/extension/geofence-server/target/gs-geofence-server-2.16-SNAPSHOT-test-sources.jar> to <http://build.geoserver.org/job/geoserver-java11/ws/m2/org/geoserver/extension/gs-geofence-server/2.16-SNAPSHOT/gs-geofence-server-2.16-SNAPSHOT-test-sources.jar>
[INFO] ------------------------------------------------------------------------
[INFO] Reactor Summary for GeoServer 2.16-SNAPSHOT:
[INFO]
[INFO] GeoServer .......................................... SUCCESS [  6.227 s]
[INFO] Core Platform Module ............................... SUCCESS [ 12.407 s]
[INFO] Open Web Service Module ............................ SUCCESS [  4.889 s]
[INFO] Main Module ........................................ SUCCESS [01:00 min]
[INFO] GeoServer Security Modules ......................... SUCCESS [  0.115 s]
[INFO] GeoServer Security Tests Module .................... SUCCESS [01:40 min]
[INFO] GeoServer JDBC Security Module ..................... SUCCESS [02:17 min]
[INFO] GeoServer LDAP Security Module ..................... SUCCESS [ 25.336 s]
[INFO] Web Coverage Service Module ........................ SUCCESS [  1.210 s]
[INFO] Web Coverage Service 1.0 Module .................... SUCCESS [ 15.878 s]
[INFO] Web Coverage Service 1.1 Module .................... SUCCESS [ 18.882 s]
[INFO] Web Coverage Service 2.0 Module .................... SUCCESS [04:15 min]
[INFO] Web Feature Service Module ......................... SUCCESS [01:26 min]
[INFO] Web Map Service Module ............................. SUCCESS [02:05 min]
[INFO] KML support for GeoServer .......................... SUCCESS [ 21.942 s]
[INFO] gs-rest ............................................ SUCCESS [ 10.004 s]
[INFO] GeoWebCache (GWC) Module ........................... FAILURE [12:03 min]
[INFO] gs-restconfig ...................................... SUCCESS [01:13 min]
[INFO] gs-restconfig-wcs .................................. SUCCESS [ 50.353 s]
[INFO] gs-restconfig-wfs .................................. SUCCESS [ 16.210 s]
[INFO] gs-restconfig-wms .................................. SUCCESS [03:45 min]
[INFO] GeoServer Web Modules .............................. SUCCESS [  0.087 s]
[INFO] Core UI Module ..................................... SUCCESS [ 59.729 s]
[INFO] WMS UI Module ...................................... SUCCESS [03:05 min]
[INFO] GWC UI Module ...................................... SKIPPED
[INFO] WFS UI Module ...................................... SUCCESS [  9.436 s]
[INFO] Demos Module ....................................... SUCCESS [03:55 min]
[INFO] WCS UI Module ...................................... SUCCESS [ 12.253 s]
[INFO] Security UI Modules ................................ SUCCESS [  0.044 s]
[INFO] Security UI Core Module ............................ SUCCESS [01:56 min]
[INFO] Security UI JDBC Module ............................ SUCCESS [01:44 min]
[INFO] Security UI LDAP Module ............................ SUCCESS [ 18.410 s]
[INFO] REST UI Module ..................................... SUCCESS [  8.677 s]
[INFO] GeoServer Extensions ............................... SUCCESS [  0.051 s]
[INFO] Printing Module .................................... SUCCESS [  9.416 s]
[INFO] GeoServer Web Application .......................... SKIPPED
[INFO] Community Space .................................... SUCCESS [  0.029 s]
[INFO] Application Schema Support ......................... SUCCESS [  0.031 s]
[INFO] Application Schema Integration Test ................ SUCCESS [06:30 min]
[INFO] Sample DataAccess Integration Test ................. SUCCESS [ 12.644 s]
[INFO] ArcSDE DataStore Extension ......................... SUCCESS [  7.216 s]
[INFO] H2 DataStore Extension ............................. SUCCESS [  9.213 s]
[INFO] SQL Server DataStore Extension ..................... SUCCESS [  0.132 s]
[INFO] Oracle DataStore Extension ......................... SUCCESS [  0.216 s]
[INFO] MySQL DataStore Extension .......................... SUCCESS [  0.093 s]
[INFO] DB2 DataStore Extension ............................ SUCCESS [  0.048 s]
[INFO] ImageMap Output Format ............................. SUCCESS [  4.620 s]
[INFO] ImageI/O-Ext GDAL Coverage Extension ............... SUCCESS [  1.211 s]
[INFO] JP2K Coverage Extension ............................ SUCCESS [  0.059 s]
[INFO] OGR parent ......................................... SUCCESS [  0.026 s]
[INFO] OGR CORE ........................................... SUCCESS [  0.665 s]
[INFO] OGR WFS ............................................ SUCCESS [  7.149 s]
[INFO] Web Processing Service parent ...................... SUCCESS [  0.027 s]
[INFO] Web Processing Service Module ...................... SUCCESS [05:30 min]
[INFO] OGR WPS ............................................ SUCCESS [  7.759 s]
[INFO] Excel Output Format ................................ SUCCESS [ 11.243 s]
[INFO] Chart external graphics support .................... SUCCESS [  0.061 s]
[INFO] Feature Generalization Extension ................... SUCCESS [  0.515 s]
[INFO] Image Mosaic JDBC Extension ........................ SUCCESS [  0.068 s]
[INFO] OWS request flow controller ........................ SUCCESS [ 11.379 s]
[INFO] Web process status sharing with Hazelcast .......... SUCCESS [  9.696 s]
[INFO] Web Processing Service GUI ......................... SUCCESS [ 23.457 s]
[INFO] GeoServer Layer Querying filter functions .......... SUCCESS [ 12.500 s]
[INFO] Teradata DataStore Extension ....................... SUCCESS [  0.509 s]
[INFO] GeoServer Monitor Extensions ....................... SUCCESS [  0.060 s]
[INFO] Core Monitor Extension ............................. SKIPPED
[INFO] GeoServer Security Extension Modules ............... SUCCESS [  0.048 s]
[INFO] GeoServer CAS Security Module ...................... SUCCESS [  3.148 s]
[INFO] GeoServer Security Extension Web Modules ........... SUCCESS [  0.042 s]
[INFO] GeoServer CAS Security Web Module .................. SUCCESS [  0.484 s]
[INFO] XLST based WFS output format ....................... SUCCESS [ 14.660 s]
[INFO] GeoServer INSPIRE Extensions ....................... SKIPPED
[INFO] GeoServer CSS Styling .............................. SUCCESS [ 14.907 s]
[INFO] Catalog Services for the Web parent ................ SUCCESS [  0.056 s]
[INFO] Catalog Services for the Web interfaces ............ SUCCESS [  6.388 s]
[INFO] Catalog Services for the Web - Simple CatalogStore implementation SUCCESS [  6.060 s]
[INFO] Catalog Services for the Web core module ........... SUCCESS [04:31 min]
[INFO] CSW UI Module ...................................... SUCCESS [  7.726 s]
[INFO] DXF WFS output format and WPS PPIO ................. SUCCESS [  0.026 s]
[INFO] DXF WFS output format .............................. SUCCESS [ 10.554 s]
[INFO] DXF WPS PPIO ....................................... SUCCESS [  8.369 s]
[INFO] GeoServer WCS 2.0 Earth Observation Extensions ..... SUCCESS [  0.025 s]
[INFO] Web Coverage Service 2.0 Earth Observation extensions SUCCESS [ 13.863 s]
[INFO] Web Coverage Service 2.0 Earth Observation GUI extension SUCCESS [03:24 min]
[INFO] GeoServer libjpeg-turbo Module ..................... SUCCESS [  6.522 s]
[INFO] GeoServer Data Importer ............................ SUCCESS [  0.052 s]
[INFO] Importer Core Module ............................... SUCCESS [ 36.558 s]
[INFO] Importer REST Api Module-ng ........................ SUCCESS [ 36.487 s]
[INFO] Importer Berkley DB Persistence Module ............. SUCCESS [04:00 min]
[INFO] Importer Web UI Module ............................. SUCCESS [ 11.454 s]
[INFO] GRIB Coverage Format ............................... SUCCESS [ 12.005 s]
[INFO] NetCDF Coverage format ............................. SUCCESS [ 53.003 s]
[INFO] WCS NetCDF output Module ........................... SUCCESS [01:00 min]
[INFO] Vector Tiles ....................................... SUCCESS [ 12.879 s]
[INFO] Ysld GeoServer Plugin .............................. SKIPPED
[INFO] MongoDB Data Store ................................. SUCCESS [  0.079 s]
[INFO] REST SLD service ................................... SUCCESS [05:04 min]
[INFO] GeoFence security integration ...................... SUCCESS [06:19 min]
[INFO] GeoFence Server .................................... SUCCESS [07:22 min]
[INFO] ------------------------------------------------------------------------
[INFO] BUILD FAILURE
[INFO] ------------------------------------------------------------------------
[INFO] Total time:  49:33 min (Wall Clock)
[INFO] Finished at: 2019-06-03T19:59:32Z
[INFO] ------------------------------------------------------------------------
[ERROR] Failed to execute goal org.apache.maven.plugins:maven-surefire-plugin:2.12.3:test (default-test) on project gs-gwc: There are test failures.
[ERROR]
[ERROR] Please refer to <http://build.geoserver.org/job/geoserver-java11/ws/src/gwc/target/surefire-reports> for the individual test results.
[ERROR] -> [Help 1]
[ERROR]
[ERROR] To see the full stack trace of the errors, re-run Maven with the -e switch.
[ERROR] Re-run Maven using the -X switch to enable full debug logging.
[ERROR]
[ERROR] For more information about the errors and possible solutions, please read the following articles:
[ERROR] [Help 1] http://cwiki.apache.org/confluence/display/MAVEN/MojoFailureException
[ERROR]
[ERROR] After correcting the problems, you can resume the build with the command
[ERROR]   mvn <goals> -rf :gs-gwc
Build step 'Invoke top-level Maven targets' marked build as failure


_______________________________________________
Geoserver-devel mailing list
[hidden email]
https://lists.sourceforge.net/lists/listinfo/geoserver-devel
Reply | Threaded
Open this post in threaded view
|

Re: Build failed in Jenkins: geoserver-java11 #561

GeoServer - Dev mailing list
In reply to this post by geowolf
I was able to reproduce this locally on master - see https://github.com/geoserver/geoserver/pull/3545
Looks like an old workaround for some GWC rest tests is no longer necessary after recent changes.

On Sun, Jun 2, 2019 at 2:29 AM Andrea Aime <[hidden email]> wrote:
Checked, the failure is bizarre:

Tests run: 21, Failures: 2, Errors: 0, Skipped: 0, Time elapsed: 2.041 sec <<< FAILURE!
testPutBadLayerEndpoint(org.geoserver.gwc.RESTIntegrationTest)  Time elapsed: 12 sec  <<< FAILURE!
org.junit.ComparisonFailure: expected:<[T]here is a mismatch b...> but was:<[]here is a mismatch b...>
	at org.junit.Assert.assertEquals(Assert.java:115)
	at org.junit.Assert.assertEquals(Assert.java:144)
	at org.geoserver.gwc.RESTIntegrationTest.testPutBadLayerEndpoint(RESTIntegrationTest.java:213)

I cannot reproduce locally using Java 11. Lack of a single char... maybe a charset related issue?

Cheers
Andrea

On Sun, Jun 2, 2019 at 10:01 AM Jenkins <[hidden email]> wrote:
See <http://build.geoserver.org/job/geoserver-java11/561/display/redirect>

------------------------------------------
[...truncated 1.95 MB...]
        at org.junit.internal.runners.statements.RunAfters.evaluate(RunAfters.java:27)
        at org.junit.rules.ExternalResource$1.evaluate(ExternalResource.java:48)
        at org.junit.rules.RunRules.evaluate(RunRules.java:20)
        at org.junit.runners.ParentRunner.runLeaf(ParentRunner.java:325)
        at org.junit.runners.BlockJUnit4ClassRunner.runChild(BlockJUnit4ClassRunner.java:78)
        at org.junit.runners.BlockJUnit4ClassRunner.runChild(BlockJUnit4ClassRunner.java:57)
        at org.junit.runners.ParentRunner$3.run(ParentRunner.java:290)
        at org.junit.runners.ParentRunner$1.schedule(ParentRunner.java:71)
        at org.junit.runners.ParentRunner.runChildren(ParentRunner.java:288)
        at org.junit.runners.ParentRunner.access$000(ParentRunner.java:58)
        at org.junit.runners.ParentRunner$2.evaluate(ParentRunner.java:268)
        at org.junit.internal.runners.statements.RunBefores.evaluate(RunBefores.java:26)
        at org.junit.internal.runners.statements.RunAfters.evaluate(RunAfters.java:27)
        at org.junit.runners.ParentRunner.run(ParentRunner.java:363)
        at org.apache.maven.surefire.junit4.JUnit4Provider.execute(JUnit4Provider.java:252)
        at org.apache.maven.surefire.junit4.JUnit4Provider.executeTestSet(JUnit4Provider.java:141)
        at org.apache.maven.surefire.junit4.JUnit4Provider.invoke(JUnit4Provider.java:112)
        at org.apache.maven.surefire.util.ReflectionUtils.invokeMethodWithArray(ReflectionUtils.java:189)
Tests run: 2, Failures: 0, Errors: 0, Skipped: 0, Time elapsed: 5.474 sec

Results :

Tests run: 3, Failures: 0, Errors: 0, Skipped: 0

[INFO]
[INFO] --- maven-jar-plugin:2.4:jar (default-jar) @ gs-importer-web ---
[INFO] Building jar: <http://build.geoserver.org/job/geoserver-java11/ws/src/extension/importer/web/target/gs-importer-web-2.16-SNAPSHOT.jar>
[INFO]
[INFO] --- maven-jar-plugin:2.4:test-jar (default) @ gs-importer-web ---
[INFO] Building jar: <http://build.geoserver.org/job/geoserver-java11/ws/src/extension/importer/web/target/gs-importer-web-2.16-SNAPSHOT-tests.jar>
[INFO]
[INFO] --- maven-source-plugin:2.2.1:jar-no-fork (attach-sources) @ gs-importer-web ---
[INFO] Building jar: <http://build.geoserver.org/job/geoserver-java11/ws/src/extension/importer/web/target/gs-importer-web-2.16-SNAPSHOT-sources.jar>
[INFO]
[INFO] --- maven-source-plugin:2.2.1:test-jar-no-fork (attach-sources) @ gs-importer-web ---
[INFO] Building jar: <http://build.geoserver.org/job/geoserver-java11/ws/src/extension/importer/web/target/gs-importer-web-2.16-SNAPSHOT-test-sources.jar>
[INFO]
[INFO] --- maven-install-plugin:2.4:install (default-install) @ gs-importer-web ---
[INFO] Installing <http://build.geoserver.org/job/geoserver-java11/ws/src/extension/importer/web/target/gs-importer-web-2.16-SNAPSHOT.jar> to <http://build.geoserver.org/job/geoserver-java11/ws/m2/org/geoserver/importer/gs-importer-web/2.16-SNAPSHOT/gs-importer-web-2.16-SNAPSHOT.jar>
[INFO] Installing <http://build.geoserver.org/job/geoserver-java11/ws/src/extension/importer/web/pom.xml> to <http://build.geoserver.org/job/geoserver-java11/ws/m2/org/geoserver/importer/gs-importer-web/2.16-SNAPSHOT/gs-importer-web-2.16-SNAPSHOT.pom>
[INFO] Installing <http://build.geoserver.org/job/geoserver-java11/ws/src/extension/importer/web/target/gs-importer-web-2.16-SNAPSHOT-tests.jar> to <http://build.geoserver.org/job/geoserver-java11/ws/m2/org/geoserver/importer/gs-importer-web/2.16-SNAPSHOT/gs-importer-web-2.16-SNAPSHOT-tests.jar>
[INFO] Installing <http://build.geoserver.org/job/geoserver-java11/ws/src/extension/importer/web/target/gs-importer-web-2.16-SNAPSHOT-sources.jar> to <http://build.geoserver.org/job/geoserver-java11/ws/m2/org/geoserver/importer/gs-importer-web/2.16-SNAPSHOT/gs-importer-web-2.16-SNAPSHOT-sources.jar>
[INFO] Installing <http://build.geoserver.org/job/geoserver-java11/ws/src/extension/importer/web/target/gs-importer-web-2.16-SNAPSHOT-test-sources.jar> to <http://build.geoserver.org/job/geoserver-java11/ws/m2/org/geoserver/importer/gs-importer-web/2.16-SNAPSHOT/gs-importer-web-2.16-SNAPSHOT-test-sources.jar>
[INFO]
[INFO] ---------------< org.geoserver.security:gs-web-sec-cas >----------------
[INFO] Building GeoServer CAS Security Web Module 2.16-SNAPSHOT         [94/99]
[INFO] --------------------------------[ jar ]---------------------------------
[INFO]
[INFO] --- maven-clean-plugin:2.5:clean (default-clean) @ gs-web-sec-cas ---
[INFO]
[INFO] --- git-commit-id-plugin:2.1.15:revision (default) @ gs-web-sec-cas ---
[INFO]
[INFO] --- directory-maven-plugin:0.3.1:highest-basedir (directories) @ gs-web-sec-cas ---
[INFO] Highest basedir set to: <http://build.geoserver.org/job/geoserver-java11/ws/src>
[INFO]
[INFO] --- fmt-maven-plugin:2.4.0:format (default) @ gs-web-sec-cas ---
[warn] Test source directory '<http://build.geoserver.org/job/geoserver-java11/ws/src/extension/security/web/web-cas/src/test/java'> does not exist, ignoring.
[debug] Using AOSP style
[INFO] Processed 2 files (0 reformatted).
[INFO]
[INFO] --- maven-resources-plugin:2.6:resources (default-resources) @ gs-web-sec-cas ---
[INFO] Using 'UTF-8' encoding to copy filtered resources.
[INFO] Copying 2 resources
[INFO] skip non existing resourceDirectory <http://build.geoserver.org/job/geoserver-java11/ws/src/extension/security/web/web-cas/src/main/resources>
[INFO]
[INFO] --- maven-compiler-plugin:3.8.0:compile (default-compile) @ gs-web-sec-cas ---
[INFO] Changes detected - recompiling the module!
[INFO] Compiling 2 source files to <http://build.geoserver.org/job/geoserver-java11/ws/src/extension/security/web/web-cas/target/classes>
[INFO]
[INFO] --- maven-resources-plugin:2.6:testResources (default-testResources) @ gs-web-sec-cas ---
[INFO] Using 'UTF-8' encoding to copy filtered resources.
[INFO] skip non existing resourceDirectory <http://build.geoserver.org/job/geoserver-java11/ws/src/extension/security/web/web-cas/src/test/java>
[INFO] skip non existing resourceDirectory <http://build.geoserver.org/job/geoserver-java11/ws/src/extension/security/web/web-cas/src/test/resources>
[INFO]
[INFO] --- maven-compiler-plugin:3.8.0:testCompile (default-testCompile) @ gs-web-sec-cas ---
[INFO] No sources to compile
[INFO]
[INFO] --- maven-surefire-plugin:2.12.3:test (default-test) @ gs-web-sec-cas ---
[INFO] No tests to run.
[INFO]
[INFO] --- maven-jar-plugin:2.4:jar (default-jar) @ gs-web-sec-cas ---
[INFO] Building jar: <http://build.geoserver.org/job/geoserver-java11/ws/src/extension/security/web/web-cas/target/gs-web-sec-cas-2.16-SNAPSHOT.jar>
[INFO]
[INFO] --- maven-jar-plugin:2.4:test-jar (default) @ gs-web-sec-cas ---
[WARNING] JAR will be empty - no content was marked for inclusion!
[INFO] Building jar: <http://build.geoserver.org/job/geoserver-java11/ws/src/extension/security/web/web-cas/target/gs-web-sec-cas-2.16-SNAPSHOT-tests.jar>
[INFO]
[INFO] --- maven-source-plugin:2.2.1:jar-no-fork (attach-sources) @ gs-web-sec-cas ---
[INFO] Building jar: <http://build.geoserver.org/job/geoserver-java11/ws/src/extension/security/web/web-cas/target/gs-web-sec-cas-2.16-SNAPSHOT-sources.jar>
[INFO]
[INFO] --- maven-source-plugin:2.2.1:test-jar-no-fork (attach-sources) @ gs-web-sec-cas ---
[INFO] No sources in project. Archive not created.
[INFO]
[INFO] --- maven-install-plugin:2.4:install (default-install) @ gs-web-sec-cas ---
[INFO] Installing <http://build.geoserver.org/job/geoserver-java11/ws/src/extension/security/web/web-cas/target/gs-web-sec-cas-2.16-SNAPSHOT.jar> to <http://build.geoserver.org/job/geoserver-java11/ws/m2/org/geoserver/security/gs-web-sec-cas/2.16-SNAPSHOT/gs-web-sec-cas-2.16-SNAPSHOT.jar>
[INFO] Installing <http://build.geoserver.org/job/geoserver-java11/ws/src/extension/security/web/web-cas/pom.xml> to <http://build.geoserver.org/job/geoserver-java11/ws/m2/org/geoserver/security/gs-web-sec-cas/2.16-SNAPSHOT/gs-web-sec-cas-2.16-SNAPSHOT.pom>
[INFO] Installing <http://build.geoserver.org/job/geoserver-java11/ws/src/extension/security/web/web-cas/target/gs-web-sec-cas-2.16-SNAPSHOT-tests.jar> to <http://build.geoserver.org/job/geoserver-java11/ws/m2/org/geoserver/security/gs-web-sec-cas/2.16-SNAPSHOT/gs-web-sec-cas-2.16-SNAPSHOT-tests.jar>
[INFO] Installing <http://build.geoserver.org/job/geoserver-java11/ws/src/extension/security/web/web-cas/target/gs-web-sec-cas-2.16-SNAPSHOT-sources.jar> to <http://build.geoserver.org/job/geoserver-java11/ws/m2/org/geoserver/security/gs-web-sec-cas/2.16-SNAPSHOT/gs-web-sec-cas-2.16-SNAPSHOT-sources.jar>
Tests run: 12, Failures: 0, Errors: 0, Skipped: 0, Time elapsed: 206.807 sec
Running org.geoserver.importer.bdb.SerialVersionSafeSerialBindingTest
Tests run: 1, Failures: 0, Errors: 0, Skipped: 0, Time elapsed: 0.335 sec
Running org.geoserver.importer.bdb.XStreamInfoSerialBindingTest
Tests run: 2, Failures: 0, Errors: 0, Skipped: 0, Time elapsed: 2.026 sec

Results :

Tests run: 15, Failures: 0, Errors: 0, Skipped: 0

[INFO]
[INFO] --- maven-jar-plugin:2.4:jar (default-jar) @ gs-importer-bdb ---
[INFO] Building jar: <http://build.geoserver.org/job/geoserver-java11/ws/src/extension/importer/bdb/target/gs-importer-bdb-2.16-SNAPSHOT.jar>
[INFO]
[INFO] --- maven-jar-plugin:2.4:test-jar (default) @ gs-importer-bdb ---
[INFO] Building jar: <http://build.geoserver.org/job/geoserver-java11/ws/src/extension/importer/bdb/target/gs-importer-bdb-2.16-SNAPSHOT-tests.jar>
[INFO]
[INFO] --- maven-source-plugin:2.2.1:jar-no-fork (attach-sources) @ gs-importer-bdb ---
[INFO] Building jar: <http://build.geoserver.org/job/geoserver-java11/ws/src/extension/importer/bdb/target/gs-importer-bdb-2.16-SNAPSHOT-sources.jar>
[INFO]
[INFO] --- maven-source-plugin:2.2.1:test-jar-no-fork (attach-sources) @ gs-importer-bdb ---
[INFO] Building jar: <http://build.geoserver.org/job/geoserver-java11/ws/src/extension/importer/bdb/target/gs-importer-bdb-2.16-SNAPSHOT-test-sources.jar>
[INFO]
[INFO] --- maven-install-plugin:2.4:install (default-install) @ gs-importer-bdb ---
[INFO] Installing <http://build.geoserver.org/job/geoserver-java11/ws/src/extension/importer/bdb/target/gs-importer-bdb-2.16-SNAPSHOT.jar> to <http://build.geoserver.org/job/geoserver-java11/ws/m2/org/geoserver/importer/gs-importer-bdb/2.16-SNAPSHOT/gs-importer-bdb-2.16-SNAPSHOT.jar>
[INFO] Installing <http://build.geoserver.org/job/geoserver-java11/ws/src/extension/importer/bdb/pom.xml> to <http://build.geoserver.org/job/geoserver-java11/ws/m2/org/geoserver/importer/gs-importer-bdb/2.16-SNAPSHOT/gs-importer-bdb-2.16-SNAPSHOT.pom>
[INFO] Installing <http://build.geoserver.org/job/geoserver-java11/ws/src/extension/importer/bdb/target/gs-importer-bdb-2.16-SNAPSHOT-tests.jar> to <http://build.geoserver.org/job/geoserver-java11/ws/m2/org/geoserver/importer/gs-importer-bdb/2.16-SNAPSHOT/gs-importer-bdb-2.16-SNAPSHOT-tests.jar>
[INFO] Installing <http://build.geoserver.org/job/geoserver-java11/ws/src/extension/importer/bdb/target/gs-importer-bdb-2.16-SNAPSHOT-sources.jar> to <http://build.geoserver.org/job/geoserver-java11/ws/m2/org/geoserver/importer/gs-importer-bdb/2.16-SNAPSHOT/gs-importer-bdb-2.16-SNAPSHOT-sources.jar>
[INFO] Installing <http://build.geoserver.org/job/geoserver-java11/ws/src/extension/importer/bdb/target/gs-importer-bdb-2.16-SNAPSHOT-test-sources.jar> to <http://build.geoserver.org/job/geoserver-java11/ws/m2/org/geoserver/importer/gs-importer-bdb/2.16-SNAPSHOT/gs-importer-bdb-2.16-SNAPSHOT-test-sources.jar>
[INFO] ------------------------------------------------------------------------
[INFO] Reactor Summary for GeoServer 2.16-SNAPSHOT:
[INFO]
[INFO] GeoServer .......................................... SUCCESS [  5.827 s]
[INFO] Core Platform Module ............................... SUCCESS [ 14.717 s]
[INFO] Open Web Service Module ............................ SUCCESS [ 11.731 s]
[INFO] Main Module ........................................ SUCCESS [01:02 min]
[INFO] GeoServer Security Modules ......................... SUCCESS [  0.049 s]
[INFO] GeoServer Security Tests Module .................... SUCCESS [01:31 min]
[INFO] GeoServer JDBC Security Module ..................... SUCCESS [ 39.307 s]
[INFO] GeoServer LDAP Security Module ..................... SUCCESS [ 20.243 s]
[INFO] Web Coverage Service Module ........................ SUCCESS [  0.553 s]
[INFO] Web Coverage Service 1.0 Module .................... SUCCESS [ 11.953 s]
[INFO] Web Coverage Service 1.1 Module .................... SUCCESS [ 14.737 s]
[INFO] Web Coverage Service 2.0 Module .................... SUCCESS [03:21 min]
[INFO] Web Feature Service Module ......................... SUCCESS [01:07 min]
[INFO] Web Map Service Module ............................. SUCCESS [01:48 min]
[INFO] KML support for GeoServer .......................... SUCCESS [ 18.526 s]
[INFO] gs-rest ............................................ SUCCESS [  7.572 s]
[INFO] GeoWebCache (GWC) Module ........................... FAILURE [ 47.572 s]
[INFO] gs-restconfig ...................................... SUCCESS [ 57.872 s]
[INFO] gs-restconfig-wcs .................................. SUCCESS [ 11.686 s]
[INFO] gs-restconfig-wfs .................................. SUCCESS [ 14.098 s]
[INFO] gs-restconfig-wms .................................. SUCCESS [  9.346 s]
[INFO] GeoServer Web Modules .............................. SUCCESS [  0.077 s]
[INFO] Core UI Module ..................................... SUCCESS [ 52.572 s]
[INFO] WMS UI Module ...................................... SUCCESS [ 21.774 s]
[INFO] GWC UI Module ...................................... SKIPPED
[INFO] WFS UI Module ...................................... SUCCESS [  6.889 s]
[INFO] Demos Module ....................................... SUCCESS [ 11.448 s]
[INFO] WCS UI Module ...................................... SUCCESS [  8.370 s]
[INFO] Security UI Modules ................................ SUCCESS [  0.034 s]
[INFO] Security UI Core Module ............................ SUCCESS [01:01 min]
[INFO] Security UI JDBC Module ............................ SUCCESS [04:45 min]
[INFO] Security UI LDAP Module ............................ SUCCESS [ 14.683 s]
[INFO] REST UI Module ..................................... SUCCESS [  7.213 s]
[INFO] GeoServer Extensions ............................... SUCCESS [  0.034 s]
[INFO] Printing Module .................................... SUCCESS [ 24.605 s]
[INFO] GeoServer Web Application .......................... SKIPPED
[INFO] Community Space .................................... SUCCESS [  0.023 s]
[INFO] Application Schema Support ......................... SUCCESS [  0.024 s]
[INFO] Application Schema Integration Test ................ SUCCESS [01:45 min]
[INFO] Sample DataAccess Integration Test ................. SUCCESS [  7.575 s]
[INFO] ArcSDE DataStore Extension ......................... SUCCESS [  8.092 s]
[INFO] H2 DataStore Extension ............................. SUCCESS [  7.477 s]
[INFO] SQL Server DataStore Extension ..................... SUCCESS [  1.415 s]
[INFO] Oracle DataStore Extension ......................... SUCCESS [  0.570 s]
[INFO] MySQL DataStore Extension .......................... SUCCESS [  0.893 s]
[INFO] DB2 DataStore Extension ............................ SUCCESS [  0.244 s]
[INFO] ImageMap Output Format ............................. SUCCESS [  4.366 s]
[INFO] ImageI/O-Ext GDAL Coverage Extension ............... SUCCESS [  2.528 s]
[INFO] JP2K Coverage Extension ............................ SUCCESS [  0.327 s]
[INFO] OGR parent ......................................... SUCCESS [  0.022 s]
[INFO] OGR CORE ........................................... SUCCESS [  0.378 s]
[INFO] OGR WFS ............................................ SUCCESS [  4.890 s]
[INFO] Web Processing Service parent ...................... SUCCESS [  0.021 s]
[INFO] Web Processing Service Module ...................... SUCCESS [01:04 min]
[INFO] OGR WPS ............................................ SUCCESS [  5.691 s]
[INFO] Excel Output Format ................................ SUCCESS [ 11.155 s]
[INFO] Chart external graphics support .................... SUCCESS [  2.691 s]
[INFO] Feature Generalization Extension ................... SUCCESS [  0.570 s]
[INFO] Image Mosaic JDBC Extension ........................ SUCCESS [  2.597 s]
[INFO] OWS request flow controller ........................ SUCCESS [ 10.828 s]
[INFO] Web process status sharing with Hazelcast .......... SUCCESS [ 15.892 s]
[INFO] Web Processing Service GUI ......................... SUCCESS [ 17.031 s]
[INFO] GeoServer Layer Querying filter functions .......... SUCCESS [  9.369 s]
[INFO] Teradata DataStore Extension ....................... SUCCESS [  0.651 s]
[INFO] GeoServer Monitor Extensions ....................... SUCCESS [  0.030 s]
[INFO] Core Monitor Extension ............................. SKIPPED
[INFO] GeoServer Security Extension Modules ............... SUCCESS [  0.030 s]
[INFO] GeoServer CAS Security Module ...................... SUCCESS [  6.170 s]
[INFO] GeoServer Security Extension Web Modules ........... SUCCESS [  0.029 s]
[INFO] GeoServer CAS Security Web Module .................. SUCCESS [  0.396 s]
[INFO] XLST based WFS output format ....................... SUCCESS [ 12.391 s]
[INFO] GeoServer INSPIRE Extensions ....................... SKIPPED
[INFO] GeoServer CSS Styling .............................. SUCCESS [ 14.987 s]
[INFO] Catalog Services for the Web parent ................ SUCCESS [  0.032 s]
[INFO] Catalog Services for the Web interfaces ............ SUCCESS [  6.342 s]
[INFO] Catalog Services for the Web - Simple CatalogStore implementation SUCCESS [  4.979 s]
[INFO] Catalog Services for the Web core module ........... SUCCESS [05:41 min]
[INFO] CSW UI Module ...................................... SUCCESS [  5.262 s]
[INFO] DXF WFS output format and WPS PPIO ................. SUCCESS [  0.023 s]
[INFO] DXF WFS output format .............................. SUCCESS [  7.495 s]
[INFO] DXF WPS PPIO ....................................... SUCCESS [  6.361 s]
[INFO] GeoServer WCS 2.0 Earth Observation Extensions ..... SUCCESS [  0.026 s]
[INFO] Web Coverage Service 2.0 Earth Observation extensions SUCCESS [ 10.742 s]
[INFO] Web Coverage Service 2.0 Earth Observation GUI extension SUCCESS [05:04 min]
[INFO] GeoServer libjpeg-turbo Module ..................... SUCCESS [  5.522 s]
[INFO] GeoServer Data Importer ............................ SUCCESS [  3.668 s]
[INFO] Importer Core Module ............................... SUCCESS [ 29.869 s]
[INFO] Importer REST Api Module-ng ........................ SUCCESS [ 31.111 s]
[INFO] Importer Berkley DB Persistence Module ............. SUCCESS [03:32 min]
[INFO] Importer Web UI Module ............................. SUCCESS [ 10.002 s]
[INFO] GRIB Coverage Format ............................... SUCCESS [ 18.258 s]
[INFO] NetCDF Coverage format ............................. SUCCESS [ 19.457 s]
[INFO] WCS NetCDF output Module ........................... SUCCESS [ 23.873 s]
[INFO] Vector Tiles ....................................... SUCCESS [ 15.649 s]
[INFO] Ysld GeoServer Plugin .............................. SKIPPED
[INFO] MongoDB Data Store ................................. SUCCESS [  2.452 s]
[INFO] REST SLD service ................................... SUCCESS [05:29 min]
[INFO] GeoFence security integration ...................... SUCCESS [04:39 min]
[INFO] GeoFence Server .................................... SUCCESS [05:08 min]
[INFO] ------------------------------------------------------------------------
[INFO] BUILD FAILURE
[INFO] ------------------------------------------------------------------------
[INFO] Total time:  32:14 min (Wall Clock)
[INFO] Finished at: 2019-06-02T08:01:07Z
[INFO] ------------------------------------------------------------------------
[ERROR] Failed to execute goal org.apache.maven.plugins:maven-surefire-plugin:2.12.3:test (default-test) on project gs-gwc: There are test failures.
[ERROR]
[ERROR] Please refer to <http://build.geoserver.org/job/geoserver-java11/ws/src/gwc/target/surefire-reports> for the individual test results.
[ERROR] -> [Help 1]
[ERROR]
[ERROR] To see the full stack trace of the errors, re-run Maven with the -e switch.
[ERROR] Re-run Maven using the -X switch to enable full debug logging.
[ERROR]
[ERROR] For more information about the errors and possible solutions, please read the following articles:
[ERROR] [Help 1] http://cwiki.apache.org/confluence/display/MAVEN/MojoFailureException
[ERROR]
[ERROR] After correcting the problems, you can resume the build with the command
[ERROR]   mvn <goals> -rf :gs-gwc
Build step 'Invoke top-level Maven targets' marked build as failure


--

Regards, Andrea Aime == GeoServer Professional Services from the experts! Visit http://goo.gl/it488V for more information. == Ing. Andrea Aime @geowolf Technical Lead GeoSolutions S.A.S. Via di Montramito 3/A 55054 Massarosa (LU) phone: +39 0584 962313 fax: +39 0584 1660272 mob: +39 339 8844549 http://www.geo-solutions.it http://twitter.com/geosolutions_it ------------------------------------------------------- Con riferimento alla normativa sul trattamento dei dati personali (Reg. UE 2016/679 - Regolamento generale sulla protezione dei dati “GDPR”), si precisa che ogni circostanza inerente alla presente email (il suo contenuto, gli eventuali allegati, etc.) è un dato la cui conoscenza è riservata al/i solo/i destinatario/i indicati dallo scrivente. Se il messaggio Le è giunto per errore, è tenuta/o a cancellarlo, ogni altra operazione è illecita. Le sarei comunque grato se potesse darmene notizia. This email is intended only for the person or entity to which it is addressed and may contain information that is privileged, confidential or otherwise protected from disclosure. We remind that - as provided by European Regulation 2016/679 “GDPR” - copying, dissemination or use of this e-mail or the information herein by anyone other than the intended recipient is prohibited. If you have received this email by mistake, please notify us immediately by telephone or e-mail.



_______________________________________________
Geoserver-devel mailing list
[hidden email]
https://lists.sourceforge.net/lists/listinfo/geoserver-devel
Reply | Threaded
Open this post in threaded view
|

Jenkins build is back to normal : geoserver-java11 #563

Jenkins-2
In reply to this post by Jenkins-2