Build failed in Jenkins: geoserver-java11 #330

classic Classic list List threaded Threaded
2 messages Options
Reply | Threaded
Open this post in threaded view
|

Build failed in Jenkins: geoserver-java11 #330

monitor
See <https://build.geoserver.org/job/geoserver-java11/330/display/redirect?page=changes>

Changes:

[Andrea Aime] [GEOS-8970] WMS GetCapabilities throws ConcurrentModificationException

------------------------------------------
[...truncated 1.43 MB...]
        at org.junit.internal.runners.statements.RunAfters.evaluate(RunAfters.java:27)
        at org.junit.runners.ParentRunner.run(ParentRunner.java:363)
        at org.apache.maven.surefire.junit4.JUnit4Provider.execute(JUnit4Provider.java:252)
        at org.apache.maven.surefire.junit4.JUnit4Provider.executeTestSet(JUnit4Provider.java:141)
        at org.apache.maven.surefire.junit4.JUnit4Provider.invoke(JUnit4Provider.java:112)
        at java.base/jdk.internal.reflect.NativeMethodAccessorImpl.invoke0(Native Method)
        at java.base/jdk.internal.reflect.NativeMethodAccessorImpl.invoke(NativeMethodAccessorImpl.java:62)
        at java.base/jdk.internal.reflect.DelegatingMethodAccessorImpl.invoke(DelegatingMethodAccessorImpl.java:43)
        at java.base/java.lang.reflect.Method.invoke(Method.java:566)
        at org.apache.maven.surefire.util.ReflectionUtils.invokeMethodWithArray(ReflectionUtils.java:189)
        at org.apache.maven.surefire.booter.ProviderFactory$ProviderProxy.invoke(ProviderFactory.java:165)
        at org.apache.maven.surefire.booter.ProviderFactory.invokeProvider(ProviderFactory.java:85)
        at org.apache.maven.surefire.booter.ForkedBooter.runSuitesInProcess(ForkedBooter.java:115)
        at org.apache.maven.surefire.booter.ForkedBooter.main(ForkedBooter.java:75)

Feb 10, 2019 8:30:33 PM org.geoserver.importer.Importer init
SEVERE: Failed to init the context
java.lang.NullPointerException
        at org.geoserver.importer.SpatialFile.prepare(SpatialFile.java:103)
        at org.geoserver.importer.Importer.addTasks(Importer.java:472)
        at org.geoserver.importer.Importer.init(Importer.java:440)
        at org.geoserver.importer.rest.ImportController.createImport(ImportController.java:221)
        at org.geoserver.importer.rest.ImportController.postImports(ImportController.java:72)
        at jdk.internal.reflect.GeneratedMethodAccessor293.invoke(Unknown Source)
        at java.base/jdk.internal.reflect.DelegatingMethodAccessorImpl.invoke(DelegatingMethodAccessorImpl.java:43)
        at java.base/java.lang.reflect.Method.invoke(Method.java:566)
        at org.springframework.web.method.support.InvocableHandlerMethod.doInvoke(InvocableHandlerMethod.java:207)
        at org.springframework.web.method.support.InvocableHandlerMethod.invokeForRequest(InvocableHandlerMethod.java:137)
        at org.springframework.web.servlet.mvc.method.annotation.ServletInvocableHandlerMethod.invokeAndHandle(ServletInvocableHandlerMethod.java:102)
        at org.springframework.web.servlet.mvc.method.annotation.RequestMappingHandlerAdapter.invokeHandlerMethod(RequestMappingHandlerAdapter.java:895)
        at org.springframework.web.servlet.mvc.method.annotation.RequestMappingHandlerAdapter.handleInternal(RequestMappingHandlerAdapter.java:800)
        at org.springframework.web.servlet.mvc.method.AbstractHandlerMethodAdapter.handle(AbstractHandlerMethodAdapter.java:87)
        at org.springframework.web.servlet.DispatcherServlet.doDispatch(DispatcherServlet.java:1038)
        at org.springframework.web.servlet.DispatcherServlet.doService(DispatcherServlet.java:942)
        at org.springframework.web.servlet.FrameworkServlet.processRequest(FrameworkServlet.java:998)
        at org.springframework.web.servlet.FrameworkServlet.doPost(FrameworkServlet.java:901)
        at javax.servlet.http.HttpServlet.service(HttpServlet.java:688)
        at org.springframework.web.servlet.FrameworkServlet.service(FrameworkServlet.java:875)
        at javax.servlet.http.HttpServlet.service(HttpServlet.java:770)
        at org.geoserver.test.GeoServerSystemTestSupport$2.service(GeoServerSystemTestSupport.java:1636)
        at javax.servlet.http.HttpServlet.service(HttpServlet.java:770)
        at org.springframework.mock.web.MockFilterChain$ServletFilterProxy.doFilter(MockFilterChain.java:166)
        at org.springframework.mock.web.MockFilterChain.doFilter(MockFilterChain.java:133)
        at org.geoserver.test.GeoServerSystemTestSupport.dispatch(GeoServerSystemTestSupport.java:1665)
        at org.geoserver.test.GeoServerSystemTestSupport.dispatch(GeoServerSystemTestSupport.java:1576)
        at org.geoserver.test.GeoServerSystemTestSupport.dispatch(GeoServerSystemTestSupport.java:1564)
        at org.geoserver.test.GeoServerSystemTestSupport.postAsServletResponse(GeoServerSystemTestSupport.java:1212)
        at org.geoserver.importer.rest.ImporterIntegrationTest.testDirectWrongDir(ImporterIntegrationTest.java:206)
        at java.base/jdk.internal.reflect.NativeMethodAccessorImpl.invoke0(Native Method)
        at java.base/jdk.internal.reflect.NativeMethodAccessorImpl.invoke(NativeMethodAccessorImpl.java:62)
        at java.base/jdk.internal.reflect.DelegatingMethodAccessorImpl.invoke(DelegatingMethodAccessorImpl.java:43)
        at java.base/java.lang.reflect.Method.invoke(Method.java:566)
        at org.junit.runners.model.FrameworkMethod$1.runReflectiveCall(FrameworkMethod.java:50)
        at org.junit.internal.runners.model.ReflectiveCallable.run(ReflectiveCallable.java:12)
        at org.junit.runners.model.FrameworkMethod.invokeExplosively(FrameworkMethod.java:47)
        at org.junit.internal.runners.statements.InvokeMethod.evaluate(InvokeMethod.java:17)
        at org.junit.internal.runners.statements.RunBefores.evaluate(RunBefores.java:26)
        at org.junit.internal.runners.statements.RunAfters.evaluate(RunAfters.java:27)
        at org.junit.rules.RunRules.evaluate(RunRules.java:20)
        at org.junit.runners.ParentRunner.runLeaf(ParentRunner.java:325)
        at org.junit.runners.BlockJUnit4ClassRunner.runChild(BlockJUnit4ClassRunner.java:78)
        at org.junit.runners.BlockJUnit4ClassRunner.runChild(BlockJUnit4ClassRunner.java:57)
        at org.junit.runners.ParentRunner$3.run(ParentRunner.java:290)
        at org.junit.runners.ParentRunner$1.schedule(ParentRunner.java:71)
        at org.junit.runners.ParentRunner.runChildren(ParentRunner.java:288)
        at org.junit.runners.ParentRunner.access$000(ParentRunner.java:58)
        at org.junit.runners.ParentRunner$2.evaluate(ParentRunner.java:268)
        at org.junit.internal.runners.statements.RunBefores.evaluate(RunBefores.java:26)
        at org.junit.internal.runners.statements.RunAfters.evaluate(RunAfters.java:27)
        at org.junit.runners.ParentRunner.run(ParentRunner.java:363)
        at org.apache.maven.surefire.junit4.JUnit4Provider.execute(JUnit4Provider.java:252)
        at org.apache.maven.surefire.junit4.JUnit4Provider.executeTestSet(JUnit4Provider.java:141)
        at org.apache.maven.surefire.junit4.JUnit4Provider.invoke(JUnit4Provider.java:112)
        at java.base/jdk.internal.reflect.NativeMethodAccessorImpl.invoke0(Native Method)
        at java.base/jdk.internal.reflect.NativeMethodAccessorImpl.invoke(NativeMethodAccessorImpl.java:62)
        at java.base/jdk.internal.reflect.DelegatingMethodAccessorImpl.invoke(DelegatingMethodAccessorImpl.java:43)
        at java.base/java.lang.reflect.Method.invoke(Method.java:566)
        at org.apache.maven.surefire.util.ReflectionUtils.invokeMethodWithArray(ReflectionUtils.java:189)
        at org.apache.maven.surefire.booter.ProviderFactory$ProviderProxy.invoke(ProviderFactory.java:165)
        at org.apache.maven.surefire.booter.ProviderFactory.invokeProvider(ProviderFactory.java:85)
        at org.apache.maven.surefire.booter.ForkedBooter.runSuitesInProcess(ForkedBooter.java:115)
        at org.apache.maven.surefire.booter.ForkedBooter.main(ForkedBooter.java:75)

Tests run: 17, Failures: 0, Errors: 0, Skipped: 0, Time elapsed: 17.654 sec
Running org.geoserver.importer.rest.PostScriptTransformTest
Tests run: 1, Failures: 0, Errors: 0, Skipped: 0, Time elapsed: 0.011 sec
Running org.geoserver.importer.rest.converters.ImportJSONIOTest
Tests run: 4, Failures: 0, Errors: 0, Skipped: 0, Time elapsed: 0.734 sec

Results :

Tests run: 76, Failures: 0, Errors: 0, Skipped: 0

[INFO]
[INFO] --- maven-jar-plugin:2.4:jar (default-jar) @ gs-importer-rest ---
[INFO] Building jar: <https://build.geoserver.org/job/geoserver-java11/ws/src/extension/importer/rest/target/gs-importer-rest-2.16-SNAPSHOT.jar>
[INFO]
[INFO] --- maven-jar-plugin:2.4:test-jar (default) @ gs-importer-rest ---
[INFO] Building jar: <https://build.geoserver.org/job/geoserver-java11/ws/src/extension/importer/rest/target/gs-importer-rest-2.16-SNAPSHOT-tests.jar>
[INFO]
[INFO] --- maven-source-plugin:2.2.1:jar-no-fork (attach-sources) @ gs-importer-rest ---
[INFO] Building jar: <https://build.geoserver.org/job/geoserver-java11/ws/src/extension/importer/rest/target/gs-importer-rest-2.16-SNAPSHOT-sources.jar>
[INFO]
[INFO] --- maven-source-plugin:2.2.1:test-jar-no-fork (attach-sources) @ gs-importer-rest ---
[INFO] Building jar: <https://build.geoserver.org/job/geoserver-java11/ws/src/extension/importer/rest/target/gs-importer-rest-2.16-SNAPSHOT-test-sources.jar>
[INFO]
[INFO] --- fmt-maven-plugin:2.4.0:check (default) @ gs-importer-rest ---
[debug] Using AOSP style
[INFO] Processed 31 files (0 non-complying).
[INFO]
[INFO] >>> maven-pmd-plugin:3.11.0:check (default) > :pmd @ gs-importer-rest >>>
[INFO]
[INFO] --- maven-pmd-plugin:3.11.0:pmd (pmd) @ gs-importer-rest ---
[WARNING] File encoding has not been set, using platform encoding UTF-8, i.e. build is platform dependent!
[INFO]
[INFO] <<< maven-pmd-plugin:3.11.0:check (default) < :pmd @ gs-importer-rest <<<
[INFO]
[INFO] --- maven-pmd-plugin:3.11.0:check (default) @ gs-importer-rest ---
[INFO]
[INFO]
[INFO] --- maven-install-plugin:2.4:install (default-install) @ gs-importer-rest ---
[INFO] Installing <https://build.geoserver.org/job/geoserver-java11/ws/src/extension/importer/rest/target/gs-importer-rest-2.16-SNAPSHOT.jar> to <https://build.geoserver.org/job/geoserver-java11/ws/m2/org/geoserver/importer/gs-importer-rest/2.16-SNAPSHOT/gs-importer-rest-2.16-SNAPSHOT.jar>
[INFO] Installing <https://build.geoserver.org/job/geoserver-java11/ws/src/extension/importer/rest/pom.xml> to <https://build.geoserver.org/job/geoserver-java11/ws/m2/org/geoserver/importer/gs-importer-rest/2.16-SNAPSHOT/gs-importer-rest-2.16-SNAPSHOT.pom>
[INFO] Installing <https://build.geoserver.org/job/geoserver-java11/ws/src/extension/importer/rest/target/gs-importer-rest-2.16-SNAPSHOT-tests.jar> to <https://build.geoserver.org/job/geoserver-java11/ws/m2/org/geoserver/importer/gs-importer-rest/2.16-SNAPSHOT/gs-importer-rest-2.16-SNAPSHOT-tests.jar>
[INFO] Installing <https://build.geoserver.org/job/geoserver-java11/ws/src/extension/importer/rest/target/gs-importer-rest-2.16-SNAPSHOT-sources.jar> to <https://build.geoserver.org/job/geoserver-java11/ws/m2/org/geoserver/importer/gs-importer-rest/2.16-SNAPSHOT/gs-importer-rest-2.16-SNAPSHOT-sources.jar>
[INFO] Installing <https://build.geoserver.org/job/geoserver-java11/ws/src/extension/importer/rest/target/gs-importer-rest-2.16-SNAPSHOT-test-sources.jar> to <https://build.geoserver.org/job/geoserver-java11/ws/m2/org/geoserver/importer/gs-importer-rest/2.16-SNAPSHOT/gs-importer-rest-2.16-SNAPSHOT-test-sources.jar>
[INFO] ------------------------------------------------------------------------
[INFO] Reactor Summary:
[INFO]
[INFO] GeoServer .......................................... SUCCESS [ 10.652 s]
[INFO] Core Platform Module ............................... SUCCESS [ 30.145 s]
[INFO] Open Web Service Module ............................ SUCCESS [ 28.744 s]
[INFO] Main Module ........................................ SUCCESS [02:29 min]
[INFO] GeoServer Security Modules ......................... SUCCESS [  0.222 s]
[INFO] GeoServer Security Tests Module .................... SUCCESS [02:32 min]
[INFO] GeoServer JDBC Security Module ..................... SUCCESS [01:08 min]
[INFO] GeoServer LDAP Security Module ..................... SUCCESS [ 10.486 s]
[INFO] Web Coverage Service Module ........................ SUCCESS [  7.034 s]
[INFO] Web Coverage Service 1.0 Module .................... SUCCESS [ 33.141 s]
[INFO] Web Coverage Service 1.1 Module .................... SUCCESS [ 33.900 s]
[INFO] Web Coverage Service 2.0 Module .................... SUCCESS [05:52 min]
[INFO] Web Feature Service Module ......................... SUCCESS [02:53 min]
[INFO] Web Map Service Module ............................. SUCCESS [03:58 min]
[INFO] KML support for GeoServer .......................... SUCCESS [ 57.746 s]
[INFO] gs-rest ............................................ SUCCESS [ 22.718 s]
[INFO] GeoWebCache (GWC) Module ........................... SUCCESS [02:45 min]
[INFO] gs-restconfig ...................................... SUCCESS [02:02 min]
[INFO] gs-restconfig-wcs .................................. SUCCESS [ 35.099 s]
[INFO] gs-restconfig-wfs .................................. SUCCESS [ 39.458 s]
[INFO] gs-restconfig-wms .................................. SUCCESS [ 21.038 s]
[INFO] GeoServer Web Modules .............................. SUCCESS [  0.136 s]
[INFO] Core UI Module ..................................... SUCCESS [02:06 min]
[INFO] WMS UI Module ...................................... SUCCESS [ 52.685 s]
[INFO] GWC UI Module ...................................... SUCCESS [01:15 min]
[INFO] WFS UI Module ...................................... SUCCESS [ 21.122 s]
[INFO] Demos Module ....................................... SUCCESS [ 27.063 s]
[INFO] WCS UI Module ...................................... SUCCESS [ 15.136 s]
[INFO] Security UI Modules ................................ SUCCESS [  0.178 s]
[INFO] Security UI Core Module ............................ SUCCESS [02:24 min]
[INFO] Security UI JDBC Module ............................ SUCCESS [02:00 min]
[INFO] Security UI LDAP Module ............................ SUCCESS [ 15.050 s]
[INFO] REST UI Module ..................................... SUCCESS [ 21.715 s]
[INFO] GeoServer Extensions ............................... SUCCESS [  0.111 s]
[INFO] Printing Module .................................... SUCCESS [ 16.139 s]
[INFO] GeoServer Web Application .......................... SUCCESS [ 10.092 s]
[INFO] Community Space .................................... SUCCESS [  0.081 s]
[INFO] Application Schema Support ......................... SUCCESS [  0.080 s]
[INFO] Application Schema Integration Test ................ SUCCESS [03:39 min]
[INFO] Sample DataAccess Integration Test ................. SUCCESS [ 19.031 s]
[INFO] ArcSDE DataStore Extension ......................... SUCCESS [ 15.949 s]
[INFO] H2 DataStore Extension ............................. SUCCESS [ 23.563 s]
[INFO] SQL Server DataStore Extension ..................... SUCCESS [  1.915 s]
[INFO] Oracle DataStore Extension ......................... SUCCESS [  1.873 s]
[INFO] MySQL DataStore Extension .......................... SUCCESS [  1.293 s]
[INFO] DB2 DataStore Extension ............................ SUCCESS [  1.551 s]
[INFO] ImageMap Output Format ............................. SUCCESS [ 13.558 s]
[INFO] ImageI/O-Ext GDAL Coverage Extension ............... SUCCESS [  8.196 s]
[INFO] JP2K Coverage Extension ............................ SUCCESS [  1.584 s]
[INFO] OGR parent ......................................... SUCCESS [  0.060 s]
[INFO] OGR CORE ........................................... SUCCESS [  5.262 s]
[INFO] OGR WFS ............................................ SUCCESS [ 14.164 s]
[INFO] Web Processing Service parent ...................... SUCCESS [  0.101 s]
[INFO] Web Processing Service Module ...................... FAILURE [01:50 min]
[INFO] OGR WPS ............................................ SKIPPED
[INFO] Excel Output Format ................................ SUCCESS [ 19.815 s]
[INFO] Chart external graphics support .................... SUCCESS [  1.916 s]
[INFO] Feature Generalization Extension ................... SUCCESS [  4.641 s]
[INFO] Image Mosaic JDBC Extension ........................ SUCCESS [  1.726 s]
[INFO] OWS request flow controller ........................ SUCCESS [ 22.010 s]
[INFO] Web process status sharing with Hazelcast .......... SKIPPED
[INFO] Web Processing Service GUI ......................... SKIPPED
[INFO] GeoServer Layer Querying filter functions .......... SUCCESS [ 21.564 s]
[INFO] Teradata DataStore Extension ....................... SUCCESS [  2.631 s]
[INFO] GeoServer Monitor Extensions ....................... SUCCESS [  0.169 s]
[INFO] Core Monitor Extension ............................. SUCCESS [ 45.340 s]
[INFO] GeoServer Security Extension Modules ............... SUCCESS [  0.178 s]
[INFO] GeoServer CAS Security Module ...................... SUCCESS [  9.068 s]
[INFO] GeoServer Security Extension Web Modules ........... SUCCESS [  0.095 s]
[INFO] GeoServer CAS Security Web Module .................. SUCCESS [  1.939 s]
[INFO] XLST based WFS output format ....................... SUCCESS [ 35.291 s]
[INFO] GeoServer INSPIRE Extensions ....................... SUCCESS [01:03 min]
[INFO] GeoServer CSS Styling .............................. SUCCESS [ 16.917 s]
[INFO] Catalog Services for the Web parent ................ SUCCESS [  0.191 s]
[INFO] Catalog Services for the Web interfaces ............ SUCCESS [ 15.334 s]
[INFO] Catalog Services for the Web - Simple CatalogStore implementation SUCCESS [ 17.734 s]
[INFO] Catalog Services for the Web core module ........... SUCCESS [ 44.126 s]
[INFO] CSW UI Module ...................................... SUCCESS [ 11.142 s]
[INFO] DXF WFS output format and WPS PPIO ................. SUCCESS [  0.079 s]
[INFO] DXF WFS output format .............................. SUCCESS [ 19.332 s]
[INFO] DXF WPS PPIO ....................................... SKIPPED
[INFO] GeoServer WCS 2.0 Earth Observation Extensions ..... SUCCESS [  0.077 s]
[INFO] Web Coverage Service 2.0 Earth Observation extensions SUCCESS [ 22.393 s]
[INFO] Web Coverage Service 2.0 Earth Observation GUI extension SUCCESS [ 13.540 s]
[INFO] GeoServer libjpeg-turbo Module ..................... SUCCESS [ 15.801 s]
[INFO] GeoServer Data Importer ............................ SUCCESS [  0.202 s]
[INFO] Importer Core Module ............................... SUCCESS [01:04 min]
[INFO] Importer REST Api Module-ng ........................ SUCCESS [ 51.793 s]
[INFO] Importer Berkley DB Persistence Module ............. SUCCESS [ 19.486 s]
[INFO] Importer Web UI Module ............................. SUCCESS [ 18.292 s]
[INFO] GRIB Coverage Format ............................... SUCCESS [ 23.608 s]
[INFO] NetCDF Coverage format ............................. SUCCESS [ 28.254 s]
[INFO] WCS NetCDF output Module ........................... SUCCESS [ 48.545 s]
[INFO] Vector Tiles ....................................... SUCCESS [ 24.965 s]
[INFO] Ysld GeoServer Plugin .............................. SUCCESS [ 21.912 s]
[INFO] MongoDB Data Store ................................. SUCCESS [  2.383 s]
[INFO] REST SLD service ................................... SUCCESS [ 29.299 s]
[INFO] GeoFence security integration ...................... SUCCESS [ 50.056 s]
[INFO] GeoFence Server .................................... SUCCESS [ 42.487 s]
[INFO] ------------------------------------------------------------------------
[INFO] BUILD FAILURE
[INFO] ------------------------------------------------------------------------
[INFO] Total time: 32:22 min (Wall Clock)
[INFO] Finished at: 2019-02-10T20:30:36+00:00
[INFO] Final Memory: 502M/1687M
[INFO] ------------------------------------------------------------------------
[ERROR] Failed to execute goal org.apache.maven.plugins:maven-surefire-plugin:2.12.3:test (default-test) on project gs-wps-core: There are test failures.
[ERROR]
[ERROR] Please refer to <https://build.geoserver.org/job/geoserver-java11/ws/src/extension/wps/wps-core/target/surefire-reports> for the individual test results.
[ERROR] -> [Help 1]
[ERROR]
[ERROR] To see the full stack trace of the errors, re-run Maven with the -e switch.
[ERROR] Re-run Maven using the -X switch to enable full debug logging.
[ERROR]
[ERROR] For more information about the errors and possible solutions, please read the following articles:
[ERROR] [Help 1] http://cwiki.apache.org/confluence/display/MAVEN/MojoFailureException
[ERROR]
[ERROR] After correcting the problems, you can resume the build with the command
[ERROR]   mvn <goals> -rf :gs-wps-core
Build step 'Invoke top-level Maven targets' marked build as failure


_______________________________________________
Geoserver-devel mailing list
[hidden email]
https://lists.sourceforge.net/lists/listinfo/geoserver-devel
Reply | Threaded
Open this post in threaded view
|

Jenkins build is back to normal : geoserver-java11 #331

monitor