Build failed in Jenkins: geoserver-2.15.x-java11 #6

classic Classic list List threaded Threaded
2 messages Options
Reply | Threaded
Open this post in threaded view
|

Build failed in Jenkins: geoserver-2.15.x-java11 #6

monitor
See <https://build.geoserver.org/job/geoserver-2.15.x-java11/6/display/redirect?page=changes>

Changes:

[Daniele Romagnoli] [GEOS-9099]: missing JNA lib in netcdf extension, preventing startup

------------------------------------------
[...truncated 743.77 KB...]
Running org.geoserver.wcs2_0.eo.GetCapabilitiesTest
Tests run: 2, Failures: 0, Errors: 0, Skipped: 0, Time elapsed: 0.702 sec
Running org.geoserver.wcs2_0.eo.GetCoverageTest
Tests run: 3, Failures: 0, Errors: 0, Skipped: 0, Time elapsed: 0.715 sec
Running org.geoserver.wcs2_0.eo.GranuleCoverageExtensionTest
Tests run: 2, Failures: 0, Errors: 0, Skipped: 0, Time elapsed: 0.583 sec

Results :

Tests run: 31, Failures: 0, Errors: 0, Skipped: 0

[INFO]
[INFO] --- maven-jar-plugin:2.4:jar (default-jar) @ gs-wcs2_0-eo-core ---
[INFO] Building jar: <https://build.geoserver.org/job/geoserver-2.15.x-java11/ws/src/extension/wcs2_0-eo/core/target/gs-wcs2_0-eo-core-2.15-SNAPSHOT.jar>
[INFO]
[INFO] --- maven-jar-plugin:2.4:test-jar (default) @ gs-wcs2_0-eo-core ---
[INFO] Building jar: <https://build.geoserver.org/job/geoserver-2.15.x-java11/ws/src/extension/wcs2_0-eo/core/target/gs-wcs2_0-eo-core-2.15-SNAPSHOT-tests.jar>
[INFO]
[INFO] --- maven-source-plugin:2.2.1:jar-no-fork (attach-sources) @ gs-wcs2_0-eo-core ---
[INFO] Building jar: <https://build.geoserver.org/job/geoserver-2.15.x-java11/ws/src/extension/wcs2_0-eo/core/target/gs-wcs2_0-eo-core-2.15-SNAPSHOT-sources.jar>
[INFO]
[INFO] --- maven-source-plugin:2.2.1:test-jar-no-fork (attach-sources) @ gs-wcs2_0-eo-core ---
[INFO] Building jar: <https://build.geoserver.org/job/geoserver-2.15.x-java11/ws/src/extension/wcs2_0-eo/core/target/gs-wcs2_0-eo-core-2.15-SNAPSHOT-test-sources.jar>
[INFO]
[INFO] --- fmt-maven-plugin:2.4.0:check (default) @ gs-wcs2_0-eo-core ---
[debug] Using AOSP style
[INFO] Processed 19 files (0 non-complying).
[INFO]
[INFO] >>> maven-pmd-plugin:3.11.0:check (default) > :pmd @ gs-wcs2_0-eo-core >>>
[INFO]
[INFO] --- maven-pmd-plugin:3.11.0:pmd (pmd) @ gs-wcs2_0-eo-core ---
[WARNING] File encoding has not been set, using platform encoding UTF-8, i.e. build is platform dependent!
[INFO]
[INFO] <<< maven-pmd-plugin:3.11.0:check (default) < :pmd @ gs-wcs2_0-eo-core <<<
[INFO]
[INFO] --- maven-pmd-plugin:3.11.0:check (default) @ gs-wcs2_0-eo-core ---
[INFO]
[INFO]
[INFO] --- maven-install-plugin:2.4:install (default-install) @ gs-wcs2_0-eo-core ---
[INFO] Installing <https://build.geoserver.org/job/geoserver-2.15.x-java11/ws/src/extension/wcs2_0-eo/core/target/gs-wcs2_0-eo-core-2.15-SNAPSHOT.jar> to <https://build.geoserver.org/job/geoserver-2.15.x-java11/ws/m2/org/geoserver/extension/gs-wcs2_0-eo-core/2.15-SNAPSHOT/gs-wcs2_0-eo-core-2.15-SNAPSHOT.jar>
[INFO] Installing <https://build.geoserver.org/job/geoserver-2.15.x-java11/ws/src/extension/wcs2_0-eo/core/pom.xml> to <https://build.geoserver.org/job/geoserver-2.15.x-java11/ws/m2/org/geoserver/extension/gs-wcs2_0-eo-core/2.15-SNAPSHOT/gs-wcs2_0-eo-core-2.15-SNAPSHOT.pom>
[INFO] Installing <https://build.geoserver.org/job/geoserver-2.15.x-java11/ws/src/extension/wcs2_0-eo/core/target/gs-wcs2_0-eo-core-2.15-SNAPSHOT-tests.jar> to <https://build.geoserver.org/job/geoserver-2.15.x-java11/ws/m2/org/geoserver/extension/gs-wcs2_0-eo-core/2.15-SNAPSHOT/gs-wcs2_0-eo-core-2.15-SNAPSHOT-tests.jar>
[INFO] Installing <https://build.geoserver.org/job/geoserver-2.15.x-java11/ws/src/extension/wcs2_0-eo/core/target/gs-wcs2_0-eo-core-2.15-SNAPSHOT-sources.jar> to <https://build.geoserver.org/job/geoserver-2.15.x-java11/ws/m2/org/geoserver/extension/gs-wcs2_0-eo-core/2.15-SNAPSHOT/gs-wcs2_0-eo-core-2.15-SNAPSHOT-sources.jar>
[INFO] Installing <https://build.geoserver.org/job/geoserver-2.15.x-java11/ws/src/extension/wcs2_0-eo/core/target/gs-wcs2_0-eo-core-2.15-SNAPSHOT-test-sources.jar> to <https://build.geoserver.org/job/geoserver-2.15.x-java11/ws/m2/org/geoserver/extension/gs-wcs2_0-eo-core/2.15-SNAPSHOT/gs-wcs2_0-eo-core-2.15-SNAPSHOT-test-sources.jar>
[INFO]                                                                        
[INFO] ------------------------------------------------------------------------
[INFO] Building Web Coverage Service 2.0 Earth Observation GUI extension 2.15-SNAPSHOT
[INFO] ------------------------------------------------------------------------
[INFO]
[INFO] --- maven-clean-plugin:2.5:clean (default-clean) @ gs-web-wcs2_0-eo ---
[INFO] Deleting <https://build.geoserver.org/job/geoserver-2.15.x-java11/ws/src/extension/wcs2_0-eo/web/target>
[INFO]
[INFO] --- git-commit-id-plugin:2.1.15:revision (default) @ gs-web-wcs2_0-eo ---
[INFO]
[INFO] --- directory-maven-plugin:0.3.1:highest-basedir (directories) @ gs-web-wcs2_0-eo ---
[INFO] Highest basedir set to: <https://build.geoserver.org/job/geoserver-2.15.x-java11/ws/src>
[INFO]
[INFO] --- maven-resources-plugin:2.6:resources (default-resources) @ gs-web-wcs2_0-eo ---
[INFO] Using 'UTF-8' encoding to copy filtered resources.
[INFO] Copying 3 resources
[INFO] Copying 13 resources
[INFO]
[INFO] --- maven-compiler-plugin:3.8.0:compile (default-compile) @ gs-web-wcs2_0-eo ---
[INFO] Changes detected - recompiling the module!
[INFO] Compiling 2 source files to <https://build.geoserver.org/job/geoserver-2.15.x-java11/ws/src/extension/wcs2_0-eo/web/target/classes>
[INFO] <https://build.geoserver.org/job/geoserver-2.15.x-java11/ws/src/extension/wcs2_0-eo/web/src/main/java/org/geoserver/wcs2_0/eo/web/WCSEOLayerConfig.java>: Some input files use unchecked or unsafe operations.
[INFO] <https://build.geoserver.org/job/geoserver-2.15.x-java11/ws/src/extension/wcs2_0-eo/web/src/main/java/org/geoserver/wcs2_0/eo/web/WCSEOLayerConfig.java>: Recompile with -Xlint:unchecked for details.
[INFO]
[INFO] --- maven-resources-plugin:2.6:testResources (default-testResources) @ gs-web-wcs2_0-eo ---
[INFO] Using 'UTF-8' encoding to copy filtered resources.
[INFO] skip non existing resourceDirectory <https://build.geoserver.org/job/geoserver-2.15.x-java11/ws/src/extension/wcs2_0-eo/web/src/test/resources>
[INFO]
[INFO] --- maven-compiler-plugin:3.8.0:testCompile (default-testCompile) @ gs-web-wcs2_0-eo ---
[INFO] Changes detected - recompiling the module!
[INFO] Compiling 2 source files to <https://build.geoserver.org/job/geoserver-2.15.x-java11/ws/src/extension/wcs2_0-eo/web/target/test-classes>
[INFO] <https://build.geoserver.org/job/geoserver-2.15.x-java11/ws/src/extension/wcs2_0-eo/web/src/test/java/org/geoserver/wcs2_0/eo/web/WCSEOLayerConfigTest.java>: Some input files use unchecked or unsafe operations.
[INFO] <https://build.geoserver.org/job/geoserver-2.15.x-java11/ws/src/extension/wcs2_0-eo/web/src/test/java/org/geoserver/wcs2_0/eo/web/WCSEOLayerConfigTest.java>: Recompile with -Xlint:unchecked for details.
[INFO]
[INFO] --- maven-surefire-plugin:2.12.3:test (default-test) @ gs-web-wcs2_0-eo ---
[INFO] Surefire report directory: <https://build.geoserver.org/job/geoserver-2.15.x-java11/ws/src/extension/wcs2_0-eo/web/target/surefire-reports>

-------------------------------------------------------
 T E S T S
-------------------------------------------------------
Running org.geoserver.wcs2_0.eo.web.WCSEOAdminPanelTest
Tests run: 1, Failures: 0, Errors: 0, Skipped: 0, Time elapsed: 5.214 sec
Running org.geoserver.wcs2_0.eo.web.WCSEOLayerConfigTest
Tests run: 2, Failures: 0, Errors: 0, Skipped: 0, Time elapsed: 3.021 sec

Results :

Tests run: 3, Failures: 0, Errors: 0, Skipped: 0

[INFO]
[INFO] --- maven-jar-plugin:2.4:jar (default-jar) @ gs-web-wcs2_0-eo ---
[INFO] Building jar: <https://build.geoserver.org/job/geoserver-2.15.x-java11/ws/src/extension/wcs2_0-eo/web/target/gs-web-wcs2_0-eo-2.15-SNAPSHOT.jar>
[INFO]
[INFO] --- maven-jar-plugin:2.4:test-jar (default) @ gs-web-wcs2_0-eo ---
[INFO] Building jar: <https://build.geoserver.org/job/geoserver-2.15.x-java11/ws/src/extension/wcs2_0-eo/web/target/gs-web-wcs2_0-eo-2.15-SNAPSHOT-tests.jar>
[INFO]
[INFO] --- maven-source-plugin:2.2.1:jar-no-fork (attach-sources) @ gs-web-wcs2_0-eo ---
[INFO] Building jar: <https://build.geoserver.org/job/geoserver-2.15.x-java11/ws/src/extension/wcs2_0-eo/web/target/gs-web-wcs2_0-eo-2.15-SNAPSHOT-sources.jar>
[INFO]
[INFO] --- maven-source-plugin:2.2.1:test-jar-no-fork (attach-sources) @ gs-web-wcs2_0-eo ---
[INFO] Building jar: <https://build.geoserver.org/job/geoserver-2.15.x-java11/ws/src/extension/wcs2_0-eo/web/target/gs-web-wcs2_0-eo-2.15-SNAPSHOT-test-sources.jar>
[INFO]
[INFO] --- fmt-maven-plugin:2.4.0:check (default) @ gs-web-wcs2_0-eo ---
[debug] Using AOSP style
[INFO] Processed 4 files (0 non-complying).
[INFO]
[INFO] >>> maven-pmd-plugin:3.11.0:check (default) > :pmd @ gs-web-wcs2_0-eo >>>
[INFO]
[INFO] --- maven-pmd-plugin:3.11.0:pmd (pmd) @ gs-web-wcs2_0-eo ---
[WARNING] File encoding has not been set, using platform encoding UTF-8, i.e. build is platform dependent!
[INFO]
[INFO] <<< maven-pmd-plugin:3.11.0:check (default) < :pmd @ gs-web-wcs2_0-eo <<<
[INFO]
[INFO] --- maven-pmd-plugin:3.11.0:check (default) @ gs-web-wcs2_0-eo ---
[INFO]
[INFO]
[INFO] --- maven-install-plugin:2.4:install (default-install) @ gs-web-wcs2_0-eo ---
[INFO] Installing <https://build.geoserver.org/job/geoserver-2.15.x-java11/ws/src/extension/wcs2_0-eo/web/target/gs-web-wcs2_0-eo-2.15-SNAPSHOT.jar> to <https://build.geoserver.org/job/geoserver-2.15.x-java11/ws/m2/org/geoserver/extension/gs-web-wcs2_0-eo/2.15-SNAPSHOT/gs-web-wcs2_0-eo-2.15-SNAPSHOT.jar>
[INFO] Installing <https://build.geoserver.org/job/geoserver-2.15.x-java11/ws/src/extension/wcs2_0-eo/web/pom.xml> to <https://build.geoserver.org/job/geoserver-2.15.x-java11/ws/m2/org/geoserver/extension/gs-web-wcs2_0-eo/2.15-SNAPSHOT/gs-web-wcs2_0-eo-2.15-SNAPSHOT.pom>
[INFO] Installing <https://build.geoserver.org/job/geoserver-2.15.x-java11/ws/src/extension/wcs2_0-eo/web/target/gs-web-wcs2_0-eo-2.15-SNAPSHOT-tests.jar> to <https://build.geoserver.org/job/geoserver-2.15.x-java11/ws/m2/org/geoserver/extension/gs-web-wcs2_0-eo/2.15-SNAPSHOT/gs-web-wcs2_0-eo-2.15-SNAPSHOT-tests.jar>
[INFO] Installing <https://build.geoserver.org/job/geoserver-2.15.x-java11/ws/src/extension/wcs2_0-eo/web/target/gs-web-wcs2_0-eo-2.15-SNAPSHOT-sources.jar> to <https://build.geoserver.org/job/geoserver-2.15.x-java11/ws/m2/org/geoserver/extension/gs-web-wcs2_0-eo/2.15-SNAPSHOT/gs-web-wcs2_0-eo-2.15-SNAPSHOT-sources.jar>
[INFO] Installing <https://build.geoserver.org/job/geoserver-2.15.x-java11/ws/src/extension/wcs2_0-eo/web/target/gs-web-wcs2_0-eo-2.15-SNAPSHOT-test-sources.jar> to <https://build.geoserver.org/job/geoserver-2.15.x-java11/ws/m2/org/geoserver/extension/gs-web-wcs2_0-eo/2.15-SNAPSHOT/gs-web-wcs2_0-eo-2.15-SNAPSHOT-test-sources.jar>
[INFO] ------------------------------------------------------------------------
[INFO] Reactor Summary:
[INFO]
[INFO] GeoServer .......................................... SUCCESS [ 11.527 s]
[INFO] Core Platform Module ............................... SUCCESS [ 30.389 s]
[INFO] Open Web Service Module ............................ SUCCESS [ 25.230 s]
[INFO] Main Module ........................................ SUCCESS [02:56 min]
[INFO] GeoServer Security Modules ......................... SUCCESS [  0.262 s]
[INFO] GeoServer Security Tests Module .................... SUCCESS [02:37 min]
[INFO] GeoServer JDBC Security Module ..................... SUCCESS [ 57.637 s]
[INFO] GeoServer LDAP Security Module ..................... SUCCESS [  9.281 s]
[INFO] Web Coverage Service Module ........................ SUCCESS [  8.150 s]
[INFO] Web Coverage Service 1.0 Module .................... SUCCESS [ 33.372 s]
[INFO] Web Coverage Service 1.1 Module .................... SUCCESS [ 44.852 s]
[INFO] Web Coverage Service 2.0 Module .................... SUCCESS [05:00 min]
[INFO] Web Feature Service Module ......................... FAILURE [02:59 min]
[INFO] Web Map Service Module ............................. SKIPPED
[INFO] KML support for GeoServer .......................... SKIPPED
[INFO] gs-rest ............................................ SUCCESS [ 26.852 s]
[INFO] GeoWebCache (GWC) Module ........................... SKIPPED
[INFO] gs-restconfig ...................................... SUCCESS [02:11 min]
[INFO] gs-restconfig-wcs .................................. SUCCESS [ 16.148 s]
[INFO] gs-restconfig-wfs .................................. SKIPPED
[INFO] gs-restconfig-wms .................................. SKIPPED
[INFO] GeoServer Web Modules .............................. SUCCESS [  0.202 s]
[INFO] Core UI Module ..................................... SUCCESS [02:19 min]
[INFO] WMS UI Module ...................................... SKIPPED
[INFO] GWC UI Module ...................................... SKIPPED
[INFO] WFS UI Module ...................................... SKIPPED
[INFO] Demos Module ....................................... SKIPPED
[INFO] WCS UI Module ...................................... SKIPPED
[INFO] Security UI Modules ................................ SUCCESS [  0.111 s]
[INFO] Security UI Core Module ............................ SKIPPED
[INFO] Security UI JDBC Module ............................ SKIPPED
[INFO] Security UI LDAP Module ............................ SKIPPED
[INFO] REST UI Module ..................................... SUCCESS [ 11.566 s]
[INFO] GeoServer Extensions ............................... SUCCESS [  0.155 s]
[INFO] Printing Module .................................... SUCCESS [ 17.634 s]
[INFO] GeoServer Web Application .......................... SKIPPED
[INFO] Community Space .................................... SUCCESS [  0.153 s]
[INFO] Application Schema Support ......................... SUCCESS [  0.106 s]
[INFO] Application Schema Integration Test ................ SKIPPED
[INFO] Sample DataAccess Integration Test ................. SKIPPED
[INFO] ArcSDE DataStore Extension ......................... SUCCESS [ 14.026 s]
[INFO] H2 DataStore Extension ............................. SUCCESS [ 10.693 s]
[INFO] SQL Server DataStore Extension ..................... SUCCESS [  2.054 s]
[INFO] Oracle DataStore Extension ......................... SUCCESS [  1.761 s]
[INFO] MySQL DataStore Extension .......................... SUCCESS [  1.529 s]
[INFO] DB2 DataStore Extension ............................ SUCCESS [  1.234 s]
[INFO] ImageMap Output Format ............................. SKIPPED
[INFO] ImageI/O-Ext GDAL Coverage Extension ............... SUCCESS [  7.197 s]
[INFO] JP2K Coverage Extension ............................ SUCCESS [  0.982 s]
[INFO] OGR parent ......................................... SUCCESS [  0.097 s]
[INFO] OGR CORE ........................................... SUCCESS [  4.663 s]
[INFO] OGR WFS ............................................ SKIPPED
[INFO] Web Processing Service parent ...................... SUCCESS [  0.087 s]
[INFO] Web Processing Service Module ...................... SKIPPED
[INFO] OGR WPS ............................................ SKIPPED
[INFO] Excel Output Format ................................ SKIPPED
[INFO] Chart external graphics support .................... SUCCESS [  1.688 s]
[INFO] Feature Generalization Extension ................... SUCCESS [  3.852 s]
[INFO] Image Mosaic JDBC Extension ........................ SUCCESS [  1.321 s]
[INFO] OWS request flow controller ........................ SUCCESS [ 19.909 s]
[INFO] Web process status sharing with Hazelcast .......... SKIPPED
[INFO] Web Processing Service GUI ......................... SKIPPED
[INFO] GeoServer Layer Querying filter functions .......... SKIPPED
[INFO] Teradata DataStore Extension ....................... SUCCESS [  2.225 s]
[INFO] GeoServer Monitor Extensions ....................... SKIPPED
[INFO] Core Monitor Extension ............................. SKIPPED
[INFO] GeoServer Security Extension Modules ............... SKIPPED
[INFO] GeoServer CAS Security Module ...................... SKIPPED
[INFO] GeoServer Security Extension Web Modules ........... SKIPPED
[INFO] GeoServer CAS Security Web Module .................. SKIPPED
[INFO] XLST based WFS output format ....................... SKIPPED
[INFO] GeoServer INSPIRE Extensions ....................... SKIPPED
[INFO] GeoServer CSS Styling .............................. SKIPPED
[INFO] Catalog Services for the Web parent ................ SUCCESS [  0.113 s]
[INFO] Catalog Services for the Web interfaces ............ SUCCESS [ 12.310 s]
[INFO] Catalog Services for the Web - Simple CatalogStore implementation SUCCESS [ 10.424 s]
[INFO] Catalog Services for the Web core module ........... SUCCESS [ 36.313 s]
[INFO] CSW UI Module ...................................... SUCCESS [  9.809 s]
[INFO] DXF WFS output format and WPS PPIO ................. SUCCESS [  0.075 s]
[INFO] DXF WFS output format .............................. SKIPPED
[INFO] DXF WPS PPIO ....................................... SKIPPED
[INFO] GeoServer WCS 2.0 Earth Observation Extensions ..... SUCCESS [  0.101 s]
[INFO] Web Coverage Service 2.0 Earth Observation extensions SUCCESS [ 19.369 s]
[INFO] Web Coverage Service 2.0 Earth Observation GUI extension SUCCESS [ 11.817 s]
[INFO] GeoServer libjpeg-turbo Module ..................... SKIPPED
[INFO] GeoServer Data Importer ............................ SKIPPED
[INFO] Importer Core Module ............................... SKIPPED
[INFO] Importer REST Api Module-ng ........................ SKIPPED
[INFO] Importer Berkley DB Persistence Module ............. SKIPPED
[INFO] Importer Web UI Module ............................. SKIPPED
[INFO] GRIB Coverage Format ............................... SUCCESS [ 19.925 s]
[INFO] NetCDF Coverage format ............................. SKIPPED
[INFO] WCS NetCDF output Module ........................... SKIPPED
[INFO] Vector Tiles ....................................... SKIPPED
[INFO] Ysld GeoServer Plugin .............................. SKIPPED
[INFO] MongoDB Data Store ................................. SUCCESS [  3.182 s]
[INFO] REST SLD service ................................... SKIPPED
[INFO] GeoFence security integration ...................... SKIPPED
[INFO] GeoFence Server .................................... SKIPPED
[INFO] ------------------------------------------------------------------------
[INFO] BUILD FAILURE
[INFO] ------------------------------------------------------------------------
[INFO] Total time: 16:27 min (Wall Clock)
[INFO] Finished at: 2019-02-08T12:50:35+00:00
[INFO] Final Memory: 333M/1127M
[INFO] ------------------------------------------------------------------------
[ERROR] Failed to execute goal org.apache.maven.plugins:maven-surefire-plugin:2.12.3:test (default-test) on project gs-wfs: There are test failures.
[ERROR]
[ERROR] Please refer to <https://build.geoserver.org/job/geoserver-2.15.x-java11/ws/src/wfs/target/surefire-reports> for the individual test results.
[ERROR] -> [Help 1]
[ERROR]
[ERROR] To see the full stack trace of the errors, re-run Maven with the -e switch.
[ERROR] Re-run Maven using the -X switch to enable full debug logging.
[ERROR]
[ERROR] For more information about the errors and possible solutions, please read the following articles:
[ERROR] [Help 1] http://cwiki.apache.org/confluence/display/MAVEN/MojoFailureException
[ERROR]
[ERROR] After correcting the problems, you can resume the build with the command
[ERROR]   mvn <goals> -rf :gs-wfs
Build step 'Invoke top-level Maven targets' marked build as failure


_______________________________________________
Geoserver-devel mailing list
[hidden email]
https://lists.sourceforge.net/lists/listinfo/geoserver-devel
Reply | Threaded
Open this post in threaded view
|

Jenkins build is back to normal : geoserver-2.15.x-java11 #7

monitor