Build failed in Jenkins: geoserver-2.15.x-java11 #162

classic Classic list List threaded Threaded
2 messages Options
Reply | Threaded
Open this post in threaded view
|

Build failed in Jenkins: geoserver-2.15.x-java11 #162

Jenkins-2
See <https://build.geoserver.org/job/geoserver-2.15.x-java11/162/display/redirect?page=changes>

Changes:

[gabriel.roldan] Fix data/minimal/styles/generic.xml pointing at generic.sld instead of

------------------------------------------
[...truncated 1.55 MB...]
[INFO] Surefire report directory: <https://build.geoserver.org/job/geoserver-2.15.x-java11/ws/src/extension/importer/web/target/surefire-reports>

-------------------------------------------------------
 T E S T S
-------------------------------------------------------
Running org.geoserver.importer.web.AbstractDBPanelTest
Tests run: 1, Failures: 0, Errors: 0, Skipped: 0, Time elapsed: 0.864 sec
Running org.geoserver.importer.web.ImportTaskTableTest
Tests run: 2, Failures: 0, Errors: 0, Skipped: 0, Time elapsed: 5.854 sec

Results :

Tests run: 3, Failures: 0, Errors: 0, Skipped: 0

[INFO]
[INFO] --- maven-jar-plugin:2.4:jar (default-jar) @ gs-importer-web ---
[INFO] Building jar: <https://build.geoserver.org/job/geoserver-2.15.x-java11/ws/src/extension/importer/web/target/gs-importer-web-2.15-SNAPSHOT.jar>
[INFO]
[INFO] --- maven-jar-plugin:2.4:test-jar (default) @ gs-importer-web ---
[INFO] Building jar: <https://build.geoserver.org/job/geoserver-2.15.x-java11/ws/src/extension/importer/web/target/gs-importer-web-2.15-SNAPSHOT-tests.jar>
[INFO]
[INFO] --- maven-source-plugin:2.2.1:jar-no-fork (attach-sources) @ gs-importer-web ---
[INFO] Building jar: <https://build.geoserver.org/job/geoserver-2.15.x-java11/ws/src/extension/importer/web/target/gs-importer-web-2.15-SNAPSHOT-sources.jar>
[INFO]
[INFO] --- maven-source-plugin:2.2.1:test-jar-no-fork (attach-sources) @ gs-importer-web ---
[INFO] Building jar: <https://build.geoserver.org/job/geoserver-2.15.x-java11/ws/src/extension/importer/web/target/gs-importer-web-2.15-SNAPSHOT-test-sources.jar>
[INFO]
[INFO] --- fmt-maven-plugin:2.4.0:check (default) @ gs-importer-web ---
[debug] Using AOSP style
[INFO] Processed 35 files (0 non-complying).
[INFO]
[INFO] --- maven-install-plugin:2.4:install (default-install) @ gs-importer-web ---
[INFO] Installing <https://build.geoserver.org/job/geoserver-2.15.x-java11/ws/src/extension/importer/web/target/gs-importer-web-2.15-SNAPSHOT.jar> to <https://build.geoserver.org/job/geoserver-2.15.x-java11/ws/m2/org/geoserver/importer/gs-importer-web/2.15-SNAPSHOT/gs-importer-web-2.15-SNAPSHOT.jar>
[INFO] Installing <https://build.geoserver.org/job/geoserver-2.15.x-java11/ws/src/extension/importer/web/pom.xml> to <https://build.geoserver.org/job/geoserver-2.15.x-java11/ws/m2/org/geoserver/importer/gs-importer-web/2.15-SNAPSHOT/gs-importer-web-2.15-SNAPSHOT.pom>
[INFO] Installing <https://build.geoserver.org/job/geoserver-2.15.x-java11/ws/src/extension/importer/web/target/gs-importer-web-2.15-SNAPSHOT-tests.jar> to <https://build.geoserver.org/job/geoserver-2.15.x-java11/ws/m2/org/geoserver/importer/gs-importer-web/2.15-SNAPSHOT/gs-importer-web-2.15-SNAPSHOT-tests.jar>
[INFO] Installing <https://build.geoserver.org/job/geoserver-2.15.x-java11/ws/src/extension/importer/web/target/gs-importer-web-2.15-SNAPSHOT-sources.jar> to <https://build.geoserver.org/job/geoserver-2.15.x-java11/ws/m2/org/geoserver/importer/gs-importer-web/2.15-SNAPSHOT/gs-importer-web-2.15-SNAPSHOT-sources.jar>
[INFO] Installing <https://build.geoserver.org/job/geoserver-2.15.x-java11/ws/src/extension/importer/web/target/gs-importer-web-2.15-SNAPSHOT-test-sources.jar> to <https://build.geoserver.org/job/geoserver-2.15.x-java11/ws/m2/org/geoserver/importer/gs-importer-web/2.15-SNAPSHOT/gs-importer-web-2.15-SNAPSHOT-test-sources.jar>
[INFO]
[INFO] ---------------< org.geoserver.security:gs-web-sec-cas >----------------
[INFO] Building GeoServer CAS Security Web Module 2.15-SNAPSHOT         [94/99]
[INFO] --------------------------------[ jar ]---------------------------------
[INFO]
[INFO] --- maven-clean-plugin:2.5:clean (default-clean) @ gs-web-sec-cas ---
[INFO] Deleting <https://build.geoserver.org/job/geoserver-2.15.x-java11/ws/src/extension/security/web/web-cas/target>
[INFO]
[INFO] --- git-commit-id-plugin:2.1.15:revision (default) @ gs-web-sec-cas ---
[INFO]
[INFO] --- directory-maven-plugin:0.3.1:highest-basedir (directories) @ gs-web-sec-cas ---
[INFO] Highest basedir set to: <https://build.geoserver.org/job/geoserver-2.15.x-java11/ws/src>
[INFO]
[INFO] --- maven-resources-plugin:2.6:resources (default-resources) @ gs-web-sec-cas ---
[INFO] Using 'UTF-8' encoding to copy filtered resources.
[INFO] Copying 2 resources
[INFO] skip non existing resourceDirectory <https://build.geoserver.org/job/geoserver-2.15.x-java11/ws/src/extension/security/web/web-cas/src/main/resources>
[INFO]
[INFO] --- maven-compiler-plugin:3.8.0:compile (default-compile) @ gs-web-sec-cas ---
[INFO] Changes detected - recompiling the module!
[INFO] Compiling 2 source files to <https://build.geoserver.org/job/geoserver-2.15.x-java11/ws/src/extension/security/web/web-cas/target/classes>
[INFO]
[INFO] --- maven-resources-plugin:2.6:testResources (default-testResources) @ gs-web-sec-cas ---
[INFO] Using 'UTF-8' encoding to copy filtered resources.
[INFO] skip non existing resourceDirectory <https://build.geoserver.org/job/geoserver-2.15.x-java11/ws/src/extension/security/web/web-cas/src/test/java>
[INFO] skip non existing resourceDirectory <https://build.geoserver.org/job/geoserver-2.15.x-java11/ws/src/extension/security/web/web-cas/src/test/resources>
[INFO]
[INFO] --- maven-compiler-plugin:3.8.0:testCompile (default-testCompile) @ gs-web-sec-cas ---
[INFO] No sources to compile
[INFO]
[INFO] --- maven-surefire-plugin:2.12.3:test (default-test) @ gs-web-sec-cas ---
[INFO] No tests to run.
[INFO]
[INFO] --- maven-jar-plugin:2.4:jar (default-jar) @ gs-web-sec-cas ---
[INFO] Building jar: <https://build.geoserver.org/job/geoserver-2.15.x-java11/ws/src/extension/security/web/web-cas/target/gs-web-sec-cas-2.15-SNAPSHOT.jar>
[INFO]
[INFO] --- maven-jar-plugin:2.4:test-jar (default) @ gs-web-sec-cas ---
[WARNING] JAR will be empty - no content was marked for inclusion!
[INFO] Building jar: <https://build.geoserver.org/job/geoserver-2.15.x-java11/ws/src/extension/security/web/web-cas/target/gs-web-sec-cas-2.15-SNAPSHOT-tests.jar>
[INFO]
[INFO] --- maven-source-plugin:2.2.1:jar-no-fork (attach-sources) @ gs-web-sec-cas ---
[INFO] Building jar: <https://build.geoserver.org/job/geoserver-2.15.x-java11/ws/src/extension/security/web/web-cas/target/gs-web-sec-cas-2.15-SNAPSHOT-sources.jar>
[INFO]
[INFO] --- maven-source-plugin:2.2.1:test-jar-no-fork (attach-sources) @ gs-web-sec-cas ---
[INFO] No sources in project. Archive not created.
[INFO]
[INFO] --- fmt-maven-plugin:2.4.0:check (default) @ gs-web-sec-cas ---
[warn] Test source directory '<https://build.geoserver.org/job/geoserver-2.15.x-java11/ws/src/extension/security/web/web-cas/src/test/java'> does not exist, ignoring.
[debug] Using AOSP style
[INFO] Processed 2 files (0 non-complying).
[INFO]
[INFO] --- maven-install-plugin:2.4:install (default-install) @ gs-web-sec-cas ---
[INFO] Installing <https://build.geoserver.org/job/geoserver-2.15.x-java11/ws/src/extension/security/web/web-cas/target/gs-web-sec-cas-2.15-SNAPSHOT.jar> to <https://build.geoserver.org/job/geoserver-2.15.x-java11/ws/m2/org/geoserver/security/gs-web-sec-cas/2.15-SNAPSHOT/gs-web-sec-cas-2.15-SNAPSHOT.jar>
[INFO] Installing <https://build.geoserver.org/job/geoserver-2.15.x-java11/ws/src/extension/security/web/web-cas/pom.xml> to <https://build.geoserver.org/job/geoserver-2.15.x-java11/ws/m2/org/geoserver/security/gs-web-sec-cas/2.15-SNAPSHOT/gs-web-sec-cas-2.15-SNAPSHOT.pom>
[INFO] Installing <https://build.geoserver.org/job/geoserver-2.15.x-java11/ws/src/extension/security/web/web-cas/target/gs-web-sec-cas-2.15-SNAPSHOT-tests.jar> to <https://build.geoserver.org/job/geoserver-2.15.x-java11/ws/m2/org/geoserver/security/gs-web-sec-cas/2.15-SNAPSHOT/gs-web-sec-cas-2.15-SNAPSHOT-tests.jar>
[INFO] Installing <https://build.geoserver.org/job/geoserver-2.15.x-java11/ws/src/extension/security/web/web-cas/target/gs-web-sec-cas-2.15-SNAPSHOT-sources.jar> to <https://build.geoserver.org/job/geoserver-2.15.x-java11/ws/m2/org/geoserver/security/gs-web-sec-cas/2.15-SNAPSHOT/gs-web-sec-cas-2.15-SNAPSHOT-sources.jar>
Tests run: 12, Failures: 0, Errors: 0, Skipped: 0, Time elapsed: 390.217 sec
Running org.geoserver.importer.bdb.SerialVersionSafeSerialBindingTest
Tests run: 1, Failures: 0, Errors: 0, Skipped: 0, Time elapsed: 0.32 sec
Running org.geoserver.importer.bdb.XStreamInfoSerialBindingTest
Tests run: 2, Failures: 0, Errors: 0, Skipped: 0, Time elapsed: 3.111 sec

Results :

Tests run: 15, Failures: 0, Errors: 0, Skipped: 0

[INFO]
[INFO] --- maven-jar-plugin:2.4:jar (default-jar) @ gs-importer-bdb ---
[INFO] Building jar: <https://build.geoserver.org/job/geoserver-2.15.x-java11/ws/src/extension/importer/bdb/target/gs-importer-bdb-2.15-SNAPSHOT.jar>
[INFO]
[INFO] --- maven-jar-plugin:2.4:test-jar (default) @ gs-importer-bdb ---
[INFO] Building jar: <https://build.geoserver.org/job/geoserver-2.15.x-java11/ws/src/extension/importer/bdb/target/gs-importer-bdb-2.15-SNAPSHOT-tests.jar>
[INFO]
[INFO] --- maven-source-plugin:2.2.1:jar-no-fork (attach-sources) @ gs-importer-bdb ---
[INFO] Building jar: <https://build.geoserver.org/job/geoserver-2.15.x-java11/ws/src/extension/importer/bdb/target/gs-importer-bdb-2.15-SNAPSHOT-sources.jar>
[INFO]
[INFO] --- maven-source-plugin:2.2.1:test-jar-no-fork (attach-sources) @ gs-importer-bdb ---
[INFO] Building jar: <https://build.geoserver.org/job/geoserver-2.15.x-java11/ws/src/extension/importer/bdb/target/gs-importer-bdb-2.15-SNAPSHOT-test-sources.jar>
[INFO]
[INFO] --- fmt-maven-plugin:2.4.0:check (default) @ gs-importer-bdb ---
[debug] Using AOSP style
[INFO] Processed 8 files (0 non-complying).
[INFO]
[INFO] --- maven-install-plugin:2.4:install (default-install) @ gs-importer-bdb ---
[INFO] Installing <https://build.geoserver.org/job/geoserver-2.15.x-java11/ws/src/extension/importer/bdb/target/gs-importer-bdb-2.15-SNAPSHOT.jar> to <https://build.geoserver.org/job/geoserver-2.15.x-java11/ws/m2/org/geoserver/importer/gs-importer-bdb/2.15-SNAPSHOT/gs-importer-bdb-2.15-SNAPSHOT.jar>
[INFO] Installing <https://build.geoserver.org/job/geoserver-2.15.x-java11/ws/src/extension/importer/bdb/pom.xml> to <https://build.geoserver.org/job/geoserver-2.15.x-java11/ws/m2/org/geoserver/importer/gs-importer-bdb/2.15-SNAPSHOT/gs-importer-bdb-2.15-SNAPSHOT.pom>
[INFO] Installing <https://build.geoserver.org/job/geoserver-2.15.x-java11/ws/src/extension/importer/bdb/target/gs-importer-bdb-2.15-SNAPSHOT-tests.jar> to <https://build.geoserver.org/job/geoserver-2.15.x-java11/ws/m2/org/geoserver/importer/gs-importer-bdb/2.15-SNAPSHOT/gs-importer-bdb-2.15-SNAPSHOT-tests.jar>
[INFO] Installing <https://build.geoserver.org/job/geoserver-2.15.x-java11/ws/src/extension/importer/bdb/target/gs-importer-bdb-2.15-SNAPSHOT-sources.jar> to <https://build.geoserver.org/job/geoserver-2.15.x-java11/ws/m2/org/geoserver/importer/gs-importer-bdb/2.15-SNAPSHOT/gs-importer-bdb-2.15-SNAPSHOT-sources.jar>
[INFO] Installing <https://build.geoserver.org/job/geoserver-2.15.x-java11/ws/src/extension/importer/bdb/target/gs-importer-bdb-2.15-SNAPSHOT-test-sources.jar> to <https://build.geoserver.org/job/geoserver-2.15.x-java11/ws/m2/org/geoserver/importer/gs-importer-bdb/2.15-SNAPSHOT/gs-importer-bdb-2.15-SNAPSHOT-test-sources.jar>
[INFO] ------------------------------------------------------------------------
[INFO] Reactor Summary for GeoServer 2.15-SNAPSHOT:
[INFO]
[INFO] GeoServer .......................................... SUCCESS [  7.504 s]
[INFO] Core Platform Module ............................... SUCCESS [ 13.076 s]
[INFO] Open Web Service Module ............................ SUCCESS [  6.269 s]
[INFO] Main Module ........................................ SUCCESS [01:02 min]
[INFO] GeoServer Security Modules ......................... SUCCESS [  0.051 s]
[INFO] GeoServer Security Tests Module .................... SUCCESS [01:24 min]
[INFO] GeoServer JDBC Security Module ..................... SUCCESS [03:53 min]
[INFO] GeoServer LDAP Security Module ..................... SUCCESS [ 19.799 s]
[INFO] Web Coverage Service Module ........................ SUCCESS [  0.577 s]
[INFO] Web Coverage Service 1.0 Module .................... SUCCESS [ 11.966 s]
[INFO] Web Coverage Service 1.1 Module .................... SUCCESS [ 14.526 s]
[INFO] Web Coverage Service 2.0 Module .................... SUCCESS [03:32 min]
[INFO] Web Feature Service Module ......................... SUCCESS [01:37 min]
[INFO] Web Map Service Module ............................. SUCCESS [01:39 min]
[INFO] KML support for GeoServer .......................... SUCCESS [ 19.441 s]
[INFO] gs-rest ............................................ SUCCESS [  7.617 s]
[INFO] GeoWebCache (GWC) Module ........................... FAILURE [01:30 min]
[INFO] gs-restconfig ...................................... SUCCESS [01:18 min]
[INFO] gs-restconfig-wcs .................................. SUCCESS [03:37 min]
[INFO] gs-restconfig-wfs .................................. SUCCESS [ 13.876 s]
[INFO] gs-restconfig-wms .................................. SUCCESS [03:20 min]
[INFO] GeoServer Web Modules .............................. SUCCESS [  0.080 s]
[INFO] Core UI Module ..................................... SUCCESS [ 46.074 s]
[INFO] WMS UI Module ...................................... SUCCESS [07:34 min]
[INFO] GWC UI Module ...................................... SKIPPED
[INFO] WFS UI Module ...................................... SUCCESS [  6.534 s]
[INFO] Demos Module ....................................... SUCCESS [04:19 min]
[INFO] WCS UI Module ...................................... SUCCESS [  8.186 s]
[INFO] Security UI Modules ................................ SUCCESS [  0.047 s]
[INFO] Security UI Core Module ............................ SUCCESS [06:19 min]
[INFO] Security UI JDBC Module ............................ SUCCESS [03:33 min]
[INFO] Security UI LDAP Module ............................ SUCCESS [  6.942 s]
[INFO] REST UI Module ..................................... SUCCESS [  7.910 s]
[INFO] GeoServer Extensions ............................... SUCCESS [  0.046 s]
[INFO] Printing Module .................................... SUCCESS [  7.189 s]
[INFO] GeoServer Web Application .......................... SKIPPED
[INFO] Community Space .................................... SUCCESS [  0.023 s]
[INFO] Application Schema Support ......................... SUCCESS [  0.025 s]
[INFO] Application Schema Integration Test ................ SUCCESS [05:34 min]
[INFO] Sample DataAccess Integration Test ................. SUCCESS [  7.871 s]
[INFO] ArcSDE DataStore Extension ......................... SUCCESS [  6.586 s]
[INFO] H2 DataStore Extension ............................. SUCCESS [  8.334 s]
[INFO] SQL Server DataStore Extension ..................... SUCCESS [  0.834 s]
[INFO] Oracle DataStore Extension ......................... SUCCESS [  0.650 s]
[INFO] MySQL DataStore Extension .......................... SUCCESS [  0.248 s]
[INFO] DB2 DataStore Extension ............................ SUCCESS [  0.241 s]
[INFO] ImageMap Output Format ............................. SUCCESS [  4.446 s]
[INFO] ImageI/O-Ext GDAL Coverage Extension ............... SUCCESS [  2.409 s]
[INFO] JP2K Coverage Extension ............................ SUCCESS [  0.269 s]
[INFO] OGR parent ......................................... SUCCESS [  0.018 s]
[INFO] OGR CORE ........................................... SUCCESS [  0.393 s]
[INFO] OGR WFS ............................................ SUCCESS [  4.752 s]
[INFO] Web Processing Service parent ...................... SUCCESS [  0.018 s]
[INFO] Web Processing Service Module ...................... SUCCESS [11:55 min]
[INFO] OGR WPS ............................................ SUCCESS [  5.551 s]
[INFO] Excel Output Format ................................ SUCCESS [  8.490 s]
[INFO] Chart external graphics support .................... SUCCESS [  0.446 s]
[INFO] Feature Generalization Extension ................... SUCCESS [  0.577 s]
[INFO] Image Mosaic JDBC Extension ........................ SUCCESS [  0.440 s]
[INFO] OWS request flow controller ........................ SUCCESS [ 10.744 s]
[INFO] Web process status sharing with Hazelcast .......... SUCCESS [ 13.543 s]
[INFO] Web Processing Service GUI ......................... SUCCESS [ 17.448 s]
[INFO] GeoServer Layer Querying filter functions .......... SUCCESS [  9.902 s]
[INFO] Teradata DataStore Extension ....................... SUCCESS [  0.589 s]
[INFO] GeoServer Monitor Extensions ....................... SUCCESS [  0.044 s]
[INFO] Core Monitor Extension ............................. SKIPPED
[INFO] GeoServer Security Extension Modules ............... SUCCESS [  0.030 s]
[INFO] GeoServer CAS Security Module ...................... SUCCESS [  2.151 s]
[INFO] GeoServer Security Extension Web Modules ........... SUCCESS [  0.030 s]
[INFO] GeoServer CAS Security Web Module .................. SUCCESS [  0.418 s]
[INFO] XLST based WFS output format ....................... SUCCESS [ 13.699 s]
[INFO] GeoServer INSPIRE Extensions ....................... SKIPPED
[INFO] GeoServer CSS Styling .............................. SUCCESS [ 10.594 s]
[INFO] Catalog Services for the Web parent ................ SUCCESS [  0.046 s]
[INFO] Catalog Services for the Web interfaces ............ SUCCESS [  5.061 s]
[INFO] Catalog Services for the Web - Simple CatalogStore implementation SUCCESS [  5.027 s]
[INFO] Catalog Services for the Web core module ........... SUCCESS [04:01 min]
[INFO] CSW UI Module ...................................... SUCCESS [  5.778 s]
[INFO] DXF WFS output format and WPS PPIO ................. SUCCESS [  0.022 s]
[INFO] DXF WFS output format .............................. SUCCESS [  8.097 s]
[INFO] DXF WPS PPIO ....................................... SUCCESS [  5.459 s]
[INFO] GeoServer WCS 2.0 Earth Observation Extensions ..... SUCCESS [  0.022 s]
[INFO] Web Coverage Service 2.0 Earth Observation extensions SUCCESS [ 10.940 s]
[INFO] Web Coverage Service 2.0 Earth Observation GUI extension SUCCESS [ 37.551 s]
[INFO] GeoServer libjpeg-turbo Module ..................... SUCCESS [  6.190 s]
[INFO] GeoServer Data Importer ............................ SUCCESS [  0.050 s]
[INFO] Importer Core Module ............................... SUCCESS [ 28.461 s]
[INFO] Importer REST Api Module-ng ........................ SUCCESS [ 32.615 s]
[INFO] Importer Berkley DB Persistence Module ............. SUCCESS [06:34 min]
[INFO] Importer Web UI Module ............................. SUCCESS [  8.732 s]
[INFO] GRIB Coverage Format ............................... SUCCESS [ 10.754 s]
[INFO] NetCDF Coverage format ............................. SUCCESS [ 52.579 s]
[INFO] WCS NetCDF output Module ........................... SUCCESS [04:04 min]
[INFO] Vector Tiles ....................................... SUCCESS [ 11.634 s]
[INFO] Ysld GeoServer Plugin .............................. SKIPPED
[INFO] MongoDB Data Store ................................. SUCCESS [  1.429 s]
[INFO] REST SLD service ................................... SUCCESS [04:28 min]
[INFO] GeoFence security integration ...................... SUCCESS [01:17 min]
[INFO] GeoFence Server .................................... SUCCESS [06:09 min]
[INFO] ------------------------------------------------------------------------
[INFO] BUILD FAILURE
[INFO] ------------------------------------------------------------------------
[INFO] Total time:  50:14 min (Wall Clock)
[INFO] Finished at: 2019-06-13T20:58:33Z
[INFO] ------------------------------------------------------------------------
[ERROR] Failed to execute goal org.apache.maven.plugins:maven-surefire-plugin:2.12.3:test (default-test) on project gs-gwc: There are test failures.
[ERROR]
[ERROR] Please refer to <https://build.geoserver.org/job/geoserver-2.15.x-java11/ws/src/gwc/target/surefire-reports> for the individual test results.
[ERROR] -> [Help 1]
[ERROR]
[ERROR] To see the full stack trace of the errors, re-run Maven with the -e switch.
[ERROR] Re-run Maven using the -X switch to enable full debug logging.
[ERROR]
[ERROR] For more information about the errors and possible solutions, please read the following articles:
[ERROR] [Help 1] http://cwiki.apache.org/confluence/display/MAVEN/MojoFailureException
[ERROR]
[ERROR] After correcting the problems, you can resume the build with the command
[ERROR]   mvn <goals> -rf :gs-gwc
Build step 'Invoke top-level Maven targets' marked build as failure
Not sending mail to unregistered user [hidden email]


_______________________________________________
Geoserver-devel mailing list
[hidden email]
https://lists.sourceforge.net/lists/listinfo/geoserver-devel
Reply | Threaded
Open this post in threaded view
|

Jenkins build is back to normal : geoserver-2.15.x-java11 #163

Jenkins-2