Build failed in Jenkins: geoserver-2.15.x #448

classic Classic list List threaded Threaded
2 messages Options
Reply | Threaded
Open this post in threaded view
|

Build failed in Jenkins: geoserver-2.15.x #448

Jenkins-2
See <https://build.geoserver.org/job/geoserver-2.15.x/448/display/redirect?page=changes>

Changes:

[gabriel.roldan] Fix data/minimal/styles/generic.xml pointing at generic.sld instead of

------------------------------------------
[...truncated 1.29 MB...]
[INFO] --- maven-surefire-plugin:2.12.3:test (default-test) @ gs-importer-web ---
[INFO] Surefire report directory: <https://build.geoserver.org/job/geoserver-2.15.x/ws/src/extension/importer/web/target/surefire-reports>

-------------------------------------------------------
 T E S T S
-------------------------------------------------------
Running org.geoserver.importer.web.AbstractDBPanelTest
Tests run: 1, Failures: 0, Errors: 0, Skipped: 0, Time elapsed: 0.936 sec
Running org.geoserver.importer.web.ImportTaskTableTest
Tests run: 2, Failures: 0, Errors: 0, Skipped: 0, Time elapsed: 6.641 sec

Results :

Tests run: 3, Failures: 0, Errors: 0, Skipped: 0

[INFO]
[INFO] --- maven-jar-plugin:2.4:jar (default-jar) @ gs-importer-web ---
[INFO] Building jar: <https://build.geoserver.org/job/geoserver-2.15.x/ws/src/extension/importer/web/target/gs-importer-web-2.15-SNAPSHOT.jar>
[INFO]
[INFO] --- maven-jar-plugin:2.4:test-jar (default) @ gs-importer-web ---
[INFO] Building jar: <https://build.geoserver.org/job/geoserver-2.15.x/ws/src/extension/importer/web/target/gs-importer-web-2.15-SNAPSHOT-tests.jar>
[INFO]
[INFO] --- maven-source-plugin:2.2.1:jar-no-fork (attach-sources) @ gs-importer-web ---
[INFO] Building jar: <https://build.geoserver.org/job/geoserver-2.15.x/ws/src/extension/importer/web/target/gs-importer-web-2.15-SNAPSHOT-sources.jar>
[INFO]
[INFO] --- maven-source-plugin:2.2.1:test-jar-no-fork (attach-sources) @ gs-importer-web ---
[INFO] Building jar: <https://build.geoserver.org/job/geoserver-2.15.x/ws/src/extension/importer/web/target/gs-importer-web-2.15-SNAPSHOT-test-sources.jar>
[INFO]
[INFO] --- fmt-maven-plugin:2.4.0:check (default) @ gs-importer-web ---
[debug] Using AOSP style
[INFO] Processed 35 files (0 non-complying).
[INFO]
[INFO] --- maven-install-plugin:2.4:install (default-install) @ gs-importer-web ---
[INFO] Installing <https://build.geoserver.org/job/geoserver-2.15.x/ws/src/extension/importer/web/target/gs-importer-web-2.15-SNAPSHOT.jar> to /home/ubuntu/.m2/repository/org/geoserver/importer/gs-importer-web/2.15-SNAPSHOT/gs-importer-web-2.15-SNAPSHOT.jar
[INFO] Installing <https://build.geoserver.org/job/geoserver-2.15.x/ws/src/extension/importer/web/pom.xml> to /home/ubuntu/.m2/repository/org/geoserver/importer/gs-importer-web/2.15-SNAPSHOT/gs-importer-web-2.15-SNAPSHOT.pom
[INFO] Installing <https://build.geoserver.org/job/geoserver-2.15.x/ws/src/extension/importer/web/target/gs-importer-web-2.15-SNAPSHOT-tests.jar> to /home/ubuntu/.m2/repository/org/geoserver/importer/gs-importer-web/2.15-SNAPSHOT/gs-importer-web-2.15-SNAPSHOT-tests.jar
[INFO] Installing <https://build.geoserver.org/job/geoserver-2.15.x/ws/src/extension/importer/web/target/gs-importer-web-2.15-SNAPSHOT-sources.jar> to /home/ubuntu/.m2/repository/org/geoserver/importer/gs-importer-web/2.15-SNAPSHOT/gs-importer-web-2.15-SNAPSHOT-sources.jar
[INFO] Installing <https://build.geoserver.org/job/geoserver-2.15.x/ws/src/extension/importer/web/target/gs-importer-web-2.15-SNAPSHOT-test-sources.jar> to /home/ubuntu/.m2/repository/org/geoserver/importer/gs-importer-web/2.15-SNAPSHOT/gs-importer-web-2.15-SNAPSHOT-test-sources.jar
[INFO]
[INFO] ---------------< org.geoserver.security:gs-web-sec-cas >----------------
[INFO] Building GeoServer CAS Security Web Module 2.15-SNAPSHOT         [94/99]
[INFO] --------------------------------[ jar ]---------------------------------
[INFO]
[INFO] --- maven-clean-plugin:2.5:clean (default-clean) @ gs-web-sec-cas ---
[INFO]
[INFO] --- git-commit-id-plugin:2.1.15:revision (default) @ gs-web-sec-cas ---
[INFO]
[INFO] --- directory-maven-plugin:0.3.1:highest-basedir (directories) @ gs-web-sec-cas ---
[INFO] Highest basedir set to: <https://build.geoserver.org/job/geoserver-2.15.x/ws/src>
[INFO]
[INFO] --- maven-resources-plugin:2.6:resources (default-resources) @ gs-web-sec-cas ---
[INFO] Using 'UTF-8' encoding to copy filtered resources.
[INFO] Copying 2 resources
[INFO] skip non existing resourceDirectory <https://build.geoserver.org/job/geoserver-2.15.x/ws/src/extension/security/web/web-cas/src/main/resources>
[INFO]
[INFO] --- maven-compiler-plugin:3.8.0:compile (default-compile) @ gs-web-sec-cas ---
[INFO] Changes detected - recompiling the module!
[INFO] Compiling 2 source files to <https://build.geoserver.org/job/geoserver-2.15.x/ws/src/extension/security/web/web-cas/target/classes>
[INFO]
[INFO] --- maven-resources-plugin:2.6:testResources (default-testResources) @ gs-web-sec-cas ---
[INFO] Using 'UTF-8' encoding to copy filtered resources.
[INFO] skip non existing resourceDirectory <https://build.geoserver.org/job/geoserver-2.15.x/ws/src/extension/security/web/web-cas/src/test/java>
[INFO] skip non existing resourceDirectory <https://build.geoserver.org/job/geoserver-2.15.x/ws/src/extension/security/web/web-cas/src/test/resources>
[INFO]
[INFO] --- maven-compiler-plugin:3.8.0:testCompile (default-testCompile) @ gs-web-sec-cas ---
[INFO] No sources to compile
[INFO]
[INFO] --- maven-surefire-plugin:2.12.3:test (default-test) @ gs-web-sec-cas ---
[INFO] No tests to run.
[INFO]
[INFO] --- maven-jar-plugin:2.4:jar (default-jar) @ gs-web-sec-cas ---
[INFO] Building jar: <https://build.geoserver.org/job/geoserver-2.15.x/ws/src/extension/security/web/web-cas/target/gs-web-sec-cas-2.15-SNAPSHOT.jar>
[INFO]
[INFO] --- maven-jar-plugin:2.4:test-jar (default) @ gs-web-sec-cas ---
[WARNING] JAR will be empty - no content was marked for inclusion!
[INFO] Building jar: <https://build.geoserver.org/job/geoserver-2.15.x/ws/src/extension/security/web/web-cas/target/gs-web-sec-cas-2.15-SNAPSHOT-tests.jar>
[INFO]
[INFO] --- maven-source-plugin:2.2.1:jar-no-fork (attach-sources) @ gs-web-sec-cas ---
[INFO] Building jar: <https://build.geoserver.org/job/geoserver-2.15.x/ws/src/extension/security/web/web-cas/target/gs-web-sec-cas-2.15-SNAPSHOT-sources.jar>
[INFO]
[INFO] --- maven-source-plugin:2.2.1:test-jar-no-fork (attach-sources) @ gs-web-sec-cas ---
[INFO] No sources in project. Archive not created.
[INFO]
[INFO] --- fmt-maven-plugin:2.4.0:check (default) @ gs-web-sec-cas ---
[warn] Test source directory '<https://build.geoserver.org/job/geoserver-2.15.x/ws/src/extension/security/web/web-cas/src/test/java'> does not exist, ignoring.
[debug] Using AOSP style
[INFO] Processed 2 files (0 non-complying).
[INFO]
[INFO] --- maven-install-plugin:2.4:install (default-install) @ gs-web-sec-cas ---
[INFO] Installing <https://build.geoserver.org/job/geoserver-2.15.x/ws/src/extension/security/web/web-cas/target/gs-web-sec-cas-2.15-SNAPSHOT.jar> to /home/ubuntu/.m2/repository/org/geoserver/security/gs-web-sec-cas/2.15-SNAPSHOT/gs-web-sec-cas-2.15-SNAPSHOT.jar
[INFO] Installing <https://build.geoserver.org/job/geoserver-2.15.x/ws/src/extension/security/web/web-cas/pom.xml> to /home/ubuntu/.m2/repository/org/geoserver/security/gs-web-sec-cas/2.15-SNAPSHOT/gs-web-sec-cas-2.15-SNAPSHOT.pom
[INFO] Installing <https://build.geoserver.org/job/geoserver-2.15.x/ws/src/extension/security/web/web-cas/target/gs-web-sec-cas-2.15-SNAPSHOT-tests.jar> to /home/ubuntu/.m2/repository/org/geoserver/security/gs-web-sec-cas/2.15-SNAPSHOT/gs-web-sec-cas-2.15-SNAPSHOT-tests.jar
[INFO] Installing <https://build.geoserver.org/job/geoserver-2.15.x/ws/src/extension/security/web/web-cas/target/gs-web-sec-cas-2.15-SNAPSHOT-sources.jar> to /home/ubuntu/.m2/repository/org/geoserver/security/gs-web-sec-cas/2.15-SNAPSHOT/gs-web-sec-cas-2.15-SNAPSHOT-sources.jar
Tests run: 12, Failures: 0, Errors: 0, Skipped: 0, Time elapsed: 56.256 sec
Running org.geoserver.importer.bdb.SerialVersionSafeSerialBindingTest
Tests run: 1, Failures: 0, Errors: 0, Skipped: 0, Time elapsed: 0.668 sec
Running org.geoserver.importer.bdb.XStreamInfoSerialBindingTest
Tests run: 2, Failures: 0, Errors: 0, Skipped: 0, Time elapsed: 3.31 sec

Results :

Tests run: 15, Failures: 0, Errors: 0, Skipped: 0

[INFO]
[INFO] --- maven-jar-plugin:2.4:jar (default-jar) @ gs-importer-bdb ---
[INFO] Building jar: <https://build.geoserver.org/job/geoserver-2.15.x/ws/src/extension/importer/bdb/target/gs-importer-bdb-2.15-SNAPSHOT.jar>
[INFO]
[INFO] --- maven-jar-plugin:2.4:test-jar (default) @ gs-importer-bdb ---
[INFO] Building jar: <https://build.geoserver.org/job/geoserver-2.15.x/ws/src/extension/importer/bdb/target/gs-importer-bdb-2.15-SNAPSHOT-tests.jar>
[INFO]
[INFO] --- maven-source-plugin:2.2.1:jar-no-fork (attach-sources) @ gs-importer-bdb ---
[INFO] Building jar: <https://build.geoserver.org/job/geoserver-2.15.x/ws/src/extension/importer/bdb/target/gs-importer-bdb-2.15-SNAPSHOT-sources.jar>
[INFO]
[INFO] --- maven-source-plugin:2.2.1:test-jar-no-fork (attach-sources) @ gs-importer-bdb ---
[INFO] Building jar: <https://build.geoserver.org/job/geoserver-2.15.x/ws/src/extension/importer/bdb/target/gs-importer-bdb-2.15-SNAPSHOT-test-sources.jar>
[INFO]
[INFO] --- fmt-maven-plugin:2.4.0:check (default) @ gs-importer-bdb ---
[debug] Using AOSP style
[INFO] Processed 8 files (0 non-complying).
[INFO]
[INFO] --- maven-install-plugin:2.4:install (default-install) @ gs-importer-bdb ---
[INFO] Installing <https://build.geoserver.org/job/geoserver-2.15.x/ws/src/extension/importer/bdb/target/gs-importer-bdb-2.15-SNAPSHOT.jar> to /home/ubuntu/.m2/repository/org/geoserver/importer/gs-importer-bdb/2.15-SNAPSHOT/gs-importer-bdb-2.15-SNAPSHOT.jar
[INFO] Installing <https://build.geoserver.org/job/geoserver-2.15.x/ws/src/extension/importer/bdb/pom.xml> to /home/ubuntu/.m2/repository/org/geoserver/importer/gs-importer-bdb/2.15-SNAPSHOT/gs-importer-bdb-2.15-SNAPSHOT.pom
[INFO] Installing <https://build.geoserver.org/job/geoserver-2.15.x/ws/src/extension/importer/bdb/target/gs-importer-bdb-2.15-SNAPSHOT-tests.jar> to /home/ubuntu/.m2/repository/org/geoserver/importer/gs-importer-bdb/2.15-SNAPSHOT/gs-importer-bdb-2.15-SNAPSHOT-tests.jar
[INFO] Installing <https://build.geoserver.org/job/geoserver-2.15.x/ws/src/extension/importer/bdb/target/gs-importer-bdb-2.15-SNAPSHOT-sources.jar> to /home/ubuntu/.m2/repository/org/geoserver/importer/gs-importer-bdb/2.15-SNAPSHOT/gs-importer-bdb-2.15-SNAPSHOT-sources.jar
[INFO] Installing <https://build.geoserver.org/job/geoserver-2.15.x/ws/src/extension/importer/bdb/target/gs-importer-bdb-2.15-SNAPSHOT-test-sources.jar> to /home/ubuntu/.m2/repository/org/geoserver/importer/gs-importer-bdb/2.15-SNAPSHOT/gs-importer-bdb-2.15-SNAPSHOT-test-sources.jar
[INFO] ------------------------------------------------------------------------
[INFO] Reactor Summary for GeoServer 2.15-SNAPSHOT:
[INFO]
[INFO] GeoServer .......................................... SUCCESS [  4.802 s]
[INFO] Core Platform Module ............................... SUCCESS [ 10.235 s]
[INFO] Open Web Service Module ............................ SUCCESS [  9.425 s]
[INFO] Main Module ........................................ SUCCESS [ 55.074 s]
[INFO] GeoServer Security Modules ......................... SUCCESS [  0.065 s]
[INFO] GeoServer Security Tests Module .................... SUCCESS [01:20 min]
[INFO] GeoServer JDBC Security Module ..................... SUCCESS [ 38.265 s]
[INFO] GeoServer LDAP Security Module ..................... SUCCESS [  1.726 s]
[INFO] Web Coverage Service Module ........................ SUCCESS [  0.599 s]
[INFO] Web Coverage Service 1.0 Module .................... SUCCESS [ 11.123 s]
[INFO] Web Coverage Service 1.1 Module .................... SUCCESS [ 12.519 s]
[INFO] Web Coverage Service 2.0 Module .................... SUCCESS [ 54.646 s]
[INFO] Web Feature Service Module ......................... SUCCESS [01:03 min]
[INFO] Web Map Service Module ............................. SUCCESS [01:37 min]
[INFO] KML support for GeoServer .......................... SUCCESS [ 15.336 s]
[INFO] gs-rest ............................................ SUCCESS [  7.845 s]
[INFO] GeoWebCache (GWC) Module ........................... FAILURE [01:22 min]
[INFO] gs-restconfig ...................................... SUCCESS [01:22 min]
[INFO] gs-restconfig-wcs .................................. SUCCESS [  9.488 s]
[INFO] gs-restconfig-wfs .................................. SUCCESS [ 10.981 s]
[INFO] gs-restconfig-wms .................................. SUCCESS [  8.515 s]
[INFO] GeoServer Web Modules .............................. SUCCESS [  0.061 s]
[INFO] Core UI Module ..................................... SUCCESS [ 46.721 s]
[INFO] WMS UI Module ...................................... SUCCESS [ 50.659 s]
[INFO] GWC UI Module ...................................... SKIPPED
[INFO] WFS UI Module ...................................... SUCCESS [  5.862 s]
[INFO] Demos Module ....................................... SUCCESS [02:25 min]
[INFO] WCS UI Module ...................................... SUCCESS [  8.419 s]
[INFO] Security UI Modules ................................ SUCCESS [  0.037 s]
[INFO] Security UI Core Module ............................ SUCCESS [01:00 min]
[INFO] Security UI JDBC Module ............................ SUCCESS [01:38 min]
[INFO] Security UI LDAP Module ............................ SUCCESS [  6.718 s]
[INFO] REST UI Module ..................................... SUCCESS [  5.758 s]
[INFO] GeoServer Extensions ............................... SUCCESS [  0.033 s]
[INFO] Printing Module .................................... SUCCESS [  6.551 s]
[INFO] GeoServer Web Application .......................... SKIPPED
[INFO] Community Space .................................... SUCCESS [  0.024 s]
[INFO] Application Schema Support ......................... SUCCESS [  0.026 s]
[INFO] Application Schema Integration Test ................ SUCCESS [02:29 min]
[INFO] Sample DataAccess Integration Test ................. SUCCESS [  6.454 s]
[INFO] ArcSDE DataStore Extension ......................... SUCCESS [  5.937 s]
[INFO] H2 DataStore Extension ............................. SUCCESS [  6.066 s]
[INFO] SQL Server DataStore Extension ..................... SUCCESS [  0.848 s]
[INFO] Oracle DataStore Extension ......................... SUCCESS [  0.810 s]
[INFO] MySQL DataStore Extension .......................... SUCCESS [  0.316 s]
[INFO] DB2 DataStore Extension ............................ SUCCESS [  0.303 s]
[INFO] ImageMap Output Format ............................. SUCCESS [  3.078 s]
[INFO] ImageI/O-Ext GDAL Coverage Extension ............... SUCCESS [  2.474 s]
[INFO] JP2K Coverage Extension ............................ SUCCESS [  0.339 s]
[INFO] OGR parent ......................................... SUCCESS [  0.082 s]
[INFO] OGR CORE ........................................... SUCCESS [  0.269 s]
[INFO] OGR WFS ............................................ SUCCESS [  4.289 s]
[INFO] Web Processing Service parent ...................... SUCCESS [  0.037 s]
[INFO] Web Processing Service Module ...................... SUCCESS [01:10 min]
[INFO] OGR WPS ............................................ SUCCESS [  5.922 s]
[INFO] Excel Output Format ................................ SUCCESS [  7.251 s]
[INFO] Chart external graphics support .................... SUCCESS [  0.522 s]
[INFO] Feature Generalization Extension ................... SUCCESS [  0.462 s]
[INFO] Image Mosaic JDBC Extension ........................ SUCCESS [  0.576 s]
[INFO] OWS request flow controller ........................ SUCCESS [ 10.344 s]
[INFO] Web process status sharing with Hazelcast .......... SUCCESS [  8.676 s]
[INFO] Web Processing Service GUI ......................... SUCCESS [ 21.300 s]
[INFO] GeoServer Layer Querying filter functions .......... SUCCESS [  8.164 s]
[INFO] Teradata DataStore Extension ....................... SUCCESS [  0.477 s]
[INFO] GeoServer Monitor Extensions ....................... SUCCESS [  0.056 s]
[INFO] Core Monitor Extension ............................. SKIPPED
[INFO] GeoServer Security Extension Modules ............... SUCCESS [  0.037 s]
[INFO] GeoServer CAS Security Module ...................... SUCCESS [  2.520 s]
[INFO] GeoServer Security Extension Web Modules ........... SUCCESS [  0.038 s]
[INFO] GeoServer CAS Security Web Module .................. SUCCESS [  0.303 s]
[INFO] XLST based WFS output format ....................... SUCCESS [ 11.253 s]
[INFO] GeoServer INSPIRE Extensions ....................... SKIPPED
[INFO] GeoServer CSS Styling .............................. SUCCESS [ 11.155 s]
[INFO] Catalog Services for the Web parent ................ SUCCESS [  0.028 s]
[INFO] Catalog Services for the Web interfaces ............ SUCCESS [  4.146 s]
[INFO] Catalog Services for the Web - Simple CatalogStore implementation SUCCESS [  4.157 s]
[INFO] Catalog Services for the Web core module ........... SUCCESS [01:56 min]
[INFO] CSW UI Module ...................................... SUCCESS [  6.976 s]
[INFO] DXF WFS output format and WPS PPIO ................. SUCCESS [  0.069 s]
[INFO] DXF WFS output format .............................. SUCCESS [  6.518 s]
[INFO] DXF WPS PPIO ....................................... SUCCESS [  6.501 s]
[INFO] GeoServer WCS 2.0 Earth Observation Extensions ..... SUCCESS [  0.043 s]
[INFO] Web Coverage Service 2.0 Earth Observation extensions SUCCESS [ 12.866 s]
[INFO] Web Coverage Service 2.0 Earth Observation GUI extension SUCCESS [ 37.477 s]
[INFO] GeoServer libjpeg-turbo Module ..................... SUCCESS [  5.314 s]
[INFO] GeoServer Data Importer ............................ SUCCESS [  0.039 s]
[INFO] Importer Core Module ............................... SUCCESS [ 31.703 s]
[INFO] Importer REST Api Module-ng ........................ SUCCESS [ 34.724 s]
[INFO] Importer Berkley DB Persistence Module ............. SUCCESS [01:01 min]
[INFO] Importer Web UI Module ............................. SUCCESS [  9.241 s]
[INFO] GRIB Coverage Format ............................... SUCCESS [  9.249 s]
[INFO] NetCDF Coverage format ............................. SUCCESS [02:26 min]
[INFO] WCS NetCDF output Module ........................... SUCCESS [ 49.244 s]
[INFO] Vector Tiles ....................................... SUCCESS [  8.438 s]
[INFO] Ysld GeoServer Plugin .............................. SKIPPED
[INFO] MongoDB Data Store ................................. SUCCESS [  1.638 s]
[INFO] REST SLD service ................................... SUCCESS [01:48 min]
[INFO] GeoFence security integration ...................... SUCCESS [ 56.084 s]
[INFO] GeoFence Server .................................... SUCCESS [ 38.017 s]
[INFO] ------------------------------------------------------------------------
[INFO] BUILD FAILURE
[INFO] ------------------------------------------------------------------------
[INFO] Total time:  19:14 min (Wall Clock)
[INFO] Finished at: 2019-06-13T18:59:39Z
[INFO] ------------------------------------------------------------------------
[ERROR] Failed to execute goal org.apache.maven.plugins:maven-surefire-plugin:2.12.3:test (default-test) on project gs-gwc: There are test failures.
[ERROR]
[ERROR] Please refer to <https://build.geoserver.org/job/geoserver-2.15.x/ws/src/gwc/target/surefire-reports> for the individual test results.
[ERROR] -> [Help 1]
[ERROR]
[ERROR] To see the full stack trace of the errors, re-run Maven with the -e switch.
[ERROR] Re-run Maven using the -X switch to enable full debug logging.
[ERROR]
[ERROR] For more information about the errors and possible solutions, please read the following articles:
[ERROR] [Help 1] http://cwiki.apache.org/confluence/display/MAVEN/MojoFailureException
[ERROR]
[ERROR] After correcting the problems, you can resume the build with the command
[ERROR]   mvn <goals> -rf :gs-gwc
Build step 'Invoke top-level Maven targets' marked build as failure
Not sending mail to unregistered user [hidden email]


_______________________________________________
Geoserver-devel mailing list
[hidden email]
https://lists.sourceforge.net/lists/listinfo/geoserver-devel
Reply | Threaded
Open this post in threaded view
|

Jenkins build is back to normal : geoserver-2.15.x #449

Jenkins-2