Build failed in Jenkins: geoserver-2.14.x #587

classic Classic list List threaded Threaded
3 messages Options
Reply | Threaded
Open this post in threaded view
|

Build failed in Jenkins: geoserver-2.14.x #587

Jenkins-2
See <https://build.geoserver.org/job/geoserver-2.14.x/587/display/redirect?page=changes>

Changes:

[Alessio Fabiani] [community module AuthKey] - Allows the REST service to inject

------------------------------------------
[...truncated 1.72 MB...]
        at org.junit.internal.runners.statements.RunAfters.evaluate(RunAfters.java:27)
        at org.junit.runners.ParentRunner.run(ParentRunner.java:309)
        at org.apache.maven.surefire.junit4.JUnit4Provider.execute(JUnit4Provider.java:252)
        at org.apache.maven.surefire.junit4.JUnit4Provider.executeTestSet(JUnit4Provider.java:141)
        at org.apache.maven.surefire.junit4.JUnit4Provider.invoke(JUnit4Provider.java:112)
        at sun.reflect.NativeMethodAccessorImpl.invoke0(Native Method)
        at sun.reflect.NativeMethodAccessorImpl.invoke(NativeMethodAccessorImpl.java:62)
        at sun.reflect.DelegatingMethodAccessorImpl.invoke(DelegatingMethodAccessorImpl.java:43)
        at java.lang.reflect.Method.invoke(Method.java:498)
        at org.apache.maven.surefire.util.ReflectionUtils.invokeMethodWithArray(ReflectionUtils.java:189)
        at org.apache.maven.surefire.booter.ProviderFactory$ProviderProxy.invoke(ProviderFactory.java:165)
        at org.apache.maven.surefire.booter.ProviderFactory.invokeProvider(ProviderFactory.java:85)
        at org.apache.maven.surefire.booter.ForkedBooter.runSuitesInProcess(ForkedBooter.java:115)
        at org.apache.maven.surefire.booter.ForkedBooter.main(ForkedBooter.java:75)

Tests run: 17, Failures: 0, Errors: 0, Skipped: 0, Time elapsed: 11.304 sec
Running org.geoserver.importer.rest.PostScriptTransformTest
Tests run: 1, Failures: 0, Errors: 0, Skipped: 0, Time elapsed: 0.005 sec
Running org.geoserver.importer.rest.converters.ImportJSONIOTest
Tests run: 4, Failures: 0, Errors: 0, Skipped: 0, Time elapsed: 0.714 sec

Results :

Tests run: 76, Failures: 0, Errors: 0, Skipped: 0

[INFO]
[INFO] --- maven-jar-plugin:2.4:jar (default-jar) @ gs-importer-rest ---
[INFO] Building jar: <https://build.geoserver.org/job/geoserver-2.14.x/ws/src/extension/importer/rest/target/gs-importer-rest-2.14-SNAPSHOT.jar>
[INFO]
[INFO] --- maven-jar-plugin:2.4:test-jar (default) @ gs-importer-rest ---
[INFO] Building jar: <https://build.geoserver.org/job/geoserver-2.14.x/ws/src/extension/importer/rest/target/gs-importer-rest-2.14-SNAPSHOT-tests.jar>
[INFO]
[INFO] --- maven-source-plugin:2.2.1:jar-no-fork (attach-sources) @ gs-importer-rest ---
[INFO] Building jar: <https://build.geoserver.org/job/geoserver-2.14.x/ws/src/extension/importer/rest/target/gs-importer-rest-2.14-SNAPSHOT-sources.jar>
[INFO]
[INFO] --- maven-source-plugin:2.2.1:test-jar-no-fork (attach-sources) @ gs-importer-rest ---
[INFO] Building jar: <https://build.geoserver.org/job/geoserver-2.14.x/ws/src/extension/importer/rest/target/gs-importer-rest-2.14-SNAPSHOT-test-sources.jar>
[INFO]
[INFO] --- fmt-maven-plugin:2.4.0:check (default) @ gs-importer-rest ---
[debug] Using AOSP style
[INFO] Processed 31 files (0 non-complying).
[INFO]
[INFO] --- maven-install-plugin:2.4:install (default-install) @ gs-importer-rest ---
[INFO] Installing <https://build.geoserver.org/job/geoserver-2.14.x/ws/src/extension/importer/rest/target/gs-importer-rest-2.14-SNAPSHOT.jar> to /home/ubuntu/.m2/repository/org/geoserver/importer/gs-importer-rest/2.14-SNAPSHOT/gs-importer-rest-2.14-SNAPSHOT.jar
[INFO] Installing <https://build.geoserver.org/job/geoserver-2.14.x/ws/src/extension/importer/rest/pom.xml> to /home/ubuntu/.m2/repository/org/geoserver/importer/gs-importer-rest/2.14-SNAPSHOT/gs-importer-rest-2.14-SNAPSHOT.pom
[INFO] Installing <https://build.geoserver.org/job/geoserver-2.14.x/ws/src/extension/importer/rest/target/gs-importer-rest-2.14-SNAPSHOT-tests.jar> to /home/ubuntu/.m2/repository/org/geoserver/importer/gs-importer-rest/2.14-SNAPSHOT/gs-importer-rest-2.14-SNAPSHOT-tests.jar
[INFO] Installing <https://build.geoserver.org/job/geoserver-2.14.x/ws/src/extension/importer/rest/target/gs-importer-rest-2.14-SNAPSHOT-sources.jar> to /home/ubuntu/.m2/repository/org/geoserver/importer/gs-importer-rest/2.14-SNAPSHOT/gs-importer-rest-2.14-SNAPSHOT-sources.jar
[INFO] Installing <https://build.geoserver.org/job/geoserver-2.14.x/ws/src/extension/importer/rest/target/gs-importer-rest-2.14-SNAPSHOT-test-sources.jar> to /home/ubuntu/.m2/repository/org/geoserver/importer/gs-importer-rest/2.14-SNAPSHOT/gs-importer-rest-2.14-SNAPSHOT-test-sources.jar
[INFO]
[INFO] ---------------< org.geoserver.security:gs-web-sec-cas >----------------
[INFO] Building GeoServer CAS Security Web Module 2.14-SNAPSHOT         [91/96]
[INFO] --------------------------------[ jar ]---------------------------------
[INFO]
[INFO] --- maven-clean-plugin:2.5:clean (default-clean) @ gs-web-sec-cas ---
[INFO]
[INFO] --- git-commit-id-plugin:2.1.15:revision (default) @ gs-web-sec-cas ---
[INFO]
[INFO] --- maven-resources-plugin:2.6:resources (default-resources) @ gs-web-sec-cas ---
[INFO] Using 'UTF-8' encoding to copy filtered resources.
[INFO] Copying 2 resources
[INFO] skip non existing resourceDirectory <https://build.geoserver.org/job/geoserver-2.14.x/ws/src/extension/security/web/web-cas/src/main/resources>
[INFO]
[INFO] --- maven-compiler-plugin:2.3.2:compile (default-compile) @ gs-web-sec-cas ---
[INFO] Compiling 2 source files to <https://build.geoserver.org/job/geoserver-2.14.x/ws/src/extension/security/web/web-cas/target/classes>
[INFO]
[INFO] --- maven-resources-plugin:2.6:testResources (default-testResources) @ gs-web-sec-cas ---
[INFO] Using 'UTF-8' encoding to copy filtered resources.
[INFO] skip non existing resourceDirectory <https://build.geoserver.org/job/geoserver-2.14.x/ws/src/extension/security/web/web-cas/src/test/java>
[INFO] skip non existing resourceDirectory <https://build.geoserver.org/job/geoserver-2.14.x/ws/src/extension/security/web/web-cas/src/test/resources>
[INFO]
[INFO] --- maven-compiler-plugin:2.3.2:testCompile (default-testCompile) @ gs-web-sec-cas ---
[INFO] No sources to compile
[INFO]
[INFO] --- maven-surefire-plugin:2.12.3:test (default-test) @ gs-web-sec-cas ---
[INFO] No tests to run.
[INFO]
[INFO] --- maven-jar-plugin:2.4:jar (default-jar) @ gs-web-sec-cas ---
[INFO] Building jar: <https://build.geoserver.org/job/geoserver-2.14.x/ws/src/extension/security/web/web-cas/target/gs-web-sec-cas-2.14-SNAPSHOT.jar>
[INFO]
[INFO] --- maven-jar-plugin:2.4:test-jar (default) @ gs-web-sec-cas ---
[WARNING] JAR will be empty - no content was marked for inclusion!
[INFO] Building jar: <https://build.geoserver.org/job/geoserver-2.14.x/ws/src/extension/security/web/web-cas/target/gs-web-sec-cas-2.14-SNAPSHOT-tests.jar>
[INFO]
[INFO] --- maven-source-plugin:2.2.1:jar-no-fork (attach-sources) @ gs-web-sec-cas ---
[INFO] Building jar: <https://build.geoserver.org/job/geoserver-2.14.x/ws/src/extension/security/web/web-cas/target/gs-web-sec-cas-2.14-SNAPSHOT-sources.jar>
[INFO]
[INFO] --- maven-source-plugin:2.2.1:test-jar-no-fork (attach-sources) @ gs-web-sec-cas ---
[INFO] No sources in project. Archive not created.
[INFO]
[INFO] --- fmt-maven-plugin:2.4.0:check (default) @ gs-web-sec-cas ---
[warn] Test source directory '<https://build.geoserver.org/job/geoserver-2.14.x/ws/src/extension/security/web/web-cas/src/test/java'> does not exist, ignoring.
[debug] Using AOSP style
[INFO] Processed 2 files (0 non-complying).
[INFO]
[INFO] --- maven-install-plugin:2.4:install (default-install) @ gs-web-sec-cas ---
[INFO] Installing <https://build.geoserver.org/job/geoserver-2.14.x/ws/src/extension/security/web/web-cas/target/gs-web-sec-cas-2.14-SNAPSHOT.jar> to /home/ubuntu/.m2/repository/org/geoserver/security/gs-web-sec-cas/2.14-SNAPSHOT/gs-web-sec-cas-2.14-SNAPSHOT.jar
[INFO] Installing <https://build.geoserver.org/job/geoserver-2.14.x/ws/src/extension/security/web/web-cas/pom.xml> to /home/ubuntu/.m2/repository/org/geoserver/security/gs-web-sec-cas/2.14-SNAPSHOT/gs-web-sec-cas-2.14-SNAPSHOT.pom
[INFO] Installing <https://build.geoserver.org/job/geoserver-2.14.x/ws/src/extension/security/web/web-cas/target/gs-web-sec-cas-2.14-SNAPSHOT-tests.jar> to /home/ubuntu/.m2/repository/org/geoserver/security/gs-web-sec-cas/2.14-SNAPSHOT/gs-web-sec-cas-2.14-SNAPSHOT-tests.jar
[INFO] Installing <https://build.geoserver.org/job/geoserver-2.14.x/ws/src/extension/security/web/web-cas/target/gs-web-sec-cas-2.14-SNAPSHOT-sources.jar> to /home/ubuntu/.m2/repository/org/geoserver/security/gs-web-sec-cas/2.14-SNAPSHOT/gs-web-sec-cas-2.14-SNAPSHOT-sources.jar
Tests run: 1, Failures: 0, Errors: 0, Skipped: 0, Time elapsed: 112.433 sec

Results :

Tests run: 1, Failures: 0, Errors: 0, Skipped: 0

[INFO]
[INFO] --- maven-jar-plugin:2.4:jar (default-jar) @ gs-web-csw ---
[INFO] Building jar: <https://build.geoserver.org/job/geoserver-2.14.x/ws/src/extension/csw/web-csw/target/gs-web-csw-2.14-SNAPSHOT.jar>
[INFO]
[INFO] --- maven-jar-plugin:2.4:test-jar (default) @ gs-web-csw ---
[INFO] Building jar: <https://build.geoserver.org/job/geoserver-2.14.x/ws/src/extension/csw/web-csw/target/gs-web-csw-2.14-SNAPSHOT-tests.jar>
[INFO]
[INFO] --- maven-source-plugin:2.2.1:jar-no-fork (attach-sources) @ gs-web-csw ---
[INFO] Building jar: <https://build.geoserver.org/job/geoserver-2.14.x/ws/src/extension/csw/web-csw/target/gs-web-csw-2.14-SNAPSHOT-sources.jar>
[INFO]
[INFO] --- maven-source-plugin:2.2.1:test-jar-no-fork (attach-sources) @ gs-web-csw ---
[INFO] Building jar: <https://build.geoserver.org/job/geoserver-2.14.x/ws/src/extension/csw/web-csw/target/gs-web-csw-2.14-SNAPSHOT-test-sources.jar>
[INFO]
[INFO] --- fmt-maven-plugin:2.4.0:check (default) @ gs-web-csw ---
[debug] Using AOSP style
[INFO] Processed 3 files (0 non-complying).
[INFO]
[INFO] --- maven-install-plugin:2.4:install (default-install) @ gs-web-csw ---
[INFO] Installing <https://build.geoserver.org/job/geoserver-2.14.x/ws/src/extension/csw/web-csw/target/gs-web-csw-2.14-SNAPSHOT.jar> to /home/ubuntu/.m2/repository/org/geoserver/csw/gs-web-csw/2.14-SNAPSHOT/gs-web-csw-2.14-SNAPSHOT.jar
[INFO] Installing <https://build.geoserver.org/job/geoserver-2.14.x/ws/src/extension/csw/web-csw/pom.xml> to /home/ubuntu/.m2/repository/org/geoserver/csw/gs-web-csw/2.14-SNAPSHOT/gs-web-csw-2.14-SNAPSHOT.pom
[INFO] Installing <https://build.geoserver.org/job/geoserver-2.14.x/ws/src/extension/csw/web-csw/target/gs-web-csw-2.14-SNAPSHOT-tests.jar> to /home/ubuntu/.m2/repository/org/geoserver/csw/gs-web-csw/2.14-SNAPSHOT/gs-web-csw-2.14-SNAPSHOT-tests.jar
[INFO] Installing <https://build.geoserver.org/job/geoserver-2.14.x/ws/src/extension/csw/web-csw/target/gs-web-csw-2.14-SNAPSHOT-sources.jar> to /home/ubuntu/.m2/repository/org/geoserver/csw/gs-web-csw/2.14-SNAPSHOT/gs-web-csw-2.14-SNAPSHOT-sources.jar
[INFO] Installing <https://build.geoserver.org/job/geoserver-2.14.x/ws/src/extension/csw/web-csw/target/gs-web-csw-2.14-SNAPSHOT-test-sources.jar> to /home/ubuntu/.m2/repository/org/geoserver/csw/gs-web-csw/2.14-SNAPSHOT/gs-web-csw-2.14-SNAPSHOT-test-sources.jar
[INFO] ------------------------------------------------------------------------
[INFO] Reactor Summary for GeoServer 2.14-SNAPSHOT:
[INFO]
[INFO] GeoServer .......................................... SUCCESS [ 22.912 s]
[INFO] Core Platform Module ............................... SUCCESS [ 22.474 s]
[INFO] Open Web Service Module ............................ SUCCESS [ 15.482 s]
[INFO] Main Module ........................................ SUCCESS [01:12 min]
[INFO] GeoServer Security Modules ......................... SUCCESS [  0.035 s]
[INFO] GeoServer Security Tests Module .................... SUCCESS [01:32 min]
[INFO] GeoServer JDBC Security Module ..................... SUCCESS [ 40.026 s]
[INFO] GeoServer LDAP Security Module ..................... SUCCESS [ 28.139 s]
[INFO] Web Coverage Service Module ........................ SUCCESS [  1.681 s]
[INFO] Web Coverage Service 1.0 Module .................... SUCCESS [ 12.886 s]
[INFO] Web Coverage Service 1.1 Module .................... SUCCESS [ 14.810 s]
[INFO] Web Coverage Service 2.0 Module .................... SUCCESS [01:01 min]
[INFO] Web Feature Service Module ......................... SUCCESS [01:08 min]
[INFO] Web Map Service Module ............................. SUCCESS [01:57 min]
[INFO] KML support for GeoServer .......................... SUCCESS [03:05 min]
[INFO] gs-rest ............................................ SUCCESS [ 10.181 s]
[INFO] GeoWebCache (GWC) Module ........................... FAILURE [09:04 min]
[INFO] gs-restconfig ...................................... SUCCESS [01:29 min]
[INFO] gs-restconfig-wcs .................................. SUCCESS [ 12.146 s]
[INFO] gs-restconfig-wfs .................................. SUCCESS [05:01 min]
[INFO] gs-restconfig-wms .................................. SUCCESS [05:29 min]
[INFO] GeoServer Web Modules .............................. SUCCESS [  0.081 s]
[INFO] Core UI Module ..................................... SUCCESS [ 58.336 s]
[INFO] WMS UI Module ...................................... SUCCESS [07:00 min]
[INFO] GWC UI Module ...................................... SKIPPED
[INFO] WFS UI Module ...................................... SUCCESS [  7.517 s]
[INFO] Demos Module ....................................... SUCCESS [05:48 min]
[INFO] WCS UI Module ...................................... SUCCESS [  8.402 s]
[INFO] Security UI Modules ................................ SUCCESS [  0.025 s]
[INFO] Security UI Core Module ............................ SUCCESS [04:23 min]
[INFO] Security UI JDBC Module ............................ SUCCESS [04:39 min]
[INFO] Security UI LDAP Module ............................ SUCCESS [05:38 min]
[INFO] REST UI Module ..................................... SUCCESS [  7.832 s]
[INFO] GeoServer Extensions ............................... SUCCESS [  0.022 s]
[INFO] Printing Module .................................... SUCCESS [ 26.475 s]
[INFO] GeoServer Web Application .......................... SKIPPED
[INFO] Community Space .................................... SUCCESS [  0.020 s]
[INFO] Application Schema Support ......................... SUCCESS [  0.017 s]
[INFO] Application Schema Integration Test ................ SUCCESS [01:48 min]
[INFO] Sample DataAccess Integration Test ................. SUCCESS [  7.450 s]
[INFO] ArcSDE DataStore Extension ......................... SUCCESS [  8.706 s]
[INFO] H2 DataStore Extension ............................. SUCCESS [  8.650 s]
[INFO] SQL Server DataStore Extension ..................... SUCCESS [  2.704 s]
[INFO] Oracle DataStore Extension ......................... SUCCESS [  0.467 s]
[INFO] MySQL DataStore Extension .......................... SUCCESS [  0.915 s]
[INFO] DB2 DataStore Extension ............................ SUCCESS [  0.246 s]
[INFO] ImageMap Output Format ............................. SUCCESS [  5.990 s]
[INFO] ImageI/O-Ext GDAL Coverage Extension ............... SUCCESS [  5.693 s]
[INFO] JP2K Coverage Extension ............................ SUCCESS [  0.360 s]
[INFO] OGR parent ......................................... SUCCESS [  0.012 s]
[INFO] OGR CORE ........................................... SUCCESS [  1.642 s]
[INFO] OGR WFS ............................................ SUCCESS [  5.827 s]
[INFO] Web Processing Service parent ...................... SUCCESS [  0.014 s]
[INFO] Web Processing Service Module ...................... SUCCESS [13:52 min]
[INFO] OGR WPS ............................................ SUCCESS [  6.434 s]
[INFO] Excel Output Format ................................ SUCCESS [ 11.921 s]
[INFO] Chart external graphics support .................... SUCCESS [  2.864 s]
[INFO] Feature Generalization Extension ................... SUCCESS [  1.621 s]
[INFO] Image Mosaic JDBC Extension ........................ SUCCESS [  1.643 s]
[INFO] OWS request flow controller ........................ SUCCESS [ 13.306 s]
[INFO] Web process status sharing with Hazelcast .......... SUCCESS [ 22.844 s]
[INFO] Web Processing Service GUI ......................... SUCCESS [ 30.990 s]
[INFO] GeoServer Layer Querying filter functions .......... SUCCESS [ 10.127 s]
[INFO] Teradata DataStore Extension ....................... FAILURE [01:42 min]
[INFO] GeoServer Monitor Extensions ....................... SUCCESS [  0.023 s]
[INFO] Core Monitor Extension ............................. SKIPPED
[INFO] GeoServer Security Extension Modules ............... SUCCESS [  0.023 s]
[INFO] GeoServer CAS Security Module ...................... SUCCESS [  6.788 s]
[INFO] GeoServer Security Extension Web Modules ........... SUCCESS [  0.022 s]
[INFO] GeoServer CAS Security Web Module .................. SUCCESS [  1.157 s]
[INFO] XLST based WFS output format ....................... SUCCESS [08:44 min]
[INFO] GeoServer INSPIRE Extensions ....................... SKIPPED
[INFO] GeoServer CSS Styling .............................. SUCCESS [ 18.920 s]
[INFO] Catalog Services for the Web parent ................ SUCCESS [  0.038 s]
[INFO] Catalog Services for the Web interfaces ............ SUCCESS [  7.964 s]
[INFO] Catalog Services for the Web - Simple CatalogStore implementation SUCCESS [  5.985 s]
[INFO] Catalog Services for the Web core module ........... SUCCESS [06:06 min]
[INFO] CSW UI Module ...................................... SUCCESS [01:54 min]
[INFO] DXF WFS output format and WPS PPIO ................. SUCCESS [  0.013 s]
[INFO] DXF WFS output format .............................. SUCCESS [  8.395 s]
[INFO] DXF WPS PPIO ....................................... SUCCESS [  5.561 s]
[INFO] GeoServer WCS 2.0 Earth Observation Extensions ..... SUCCESS [  0.012 s]
[INFO] Web Coverage Service 2.0 Earth Observation extensions SUCCESS [03:01 min]
[INFO] Web Coverage Service 2.0 Earth Observation GUI extension SUCCESS [05:50 min]
[INFO] GeoServer libjpeg-turbo Module ..................... SUCCESS [  6.346 s]
[INFO] GeoServer Data Importer ............................ SUCCESS [  7.229 s]
[INFO] Importer Core Module ............................... SUCCESS [ 28.568 s]
[INFO] Importer REST Api Module-ng ........................ SUCCESS [11:23 min]
[INFO] Importer Berkley DB Persistence Module ............. SUCCESS [10:52 min]
[INFO] Importer Web UI Module ............................. SUCCESS [ 15.969 s]
[INFO] GRIB Coverage Format ............................... SUCCESS [01:52 min]
[INFO] NetCDF Coverage format ............................. SUCCESS [ 14.290 s]
[INFO] WCS NetCDF output Module ........................... SUCCESS [ 53.616 s]
[INFO] Vector Tiles ....................................... SUCCESS [ 19.205 s]
[INFO] Ysld GeoServer Plugin .............................. SKIPPED
[INFO] MongoDB Data Store ................................. SUCCESS [  3.795 s]
[INFO] ------------------------------------------------------------------------
[INFO] BUILD FAILURE
[INFO] ------------------------------------------------------------------------
[INFO] Total time:  01:10 h (Wall Clock)
[INFO] Finished at: 2019-06-17T20:43:18Z
[INFO] ------------------------------------------------------------------------
[ERROR] Failed to execute goal on project gs-teradata: Could not resolve dependencies for project org.geoserver.extension:gs-teradata:jar:2.14-SNAPSHOT: Could not find artifact org.geotools.jdbc:gt-jdbc-teradata:jar:20-SNAPSHOT in boundless (https://repo.boundlessgeo.com/main/) -> [Help 1]
[ERROR] Failed to execute goal org.apache.maven.plugins:maven-surefire-plugin:2.12.3:test (default-test) on project gs-gwc: There are test failures.
[ERROR]
[ERROR] Please refer to <https://build.geoserver.org/job/geoserver-2.14.x/ws/src/gwc/target/surefire-reports> for the individual test results.
[ERROR] -> [Help 2]
[ERROR]
[ERROR] To see the full stack trace of the errors, re-run Maven with the -e switch.
[ERROR] Re-run Maven using the -X switch to enable full debug logging.
[ERROR]
[ERROR] For more information about the errors and possible solutions, please read the following articles:
[ERROR] [Help 1] http://cwiki.apache.org/confluence/display/MAVEN/DependencyResolutionException
[ERROR] [Help 2] http://cwiki.apache.org/confluence/display/MAVEN/MojoFailureException
[ERROR]
[ERROR] After correcting the problems, you can resume the build with the command
[ERROR]   mvn <goals> -rf :gs-teradata
Build step 'Invoke top-level Maven targets' marked build as failure


_______________________________________________
Geoserver-devel mailing list
[hidden email]
https://lists.sourceforge.net/lists/listinfo/geoserver-devel
Reply | Threaded
Open this post in threaded view
|

Build failed in Jenkins: geoserver-2.14.x #588

Jenkins-2
See <https://build.geoserver.org/job/geoserver-2.14.x/588/display/redirect?page=changes>

Changes:

[Torben Barsballe] Fix GWC RESTIntegration test to work after recent Spring MVC fix

------------------------------------------
[...truncated 1.81 MB...]
[INFO] Installing <https://build.geoserver.org/job/geoserver-2.14.x/ws/src/extension/security/web/web-cas/target/gs-web-sec-cas-2.14-SNAPSHOT.jar> to /home/ubuntu/.m2/repository/org/geoserver/security/gs-web-sec-cas/2.14-SNAPSHOT/gs-web-sec-cas-2.14-SNAPSHOT.jar
[INFO] Installing <https://build.geoserver.org/job/geoserver-2.14.x/ws/src/extension/security/web/web-cas/pom.xml> to /home/ubuntu/.m2/repository/org/geoserver/security/gs-web-sec-cas/2.14-SNAPSHOT/gs-web-sec-cas-2.14-SNAPSHOT.pom
[INFO] Installing <https://build.geoserver.org/job/geoserver-2.14.x/ws/src/extension/security/web/web-cas/target/gs-web-sec-cas-2.14-SNAPSHOT-tests.jar> to /home/ubuntu/.m2/repository/org/geoserver/security/gs-web-sec-cas/2.14-SNAPSHOT/gs-web-sec-cas-2.14-SNAPSHOT-tests.jar
[INFO] Installing <https://build.geoserver.org/job/geoserver-2.14.x/ws/src/extension/security/web/web-cas/target/gs-web-sec-cas-2.14-SNAPSHOT-sources.jar> to /home/ubuntu/.m2/repository/org/geoserver/security/gs-web-sec-cas/2.14-SNAPSHOT/gs-web-sec-cas-2.14-SNAPSHOT-sources.jar
[INFO]
[INFO] --- maven-surefire-plugin:2.12.3:test (default-test) @ gs-web-app ---
[INFO] Surefire report directory: <https://build.geoserver.org/job/geoserver-2.14.x/ws/src/web/app/target/surefire-reports>

-------------------------------------------------------
 T E S T S
-------------------------------------------------------
Running org.geoserver.filters.GZIPResponseStreamTest
Tests run: 1, Failures: 0, Errors: 0, Skipped: 0, Time elapsed: 0.055 sec
Running org.geoserver.web.WebXmlTest
Tests run: 1, Failures: 0, Errors: 0, Skipped: 0, Time elapsed: 0.124 sec

Results :

Tests run: 2, Failures: 0, Errors: 0, Skipped: 0

[INFO]
[INFO] --- maven-jar-plugin:2.4:jar (default-jar) @ gs-web-app ---
[WARNING] JAR will be empty - no content was marked for inclusion!
[INFO] Building jar: <https://build.geoserver.org/job/geoserver-2.14.x/ws/src/web/app/target/gs-web-app-2.14-SNAPSHOT.jar>
[INFO]
[INFO] --- maven-jar-plugin:2.4:test-jar (default) @ gs-web-app ---
[INFO] Building jar: <https://build.geoserver.org/job/geoserver-2.14.x/ws/src/web/app/target/gs-web-app-2.14-SNAPSHOT-tests.jar>
[INFO]
[INFO] --- maven-source-plugin:2.2.1:jar-no-fork (attach-sources) @ gs-web-app ---
[INFO] No sources in project. Archive not created.
[INFO]
[INFO] --- maven-source-plugin:2.2.1:test-jar-no-fork (attach-sources) @ gs-web-app ---
[INFO] Building jar: <https://build.geoserver.org/job/geoserver-2.14.x/ws/src/web/app/target/gs-web-app-2.14-SNAPSHOT-test-sources.jar>
[INFO]
[INFO] --- maven-antrun-plugin:1.7:run (configPackage) @ gs-web-app ---
[WARNING] Parameter tasks is deprecated, use target instead
[INFO] Executing tasks

main:
     [echo] Copying data dir from ../../../data/minimal
     [copy] Copying 29 files to <https://build.geoserver.org/job/geoserver-2.14.x/ws/src/web/app/src/main/webapp/data>
[INFO] Executed tasks
[INFO]
[INFO] --- maven-war-plugin:2.3:war (default) @ gs-web-app ---
[INFO] Downloading from central: https://repo.maven.apache.org/maven2/org/codehaus/plexus/plexus-io/2.0.5/plexus-io-2.0.5.pom
[INFO] Downloaded from central: https://repo.maven.apache.org/maven2/org/codehaus/plexus/plexus-io/2.0.5/plexus-io-2.0.5.pom (2.2 kB at 442 kB/s)
[INFO] Downloading from central: https://repo.maven.apache.org/maven2/org/codehaus/plexus/plexus-components/1.2/plexus-components-1.2.pom
[INFO] Downloaded from central: https://repo.maven.apache.org/maven2/org/codehaus/plexus/plexus-components/1.2/plexus-components-1.2.pom (3.1 kB at 1.0 MB/s)
[INFO] Downloading from central: https://repo.maven.apache.org/maven2/com/thoughtworks/xstream/xstream/1.4.3/xstream-1.4.3.pom
[INFO] Downloaded from central: https://repo.maven.apache.org/maven2/com/thoughtworks/xstream/xstream/1.4.3/xstream-1.4.3.pom (8.6 kB at 2.1 MB/s)
[INFO] Downloading from central: https://repo.maven.apache.org/maven2/com/thoughtworks/xstream/xstream-parent/1.4.3/xstream-parent-1.4.3.pom
[INFO] Downloaded from central: https://repo.maven.apache.org/maven2/com/thoughtworks/xstream/xstream-parent/1.4.3/xstream-parent-1.4.3.pom (19 kB at 2.7 MB/s)
[INFO] Downloading from central: https://repo.maven.apache.org/maven2/org/codehaus/codehaus-parent/3/codehaus-parent-3.pom
[INFO] Downloaded from central: https://repo.maven.apache.org/maven2/org/codehaus/codehaus-parent/3/codehaus-parent-3.pom (4.1 kB at 2.1 MB/s)
[INFO] Downloading from central: https://repo.maven.apache.org/maven2/org/apache/maven/shared/maven-filtering/1.0-beta-2/maven-filtering-1.0-beta-2.pom
[INFO] Downloaded from central: https://repo.maven.apache.org/maven2/org/apache/maven/shared/maven-filtering/1.0-beta-2/maven-filtering-1.0-beta-2.pom (4.0 kB at 806 kB/s)
[INFO] Downloading from central: https://repo.maven.apache.org/maven2/org/apache/maven/shared/maven-shared-components/10/maven-shared-components-10.pom
[INFO] Downloaded from central: https://repo.maven.apache.org/maven2/org/apache/maven/shared/maven-shared-components/10/maven-shared-components-10.pom (8.4 kB at 2.1 MB/s)
[INFO] Downloading from central: https://repo.maven.apache.org/maven2/org/codehaus/plexus/plexus-interpolation/1.6/plexus-interpolation-1.6.pom
[INFO] Downloaded from central: https://repo.maven.apache.org/maven2/org/codehaus/plexus/plexus-interpolation/1.6/plexus-interpolation-1.6.pom (2.9 kB at 727 kB/s)
[INFO] Downloading from central: https://repo.maven.apache.org/maven2/org/codehaus/plexus/plexus-io/2.0.5/plexus-io-2.0.5.jar
[INFO] Downloading from central: https://repo.maven.apache.org/maven2/com/thoughtworks/xstream/xstream/1.4.3/xstream-1.4.3.jar
[INFO] Downloading from central: https://repo.maven.apache.org/maven2/org/apache/maven/shared/maven-filtering/1.0-beta-2/maven-filtering-1.0-beta-2.jar
[INFO] Downloaded from central: https://repo.maven.apache.org/maven2/org/codehaus/plexus/plexus-io/2.0.5/plexus-io-2.0.5.jar (58 kB at 7.2 MB/s)
[INFO] Downloaded from central: https://repo.maven.apache.org/maven2/org/apache/maven/shared/maven-filtering/1.0-beta-2/maven-filtering-1.0-beta-2.jar (33 kB at 4.7 MB/s)
[INFO] Downloaded from central: https://repo.maven.apache.org/maven2/com/thoughtworks/xstream/xstream/1.4.3/xstream-1.4.3.jar (482 kB at 10 MB/s)
[INFO] Packaging webapp
[INFO] Assembling webapp [gs-web-app] in [<https://build.geoserver.org/job/geoserver-2.14.x/ws/src/web/app/target/geoserver]>
[INFO] Processing war project
[INFO] Copying webapp resources [<https://build.geoserver.org/job/geoserver-2.14.x/ws/src/web/app/src/main/webapp]>
[INFO] Webapp assembled in [380 msecs]
[INFO] Building war: <https://build.geoserver.org/job/geoserver-2.14.x/ws/src/web/app/target/geoserver.war>
[INFO]
[INFO] --- build-helper-maven-plugin:1.8:attach-artifact (attach-war) @ gs-web-app ---
[INFO] Downloading from central: https://repo.maven.apache.org/maven2/junit/junit/4.10/junit-4.10.pom
[INFO] Downloaded from central: https://repo.maven.apache.org/maven2/junit/junit/4.10/junit-4.10.pom (2.3 kB at 123 kB/s)
[INFO] Downloading from central: https://repo.maven.apache.org/maven2/org/hamcrest/hamcrest-core/1.1/hamcrest-core-1.1.pom
[INFO] Downloaded from central: https://repo.maven.apache.org/maven2/org/hamcrest/hamcrest-core/1.1/hamcrest-core-1.1.pom (481 B at 53 kB/s)
[INFO] Downloading from central: https://repo.maven.apache.org/maven2/org/hamcrest/hamcrest-parent/1.1/hamcrest-parent-1.1.pom
[INFO] Downloaded from central: https://repo.maven.apache.org/maven2/org/hamcrest/hamcrest-parent/1.1/hamcrest-parent-1.1.pom (5.9 kB at 980 kB/s)
[INFO] Downloading from central: https://repo.maven.apache.org/maven2/org/apache/maven/maven-plugin-api/2.0.1/maven-plugin-api-2.0.1.pom
[INFO] Downloaded from central: https://repo.maven.apache.org/maven2/org/apache/maven/maven-plugin-api/2.0.1/maven-plugin-api-2.0.1.pom (643 B at 214 kB/s)
[INFO] Downloading from central: https://repo.maven.apache.org/maven2/org/apache/maven/maven/2.0.1/maven-2.0.1.pom
[INFO] Downloaded from central: https://repo.maven.apache.org/maven2/org/apache/maven/maven/2.0.1/maven-2.0.1.pom (11 kB at 1.9 MB/s)
[INFO] Downloading from central: https://repo.maven.apache.org/maven2/org/beanshell/bsh/2.0b4/bsh-2.0b4.pom
[INFO] Downloaded from central: https://repo.maven.apache.org/maven2/org/beanshell/bsh/2.0b4/bsh-2.0b4.pom (1.2 kB at 299 kB/s)
[INFO] Downloading from central: https://repo.maven.apache.org/maven2/org/beanshell/beanshell/2.0b4/beanshell-2.0b4.pom
[INFO] Downloaded from central: https://repo.maven.apache.org/maven2/org/beanshell/beanshell/2.0b4/beanshell-2.0b4.pom (1.4 kB at 353 kB/s)
[INFO] Downloading from central: https://repo.maven.apache.org/maven2/org/codehaus/plexus/plexus-utils/1.5.8/plexus-utils-1.5.8.jar
[INFO] Downloading from central: https://repo.maven.apache.org/maven2/org/beanshell/bsh/2.0b4/bsh-2.0b4.jar
[INFO] Downloaded from central: https://repo.maven.apache.org/maven2/org/codehaus/plexus/plexus-utils/1.5.8/plexus-utils-1.5.8.jar (268 kB at 11 MB/s)
[INFO] Downloaded from central: https://repo.maven.apache.org/maven2/org/beanshell/bsh/2.0b4/bsh-2.0b4.jar (282 kB at 7.4 MB/s)
[INFO]
[INFO] --- fmt-maven-plugin:2.4.0:check (default) @ gs-web-app ---
[warn] Source directory '<https://build.geoserver.org/job/geoserver-2.14.x/ws/src/web/app/src/main/java'> does not exist, ignoring.
[debug] Using AOSP style
[INFO] Processed 6 files (0 non-complying).
[INFO]
[INFO] --- maven-install-plugin:2.4:install (default-install) @ gs-web-app ---
[INFO] Installing <https://build.geoserver.org/job/geoserver-2.14.x/ws/src/web/app/target/geoserver.war> to /home/ubuntu/.m2/repository/org/geoserver/web/gs-web-app/2.14-SNAPSHOT/gs-web-app-2.14-SNAPSHOT.jar
[INFO] Installing <https://build.geoserver.org/job/geoserver-2.14.x/ws/src/web/app/pom.xml> to /home/ubuntu/.m2/repository/org/geoserver/web/gs-web-app/2.14-SNAPSHOT/gs-web-app-2.14-SNAPSHOT.pom
[INFO] Installing <https://build.geoserver.org/job/geoserver-2.14.x/ws/src/web/app/target/gs-web-app-2.14-SNAPSHOT-tests.jar> to /home/ubuntu/.m2/repository/org/geoserver/web/gs-web-app/2.14-SNAPSHOT/gs-web-app-2.14-SNAPSHOT-tests.jar
[INFO] Installing <https://build.geoserver.org/job/geoserver-2.14.x/ws/src/web/app/target/gs-web-app-2.14-SNAPSHOT-test-sources.jar> to /home/ubuntu/.m2/repository/org/geoserver/web/gs-web-app/2.14-SNAPSHOT/gs-web-app-2.14-SNAPSHOT-test-sources.jar
[INFO] Installing <https://build.geoserver.org/job/geoserver-2.14.x/ws/src/web/app/target/geoserver.war> to /home/ubuntu/.m2/repository/org/geoserver/web/gs-web-app/2.14-SNAPSHOT/gs-web-app-2.14-SNAPSHOT.war
[INFO] ------------------------------------------------------------------------
[INFO] Reactor Summary for GeoServer 2.14-SNAPSHOT:
[INFO]
[INFO] GeoServer .......................................... SUCCESS [ 30.802 s]
[INFO] Core Platform Module ............................... SUCCESS [ 25.646 s]
[INFO] Open Web Service Module ............................ SUCCESS [ 17.662 s]
[INFO] Main Module ........................................ SUCCESS [01:29 min]
[INFO] GeoServer Security Modules ......................... SUCCESS [  0.040 s]
[INFO] GeoServer Security Tests Module .................... SUCCESS [01:43 min]
[INFO] GeoServer JDBC Security Module ..................... SUCCESS [ 47.293 s]
[INFO] GeoServer LDAP Security Module ..................... SUCCESS [ 36.224 s]
[INFO] Web Coverage Service Module ........................ SUCCESS [  1.529 s]
[INFO] Web Coverage Service 1.0 Module .................... SUCCESS [ 16.251 s]
[INFO] Web Coverage Service 1.1 Module .................... SUCCESS [ 18.294 s]
[INFO] Web Coverage Service 2.0 Module .................... SUCCESS [01:11 min]
[INFO] Web Feature Service Module ......................... SUCCESS [01:18 min]
[INFO] Web Map Service Module ............................. SUCCESS [02:17 min]
[INFO] KML support for GeoServer .......................... SUCCESS [05:08 min]
[INFO] gs-rest ............................................ SUCCESS [ 11.303 s]
[INFO] GeoWebCache (GWC) Module ........................... SUCCESS [05:49 min]
[INFO] gs-restconfig ...................................... SUCCESS [01:56 min]
[INFO] gs-restconfig-wcs .................................. SUCCESS [ 15.900 s]
[INFO] gs-restconfig-wfs .................................. SUCCESS [ 18.351 s]
[INFO] gs-restconfig-wms .................................. SUCCESS [06:10 min]
[INFO] GeoServer Web Modules .............................. SUCCESS [  0.108 s]
[INFO] Core UI Module ..................................... SUCCESS [01:07 min]
[INFO] WMS UI Module ...................................... SUCCESS [05:15 min]
[INFO] GWC UI Module ...................................... SUCCESS [03:38 min]
[INFO] WFS UI Module ...................................... SUCCESS [  8.820 s]
[INFO] Demos Module ....................................... SUCCESS [ 38.415 s]
[INFO] WCS UI Module ...................................... SUCCESS [  9.395 s]
[INFO] Security UI Modules ................................ SUCCESS [  0.070 s]
[INFO] Security UI Core Module ............................ SUCCESS [06:13 min]
[INFO] Security UI JDBC Module ............................ SUCCESS [01:07 min]
[INFO] Security UI LDAP Module ............................ SUCCESS [ 34.995 s]
[INFO] REST UI Module ..................................... SUCCESS [ 10.152 s]
[INFO] GeoServer Extensions ............................... SUCCESS [  0.026 s]
[INFO] Printing Module .................................... SUCCESS [ 42.572 s]
[INFO] GeoServer Web Application .......................... SUCCESS [ 11.646 s]
[INFO] Community Space .................................... SUCCESS [  0.018 s]
[INFO] Application Schema Support ......................... SUCCESS [  0.024 s]
[INFO] Application Schema Integration Test ................ SUCCESS [14:51 min]
[INFO] Sample DataAccess Integration Test ................. SUCCESS [  9.416 s]
[INFO] ArcSDE DataStore Extension ......................... SUCCESS [ 11.718 s]
[INFO] H2 DataStore Extension ............................. SUCCESS [ 10.740 s]
[INFO] SQL Server DataStore Extension ..................... SUCCESS [  3.293 s]
[INFO] Oracle DataStore Extension ......................... SUCCESS [  0.495 s]
[INFO] MySQL DataStore Extension .......................... SUCCESS [  1.346 s]
[INFO] DB2 DataStore Extension ............................ SUCCESS [  0.257 s]
[INFO] ImageMap Output Format ............................. SUCCESS [ 12.656 s]
[INFO] ImageI/O-Ext GDAL Coverage Extension ............... SUCCESS [  6.264 s]
[INFO] JP2K Coverage Extension ............................ SUCCESS [  0.458 s]
[INFO] OGR parent ......................................... SUCCESS [  0.018 s]
[INFO] OGR CORE ........................................... SUCCESS [  1.852 s]
[INFO] OGR WFS ............................................ SUCCESS [  7.751 s]
[INFO] Web Processing Service parent ...................... SUCCESS [  0.018 s]
[INFO] Web Processing Service Module ...................... SUCCESS [01:19 min]
[INFO] OGR WPS ............................................ SUCCESS [  7.995 s]
[INFO] Excel Output Format ................................ SUCCESS [ 14.255 s]
[INFO] Chart external graphics support .................... SUCCESS [  4.045 s]
[INFO] Feature Generalization Extension ................... SUCCESS [  1.569 s]
[INFO] Image Mosaic JDBC Extension ........................ SUCCESS [  2.593 s]
[INFO] OWS request flow controller ........................ SUCCESS [ 13.966 s]
[INFO] Web process status sharing with Hazelcast .......... SUCCESS [ 24.499 s]
[INFO] Web Processing Service GUI ......................... SUCCESS [02:46 min]
[INFO] GeoServer Layer Querying filter functions .......... SUCCESS [ 12.659 s]
[INFO] Teradata DataStore Extension ....................... SUCCESS [  1.801 s]
[INFO] GeoServer Monitor Extensions ....................... SUCCESS [  0.042 s]
[INFO] Core Monitor Extension ............................. SUCCESS [09:40 min]
[INFO] GeoServer Security Extension Modules ............... SUCCESS [  0.031 s]
[INFO] GeoServer CAS Security Module ...................... SUCCESS [  7.409 s]
[INFO] GeoServer Security Extension Web Modules ........... SUCCESS [  0.023 s]
[INFO] GeoServer CAS Security Web Module .................. SUCCESS [  1.994 s]
[INFO] XLST based WFS output format ....................... SUCCESS [ 17.231 s]
[INFO] GeoServer INSPIRE Extensions ....................... SUCCESS [06:34 min]
[INFO] GeoServer CSS Styling .............................. SUCCESS [01:22 min]
[INFO] Catalog Services for the Web parent ................ SUCCESS [  0.036 s]
[INFO] Catalog Services for the Web interfaces ............ SUCCESS [ 10.893 s]
[INFO] Catalog Services for the Web - Simple CatalogStore implementation SUCCESS [  7.654 s]
[INFO] Catalog Services for the Web core module ........... SUCCESS [06:17 min]
[INFO] CSW UI Module ...................................... SUCCESS [ 32.136 s]
[INFO] DXF WFS output format and WPS PPIO ................. SUCCESS [  0.015 s]
[INFO] DXF WFS output format .............................. SUCCESS [ 10.031 s]
[INFO] DXF WPS PPIO ....................................... SUCCESS [  8.364 s]
[INFO] GeoServer WCS 2.0 Earth Observation Extensions ..... SUCCESS [  0.017 s]
[INFO] Web Coverage Service 2.0 Earth Observation extensions SUCCESS [ 49.420 s]
[INFO] Web Coverage Service 2.0 Earth Observation GUI extension SUCCESS [04:59 min]
[INFO] GeoServer libjpeg-turbo Module ..................... SUCCESS [  8.439 s]
[INFO] GeoServer Data Importer ............................ SUCCESS [  7.751 s]
[INFO] Importer Core Module ............................... SUCCESS [04:55 min]
[INFO] Importer REST Api Module-ng ........................ SUCCESS [12:44 min]
[INFO] Importer Berkley DB Persistence Module ............. SUCCESS [09:50 min]
[INFO] Importer Web UI Module ............................. SUCCESS [ 14.228 s]
[INFO] GRIB Coverage Format ............................... SUCCESS [ 26.097 s]
[INFO] NetCDF Coverage format ............................. SUCCESS [05:59 min]
[INFO] WCS NetCDF output Module ........................... SUCCESS [03:48 min]
[INFO] Vector Tiles ....................................... SUCCESS [ 22.581 s]
[INFO] Ysld GeoServer Plugin .............................. SUCCESS [ 13.733 s]
[INFO] MongoDB Data Store ................................. SUCCESS [  4.588 s]
[INFO] ------------------------------------------------------------------------
[INFO] BUILD SUCCESS
[INFO] ------------------------------------------------------------------------
[INFO] Total time:  01:12 h (Wall Clock)
[INFO] Finished at: 2019-06-18T03:02:00Z
[INFO] ------------------------------------------------------------------------
FATAL: Failed to install https://github.com/AdoptOpenJDK/openjdk8-binaries/releases/download/jdk8u212-b03/OpenJDK8U-jdk_x64_linux_hotspot_8u212b03.tar.gz to /tmp/jenkins-94f54e7a/tools/hudson.model.JDK/OpenJDK_8u212
java.net.SocketException: Connection reset
        at java.net.SocketInputStream.read(SocketInputStream.java:210)
        at java.net.SocketInputStream.read(SocketInputStream.java:141)
        at sun.security.ssl.InputRecord.readFully(InputRecord.java:465)
        at sun.security.ssl.InputRecord.read(InputRecord.java:503)
        at sun.security.ssl.SSLSocketImpl.readRecord(SSLSocketImpl.java:975)
        at sun.security.ssl.SSLSocketImpl.performInitialHandshake(SSLSocketImpl.java:1367)
        at sun.security.ssl.SSLSocketImpl.startHandshake(SSLSocketImpl.java:1395)
        at sun.security.ssl.SSLSocketImpl.startHandshake(SSLSocketImpl.java:1379)
        at sun.net.www.protocol.https.HttpsClient.afterConnect(HttpsClient.java:559)
        at sun.net.www.protocol.https.AbstractDelegateHttpsURLConnection.connect(AbstractDelegateHttpsURLConnection.java:185)
        at sun.net.www.protocol.http.HttpURLConnection.followRedirect0(HttpURLConnection.java:2729)
        at sun.net.www.protocol.http.HttpURLConnection.followRedirect(HttpURLConnection.java:2641)
        at sun.net.www.protocol.http.HttpURLConnection.getInputStream0(HttpURLConnection.java:1824)
        at sun.net.www.protocol.http.HttpURLConnection.getInputStream(HttpURLConnection.java:1492)
        at java.net.HttpURLConnection.getResponseCode(HttpURLConnection.java:480)
        at sun.net.www.protocol.https.HttpsURLConnectionImpl.getResponseCode(HttpsURLConnectionImpl.java:347)
        at hudson.FilePath.installIfNecessaryFrom(FilePath.java:873)
Caused: java.io.IOException: Failed to install https://github.com/AdoptOpenJDK/openjdk8-binaries/releases/download/jdk8u212-b03/OpenJDK8U-jdk_x64_linux_hotspot_8u212b03.tar.gz to /tmp/jenkins-94f54e7a/tools/hudson.model.JDK/OpenJDK_8u212
        at hudson.FilePath.installIfNecessaryFrom(FilePath.java:937)
        at hudson.FilePath.installIfNecessaryFrom(FilePath.java:845)
        at hudson.tools.ZipExtractionInstaller.performInstallation(ZipExtractionInstaller.java:83)
        at hudson.tools.InstallerTranslator.getToolHome(InstallerTranslator.java:72)
        at hudson.tools.ToolLocationNodeProperty.getToolHome(ToolLocationNodeProperty.java:109)
        at hudson.tools.ToolInstallation.translateFor(ToolInstallation.java:206)
        at hudson.model.JDK.forNode(JDK.java:148)
        at hudson.model.AbstractProject.getEnvironment(AbstractProject.java:341)
        at hudson.model.Run.getEnvironment(Run.java:2374)
        at hudson.model.AbstractBuild.getEnvironment(AbstractBuild.java:872)
        at hudson.tasks.Maven.perform(Maven.java:293)
        at hudson.tasks.BuildStepMonitor$1.perform(BuildStepMonitor.java:20)
        at hudson.model.AbstractBuild$AbstractBuildExecution.perform(AbstractBuild.java:744)
        at hudson.model.Build$BuildExecution.build(Build.java:206)
        at hudson.model.Build$BuildExecution.doRun(Build.java:163)
        at hudson.model.AbstractBuild$AbstractBuildExecution.run(AbstractBuild.java:504)
        at hudson.model.Run.execute(Run.java:1816)
        at hudson.model.FreeStyleBuild.run(FreeStyleBuild.java:43)
        at hudson.model.ResourceController.execute(ResourceController.java:97)
        at hudson.model.Executor.run(Executor.java:429)


_______________________________________________
Geoserver-devel mailing list
[hidden email]
https://lists.sourceforge.net/lists/listinfo/geoserver-devel
Reply | Threaded
Open this post in threaded view
|

Jenkins build is back to normal : geoserver-2.14.x #589

Jenkins-2