Build failed in Jenkins: geoserver-2.14.x #189

classic Classic list List threaded Threaded
9 messages Options
Reply | Threaded
Open this post in threaded view
|

Build failed in Jenkins: geoserver-2.14.x #189

monitor
See <https://build.geoserver.org/job/geoserver-2.14.x/189/display/redirect?page=changes>

Changes:

[Andrea Aime] [GEOS-9022] geoserver Style page, after expand button, html brokes

[Andrea Aime] [GEOS-8970] WMS GetCapabilities throws ConcurrentModificationException

------------------------------------------
[...truncated 828.25 KB...]
[INFO] Compiling 2 source files to <https://build.geoserver.org/job/geoserver-2.14.x/ws/src/extension/csw/web-csw/target/classes>
Running org.geoserver.security.cas.CasAuthenticationTest
Tests run: 5, Failures: 0, Errors: 0, Skipped: 5, Time elapsed: 1.447 sec
Running org.geoserver.security.cas.CasFilterConfigValidatorTest
Tests run: 1, Failures: 0, Errors: 0, Skipped: 0, Time elapsed: 0.669 sec

Results :

Tests run: 6, Failures: 0, Errors: 0, Skipped: 5

[INFO]
[INFO] --- maven-jar-plugin:2.4:jar (default-jar) @ gs-sec-cas ---
[INFO] Building jar: <https://build.geoserver.org/job/geoserver-2.14.x/ws/src/extension/security/cas/target/gs-sec-cas-2.14-SNAPSHOT.jar>
[INFO]
[INFO] --- maven-jar-plugin:2.4:test-jar (default) @ gs-sec-cas ---
[INFO] Building jar: <https://build.geoserver.org/job/geoserver-2.14.x/ws/src/extension/security/cas/target/gs-sec-cas-2.14-SNAPSHOT-tests.jar>
[INFO]
[INFO] --- maven-source-plugin:2.2.1:jar-no-fork (attach-sources) @ gs-sec-cas ---
[INFO] Building jar: <https://build.geoserver.org/job/geoserver-2.14.x/ws/src/extension/security/cas/target/gs-sec-cas-2.14-SNAPSHOT-sources.jar>
[INFO]
[INFO] --- maven-source-plugin:2.2.1:test-jar-no-fork (attach-sources) @ gs-sec-cas ---
[INFO] Building jar: <https://build.geoserver.org/job/geoserver-2.14.x/ws/src/extension/security/cas/target/gs-sec-cas-2.14-SNAPSHOT-test-sources.jar>
[INFO]
[INFO] --- fmt-maven-plugin:2.4.0:check (default) @ gs-sec-cas ---
[debug] Using AOSP style
[INFO] Processed 14 files (0 non-complying).
[INFO]
[INFO] --- maven-install-plugin:2.4:install (default-install) @ gs-sec-cas ---
[INFO] Installing <https://build.geoserver.org/job/geoserver-2.14.x/ws/src/extension/security/cas/target/gs-sec-cas-2.14-SNAPSHOT.jar> to /var/jenkins/.m2/repository/org/geoserver/security/gs-sec-cas/2.14-SNAPSHOT/gs-sec-cas-2.14-SNAPSHOT.jar
[INFO] Installing <https://build.geoserver.org/job/geoserver-2.14.x/ws/src/extension/security/cas/pom.xml> to /var/jenkins/.m2/repository/org/geoserver/security/gs-sec-cas/2.14-SNAPSHOT/gs-sec-cas-2.14-SNAPSHOT.pom
[INFO] Installing <https://build.geoserver.org/job/geoserver-2.14.x/ws/src/extension/security/cas/target/gs-sec-cas-2.14-SNAPSHOT-tests.jar> to /var/jenkins/.m2/repository/org/geoserver/security/gs-sec-cas/2.14-SNAPSHOT/gs-sec-cas-2.14-SNAPSHOT-tests.jar
[INFO] Installing <https://build.geoserver.org/job/geoserver-2.14.x/ws/src/extension/security/cas/target/gs-sec-cas-2.14-SNAPSHOT-sources.jar> to /var/jenkins/.m2/repository/org/geoserver/security/gs-sec-cas/2.14-SNAPSHOT/gs-sec-cas-2.14-SNAPSHOT-sources.jar
[INFO] Installing <https://build.geoserver.org/job/geoserver-2.14.x/ws/src/extension/security/cas/target/gs-sec-cas-2.14-SNAPSHOT-test-sources.jar> to /var/jenkins/.m2/repository/org/geoserver/security/gs-sec-cas/2.14-SNAPSHOT/gs-sec-cas-2.14-SNAPSHOT-test-sources.jar
[INFO]                                                                        
[INFO] ------------------------------------------------------------------------
[INFO] Building GeoServer CAS Security Web Module 2.14-SNAPSHOT
[INFO] ------------------------------------------------------------------------
[INFO]
[INFO] --- maven-clean-plugin:2.5:clean (default-clean) @ gs-web-sec-cas ---
[INFO] Deleting <https://build.geoserver.org/job/geoserver-2.14.x/ws/src/extension/security/web/web-cas/target>
[INFO]
[INFO] --- git-commit-id-plugin:2.1.15:revision (default) @ gs-web-sec-cas ---
[INFO]
[INFO] --- maven-resources-plugin:2.6:resources (default-resources) @ gs-web-sec-cas ---
[INFO] Using 'UTF-8' encoding to copy filtered resources.
[INFO] Copying 2 resources
[INFO] skip non existing resourceDirectory <https://build.geoserver.org/job/geoserver-2.14.x/ws/src/extension/security/web/web-cas/src/main/resources>
[INFO]
[INFO] --- maven-compiler-plugin:2.3.2:compile (default-compile) @ gs-web-sec-cas ---
[INFO] Compiling 2 source files to <https://build.geoserver.org/job/geoserver-2.14.x/ws/src/extension/security/web/web-cas/target/classes>
[INFO]
[INFO] --- maven-resources-plugin:2.6:testResources (default-testResources) @ gs-web-csw ---
[INFO] Using 'UTF-8' encoding to copy filtered resources.
[INFO] Copying 0 resource
[INFO] skip non existing resourceDirectory <https://build.geoserver.org/job/geoserver-2.14.x/ws/src/extension/csw/web-csw/src/test/resources>
[INFO]
[INFO] --- maven-compiler-plugin:2.3.2:testCompile (default-testCompile) @ gs-web-csw ---
[INFO] Compiling 1 source file to <https://build.geoserver.org/job/geoserver-2.14.x/ws/src/extension/csw/web-csw/target/test-classes>
[INFO]
[INFO] --- maven-resources-plugin:2.6:testResources (default-testResources) @ gs-web-sec-cas ---
[INFO] Using 'UTF-8' encoding to copy filtered resources.
[INFO] skip non existing resourceDirectory <https://build.geoserver.org/job/geoserver-2.14.x/ws/src/extension/security/web/web-cas/src/test/java>
[INFO] skip non existing resourceDirectory <https://build.geoserver.org/job/geoserver-2.14.x/ws/src/extension/security/web/web-cas/src/test/resources>
[INFO]
[INFO] --- maven-compiler-plugin:2.3.2:testCompile (default-testCompile) @ gs-web-sec-cas ---
[INFO] No sources to compile
[INFO]
[INFO] --- maven-surefire-plugin:2.12.3:test (default-test) @ gs-web-sec-cas ---
[INFO] No tests to run.
[INFO]
[INFO] --- maven-jar-plugin:2.4:jar (default-jar) @ gs-web-sec-cas ---
[INFO] Building jar: <https://build.geoserver.org/job/geoserver-2.14.x/ws/src/extension/security/web/web-cas/target/gs-web-sec-cas-2.14-SNAPSHOT.jar>
[INFO]
[INFO] --- maven-jar-plugin:2.4:test-jar (default) @ gs-web-sec-cas ---
[WARNING] JAR will be empty - no content was marked for inclusion!
[INFO] Building jar: <https://build.geoserver.org/job/geoserver-2.14.x/ws/src/extension/security/web/web-cas/target/gs-web-sec-cas-2.14-SNAPSHOT-tests.jar>
[INFO]
[INFO] --- maven-source-plugin:2.2.1:jar-no-fork (attach-sources) @ gs-web-sec-cas ---
[INFO] Building jar: <https://build.geoserver.org/job/geoserver-2.14.x/ws/src/extension/security/web/web-cas/target/gs-web-sec-cas-2.14-SNAPSHOT-sources.jar>
[INFO]
[INFO] --- maven-source-plugin:2.2.1:test-jar-no-fork (attach-sources) @ gs-web-sec-cas ---
[INFO] No sources in project. Archive not created.
[INFO]
[INFO] --- fmt-maven-plugin:2.4.0:check (default) @ gs-web-sec-cas ---
[warn] Test source directory '<https://build.geoserver.org/job/geoserver-2.14.x/ws/src/extension/security/web/web-cas/src/test/java'> does not exist, ignoring.
[debug] Using AOSP style
[INFO] Processed 2 files (0 non-complying).
[INFO]
[INFO] --- maven-install-plugin:2.4:install (default-install) @ gs-web-sec-cas ---
[INFO] Installing <https://build.geoserver.org/job/geoserver-2.14.x/ws/src/extension/security/web/web-cas/target/gs-web-sec-cas-2.14-SNAPSHOT.jar> to /var/jenkins/.m2/repository/org/geoserver/security/gs-web-sec-cas/2.14-SNAPSHOT/gs-web-sec-cas-2.14-SNAPSHOT.jar
[INFO] Installing <https://build.geoserver.org/job/geoserver-2.14.x/ws/src/extension/security/web/web-cas/pom.xml> to /var/jenkins/.m2/repository/org/geoserver/security/gs-web-sec-cas/2.14-SNAPSHOT/gs-web-sec-cas-2.14-SNAPSHOT.pom
[INFO] Installing <https://build.geoserver.org/job/geoserver-2.14.x/ws/src/extension/security/web/web-cas/target/gs-web-sec-cas-2.14-SNAPSHOT-tests.jar> to /var/jenkins/.m2/repository/org/geoserver/security/gs-web-sec-cas/2.14-SNAPSHOT/gs-web-sec-cas-2.14-SNAPSHOT-tests.jar
[INFO]
[INFO] --- maven-surefire-plugin:2.12.3:test (default-test) @ gs-web-csw ---
[INFO] Installing <https://build.geoserver.org/job/geoserver-2.14.x/ws/src/extension/security/web/web-cas/target/gs-web-sec-cas-2.14-SNAPSHOT-sources.jar> to /var/jenkins/.m2/repository/org/geoserver/security/gs-web-sec-cas/2.14-SNAPSHOT/gs-web-sec-cas-2.14-SNAPSHOT-sources.jar
[INFO] Surefire report directory: <https://build.geoserver.org/job/geoserver-2.14.x/ws/src/extension/csw/web-csw/target/surefire-reports>

-------------------------------------------------------
 T E S T S
-------------------------------------------------------
Running org.geoserver.wfs.web.CSWAdminPageTest
Tests run: 1, Failures: 0, Errors: 0, Skipped: 0, Time elapsed: 7.132 sec

Results :

Tests run: 1, Failures: 0, Errors: 0, Skipped: 0

[INFO]
[INFO] --- maven-jar-plugin:2.4:jar (default-jar) @ gs-web-csw ---
[INFO] Building jar: <https://build.geoserver.org/job/geoserver-2.14.x/ws/src/extension/csw/web-csw/target/gs-web-csw-2.14-SNAPSHOT.jar>
[INFO]
[INFO] --- maven-jar-plugin:2.4:test-jar (default) @ gs-web-csw ---
[INFO] Building jar: <https://build.geoserver.org/job/geoserver-2.14.x/ws/src/extension/csw/web-csw/target/gs-web-csw-2.14-SNAPSHOT-tests.jar>
[INFO]
[INFO] --- maven-source-plugin:2.2.1:jar-no-fork (attach-sources) @ gs-web-csw ---
[INFO] Building jar: <https://build.geoserver.org/job/geoserver-2.14.x/ws/src/extension/csw/web-csw/target/gs-web-csw-2.14-SNAPSHOT-sources.jar>
[INFO]
[INFO] --- maven-source-plugin:2.2.1:test-jar-no-fork (attach-sources) @ gs-web-csw ---
[INFO] Building jar: <https://build.geoserver.org/job/geoserver-2.14.x/ws/src/extension/csw/web-csw/target/gs-web-csw-2.14-SNAPSHOT-test-sources.jar>
[INFO]
[INFO] --- fmt-maven-plugin:2.4.0:check (default) @ gs-web-csw ---
[debug] Using AOSP style
[INFO] Processed 3 files (0 non-complying).
[INFO]
[INFO] --- maven-install-plugin:2.4:install (default-install) @ gs-web-csw ---
[INFO] Installing <https://build.geoserver.org/job/geoserver-2.14.x/ws/src/extension/csw/web-csw/target/gs-web-csw-2.14-SNAPSHOT.jar> to /var/jenkins/.m2/repository/org/geoserver/csw/gs-web-csw/2.14-SNAPSHOT/gs-web-csw-2.14-SNAPSHOT.jar
[INFO] Installing <https://build.geoserver.org/job/geoserver-2.14.x/ws/src/extension/csw/web-csw/pom.xml> to /var/jenkins/.m2/repository/org/geoserver/csw/gs-web-csw/2.14-SNAPSHOT/gs-web-csw-2.14-SNAPSHOT.pom
[INFO] Installing <https://build.geoserver.org/job/geoserver-2.14.x/ws/src/extension/csw/web-csw/target/gs-web-csw-2.14-SNAPSHOT-tests.jar> to /var/jenkins/.m2/repository/org/geoserver/csw/gs-web-csw/2.14-SNAPSHOT/gs-web-csw-2.14-SNAPSHOT-tests.jar
[INFO] Installing <https://build.geoserver.org/job/geoserver-2.14.x/ws/src/extension/csw/web-csw/target/gs-web-csw-2.14-SNAPSHOT-sources.jar> to /var/jenkins/.m2/repository/org/geoserver/csw/gs-web-csw/2.14-SNAPSHOT/gs-web-csw-2.14-SNAPSHOT-sources.jar
[INFO] Installing <https://build.geoserver.org/job/geoserver-2.14.x/ws/src/extension/csw/web-csw/target/gs-web-csw-2.14-SNAPSHOT-test-sources.jar> to /var/jenkins/.m2/repository/org/geoserver/csw/gs-web-csw/2.14-SNAPSHOT/gs-web-csw-2.14-SNAPSHOT-test-sources.jar
[INFO] ------------------------------------------------------------------------
[INFO] Reactor Summary:
[INFO]
[INFO] GeoServer .......................................... SUCCESS [  9.804 s]
[INFO] Core Platform Module ............................... SUCCESS [ 21.769 s]
[INFO] Open Web Service Module ............................ SUCCESS [ 23.457 s]
[INFO] Main Module ........................................ SUCCESS [01:56 min]
[INFO] GeoServer Security Modules ......................... SUCCESS [  0.126 s]
[INFO] GeoServer Security Tests Module .................... SUCCESS [01:32 min]
[INFO] GeoServer JDBC Security Module ..................... SUCCESS [01:06 min]
[INFO] GeoServer LDAP Security Module ..................... SUCCESS [ 28.578 s]
[INFO] Web Coverage Service Module ........................ SUCCESS [  6.896 s]
[INFO] Web Coverage Service 1.0 Module .................... SUCCESS [ 26.343 s]
[INFO] Web Coverage Service 1.1 Module .................... SUCCESS [ 40.662 s]
[INFO] Web Coverage Service 2.0 Module .................... SUCCESS [01:37 min]
[INFO] Web Feature Service Module ......................... SUCCESS [02:42 min]
[INFO] Web Map Service Module ............................. FAILURE [ 14.203 s]
[INFO] KML support for GeoServer .......................... SKIPPED
[INFO] gs-rest ............................................ SUCCESS [ 26.625 s]
[INFO] GeoWebCache (GWC) Module ........................... SKIPPED
[INFO] gs-restconfig ...................................... SUCCESS [02:36 min]
[INFO] gs-restconfig-wcs .................................. SUCCESS [ 32.318 s]
[INFO] gs-restconfig-wfs .................................. SUCCESS [ 30.967 s]
[INFO] gs-restconfig-wms .................................. SKIPPED
[INFO] GeoServer Web Modules .............................. SUCCESS [  0.101 s]
[INFO] Core UI Module ..................................... SUCCESS [01:59 min]
[INFO] WMS UI Module ...................................... SKIPPED
[INFO] GWC UI Module ...................................... SKIPPED
[INFO] WFS UI Module ...................................... SUCCESS [ 18.421 s]
[INFO] Demos Module ....................................... SKIPPED
[INFO] WCS UI Module ...................................... SKIPPED
[INFO] Security UI Modules ................................ SUCCESS [  0.068 s]
[INFO] Security UI Core Module ............................ SUCCESS [03:00 min]
[INFO] Security UI JDBC Module ............................ SUCCESS [01:47 min]
[INFO] Security UI LDAP Module ............................ SUCCESS [ 33.557 s]
[INFO] REST UI Module ..................................... SUCCESS [ 19.874 s]
[INFO] GeoServer Extensions ............................... SUCCESS [  0.062 s]
[INFO] Printing Module .................................... SUCCESS [ 20.932 s]
[INFO] GeoServer Web Application .......................... SKIPPED
[INFO] Community Space .................................... SUCCESS [  0.036 s]
[INFO] Application Schema Support ......................... SUCCESS [  0.085 s]
[INFO] Application Schema Integration Test ................ SKIPPED
[INFO] Sample DataAccess Integration Test ................. SUCCESS [ 13.218 s]
[INFO] ArcSDE DataStore Extension ......................... SUCCESS [ 22.611 s]
[INFO] H2 DataStore Extension ............................. SUCCESS [ 21.264 s]
[INFO] SQL Server DataStore Extension ..................... SUCCESS [  1.081 s]
[INFO] Oracle DataStore Extension ......................... SUCCESS [  0.564 s]
[INFO] MySQL DataStore Extension .......................... SUCCESS [  0.344 s]
[INFO] DB2 DataStore Extension ............................ SUCCESS [  0.352 s]
[INFO] ImageMap Output Format ............................. SKIPPED
[INFO] ImageI/O-Ext GDAL Coverage Extension ............... SUCCESS [  7.825 s]
[INFO] JP2K Coverage Extension ............................ SUCCESS [  0.368 s]
[INFO] OGR parent ......................................... SUCCESS [  0.077 s]
[INFO] OGR CORE ........................................... SUCCESS [  3.614 s]
[INFO] OGR WFS ............................................ SUCCESS [ 11.167 s]
[INFO] Web Processing Service parent ...................... SUCCESS [  0.073 s]
[INFO] Web Processing Service Module ...................... SUCCESS [02:00 min]
[INFO] OGR WPS ............................................ SUCCESS [ 16.400 s]
[INFO] Excel Output Format ................................ SUCCESS [ 18.120 s]
[INFO] Chart external graphics support .................... SUCCESS [  0.623 s]
[INFO] Feature Generalization Extension ................... SUCCESS [  3.579 s]
[INFO] Image Mosaic JDBC Extension ........................ SUCCESS [  0.701 s]
[INFO] OWS request flow controller ........................ SUCCESS [ 21.560 s]
[INFO] Web process status sharing with Hazelcast .......... SUCCESS [ 30.736 s]
[INFO] Web Processing Service GUI ......................... SKIPPED
[INFO] GeoServer Layer Querying filter functions .......... SUCCESS [ 19.700 s]
[INFO] Teradata DataStore Extension ....................... SUCCESS [  2.924 s]
[INFO] GeoServer Monitor Extensions ....................... SUCCESS [  0.175 s]
[INFO] Core Monitor Extension ............................. SKIPPED
[INFO] GeoServer Security Extension Modules ............... SUCCESS [  0.076 s]
[INFO] GeoServer CAS Security Module ...................... SUCCESS [ 12.337 s]
[INFO] GeoServer Security Extension Web Modules ........... SUCCESS [  0.078 s]
[INFO] GeoServer CAS Security Web Module .................. SUCCESS [  4.698 s]
[INFO] XLST based WFS output format ....................... SUCCESS [ 41.884 s]
[INFO] GeoServer INSPIRE Extensions ....................... SKIPPED
[INFO] GeoServer CSS Styling .............................. SKIPPED
[INFO] Catalog Services for the Web parent ................ SUCCESS [  0.106 s]
[INFO] Catalog Services for the Web interfaces ............ SUCCESS [ 12.352 s]
[INFO] Catalog Services for the Web - Simple CatalogStore implementation SUCCESS [ 22.906 s]
[INFO] Catalog Services for the Web core module ........... SUCCESS [01:01 min]
[INFO] CSW UI Module ...................................... SUCCESS [ 15.631 s]
[INFO] DXF WFS output format and WPS PPIO ................. SUCCESS [  0.088 s]
[INFO] DXF WFS output format .............................. SUCCESS [ 18.005 s]
[INFO] DXF WPS PPIO ....................................... SUCCESS [ 19.271 s]
[INFO] GeoServer WCS 2.0 Earth Observation Extensions ..... SUCCESS [  0.076 s]
[INFO] Web Coverage Service 2.0 Earth Observation extensions SUCCESS [ 28.248 s]
[INFO] Web Coverage Service 2.0 Earth Observation GUI extension SUCCESS [ 21.827 s]
[INFO] GeoServer libjpeg-turbo Module ..................... SKIPPED
[INFO] GeoServer Data Importer ............................ SKIPPED
[INFO] Importer Core Module ............................... SKIPPED
[INFO] Importer REST Api Module-ng ........................ SKIPPED
[INFO] Importer Berkley DB Persistence Module ............. SKIPPED
[INFO] Importer Web UI Module ............................. SKIPPED
[INFO] GRIB Coverage Format ............................... SUCCESS [ 28.051 s]
[INFO] NetCDF Coverage format ............................. SKIPPED
[INFO] WCS NetCDF output Module ........................... SKIPPED
[INFO] Vector Tiles ....................................... SKIPPED
[INFO] Ysld GeoServer Plugin .............................. SKIPPED
[INFO] MongoDB Data Store ................................. SUCCESS [  2.291 s]
[INFO] ------------------------------------------------------------------------
[INFO] BUILD FAILURE
[INFO] ------------------------------------------------------------------------
[INFO] Total time: 18:37 min (Wall Clock)
[INFO] Finished at: 2019-02-11T09:30:04+00:00
[INFO] Final Memory: 138M/1357M
[INFO] ------------------------------------------------------------------------
[ERROR] Failed to execute goal org.apache.maven.plugins:maven-compiler-plugin:2.3.2:compile (default-compile) on project gs-wms: Compilation failure
[ERROR] <https://build.geoserver.org/job/geoserver-2.14.x/ws/src/wms/src/main/java/org/geoserver/wms/capabilities/DimensionHelper.java>:[234,34] error: cannot find symbol
[ERROR] -> [Help 1]
[ERROR]
[ERROR] To see the full stack trace of the errors, re-run Maven with the -e switch.
[ERROR] Re-run Maven using the -X switch to enable full debug logging.
[ERROR]
[ERROR] For more information about the errors and possible solutions, please read the following articles:
[ERROR] [Help 1] http://cwiki.apache.org/confluence/display/MAVEN/MojoFailureException
[ERROR]
[ERROR] After correcting the problems, you can resume the build with the command
[ERROR]   mvn <goals> -rf :gs-wms
Build step 'Invoke top-level Maven targets' marked build as failure


_______________________________________________
Geoserver-devel mailing list
[hidden email]
https://lists.sourceforge.net/lists/listinfo/geoserver-devel
Reply | Threaded
Open this post in threaded view
|

Build failed in Jenkins: geoserver-2.14.x #190

monitor
See <https://build.geoserver.org/job/geoserver-2.14.x/190/display/redirect>

------------------------------------------
[...truncated 836.04 KB...]
-------------------------------------------------------
Running org.geoserver.security.cas.CasAuthenticationTest
Tests run: 5, Failures: 0, Errors: 0, Skipped: 5, Time elapsed: 1.906 sec
Running org.geoserver.security.cas.CasFilterConfigValidatorTest
Tests run: 1, Failures: 0, Errors: 0, Skipped: 0, Time elapsed: 0.619 sec

Results :

Tests run: 6, Failures: 0, Errors: 0, Skipped: 5

[INFO]
[INFO] --- maven-jar-plugin:2.4:jar (default-jar) @ gs-sec-cas ---
[INFO] Building jar: <https://build.geoserver.org/job/geoserver-2.14.x/ws/src/extension/security/cas/target/gs-sec-cas-2.14-SNAPSHOT.jar>
[INFO]
[INFO] --- maven-jar-plugin:2.4:test-jar (default) @ gs-sec-cas ---
[INFO] Building jar: <https://build.geoserver.org/job/geoserver-2.14.x/ws/src/extension/security/cas/target/gs-sec-cas-2.14-SNAPSHOT-tests.jar>
[INFO]
[INFO] --- maven-source-plugin:2.2.1:jar-no-fork (attach-sources) @ gs-sec-cas ---
[INFO] Building jar: <https://build.geoserver.org/job/geoserver-2.14.x/ws/src/extension/security/cas/target/gs-sec-cas-2.14-SNAPSHOT-sources.jar>
[INFO]
[INFO] --- maven-source-plugin:2.2.1:test-jar-no-fork (attach-sources) @ gs-sec-cas ---
[INFO] Building jar: <https://build.geoserver.org/job/geoserver-2.14.x/ws/src/extension/security/cas/target/gs-sec-cas-2.14-SNAPSHOT-test-sources.jar>
[INFO]
[INFO] --- fmt-maven-plugin:2.4.0:check (default) @ gs-sec-cas ---
[debug] Using AOSP style
[INFO] Processed 14 files (0 non-complying).
[INFO]
[INFO] --- maven-install-plugin:2.4:install (default-install) @ gs-sec-cas ---
[INFO] Installing <https://build.geoserver.org/job/geoserver-2.14.x/ws/src/extension/security/cas/target/gs-sec-cas-2.14-SNAPSHOT.jar> to /var/jenkins/.m2/repository/org/geoserver/security/gs-sec-cas/2.14-SNAPSHOT/gs-sec-cas-2.14-SNAPSHOT.jar
[INFO] Installing <https://build.geoserver.org/job/geoserver-2.14.x/ws/src/extension/security/cas/pom.xml> to /var/jenkins/.m2/repository/org/geoserver/security/gs-sec-cas/2.14-SNAPSHOT/gs-sec-cas-2.14-SNAPSHOT.pom
[INFO] Installing <https://build.geoserver.org/job/geoserver-2.14.x/ws/src/extension/security/cas/target/gs-sec-cas-2.14-SNAPSHOT-tests.jar> to /var/jenkins/.m2/repository/org/geoserver/security/gs-sec-cas/2.14-SNAPSHOT/gs-sec-cas-2.14-SNAPSHOT-tests.jar
[INFO] Installing <https://build.geoserver.org/job/geoserver-2.14.x/ws/src/extension/security/cas/target/gs-sec-cas-2.14-SNAPSHOT-sources.jar> to /var/jenkins/.m2/repository/org/geoserver/security/gs-sec-cas/2.14-SNAPSHOT/gs-sec-cas-2.14-SNAPSHOT-sources.jar
[INFO] Installing <https://build.geoserver.org/job/geoserver-2.14.x/ws/src/extension/security/cas/target/gs-sec-cas-2.14-SNAPSHOT-test-sources.jar> to /var/jenkins/.m2/repository/org/geoserver/security/gs-sec-cas/2.14-SNAPSHOT/gs-sec-cas-2.14-SNAPSHOT-test-sources.jar
[INFO]                                                                        
[INFO] ------------------------------------------------------------------------
[INFO] Building GeoServer CAS Security Web Module 2.14-SNAPSHOT
[INFO] ------------------------------------------------------------------------
[INFO]
[INFO] --- maven-clean-plugin:2.5:clean (default-clean) @ gs-web-sec-cas ---
[INFO] Deleting <https://build.geoserver.org/job/geoserver-2.14.x/ws/src/extension/security/web/web-cas/target>
[INFO]
[INFO] --- git-commit-id-plugin:2.1.15:revision (default) @ gs-web-sec-cas ---
[INFO]
[INFO] --- maven-resources-plugin:2.6:resources (default-resources) @ gs-web-sec-cas ---
[INFO] Using 'UTF-8' encoding to copy filtered resources.
[INFO] Copying 2 resources
[INFO] skip non existing resourceDirectory <https://build.geoserver.org/job/geoserver-2.14.x/ws/src/extension/security/web/web-cas/src/main/resources>
[INFO]
[INFO] --- maven-compiler-plugin:2.3.2:compile (default-compile) @ gs-web-sec-cas ---
[INFO] Compiling 2 source files to <https://build.geoserver.org/job/geoserver-2.14.x/ws/src/extension/security/web/web-cas/target/classes>
[INFO]
[INFO] --- maven-resources-plugin:2.6:testResources (default-testResources) @ gs-web-csw ---
[INFO] Using 'UTF-8' encoding to copy filtered resources.
[INFO] Copying 0 resource
[INFO] skip non existing resourceDirectory <https://build.geoserver.org/job/geoserver-2.14.x/ws/src/extension/csw/web-csw/src/test/resources>
[INFO]
[INFO] --- maven-compiler-plugin:2.3.2:testCompile (default-testCompile) @ gs-web-csw ---
[INFO] Compiling 1 source file to <https://build.geoserver.org/job/geoserver-2.14.x/ws/src/extension/csw/web-csw/target/test-classes>
[INFO]
[INFO] --- maven-surefire-plugin:2.12.3:test (default-test) @ gs-web-csw ---
[INFO] Surefire report directory: <https://build.geoserver.org/job/geoserver-2.14.x/ws/src/extension/csw/web-csw/target/surefire-reports>

-------------------------------------------------------
 T E S T S
-------------------------------------------------------
[INFO]
[INFO] --- maven-resources-plugin:2.6:testResources (default-testResources) @ gs-web-sec-cas ---
[INFO] Using 'UTF-8' encoding to copy filtered resources.
[INFO] skip non existing resourceDirectory <https://build.geoserver.org/job/geoserver-2.14.x/ws/src/extension/security/web/web-cas/src/test/java>
[INFO] skip non existing resourceDirectory <https://build.geoserver.org/job/geoserver-2.14.x/ws/src/extension/security/web/web-cas/src/test/resources>
[INFO]
[INFO] --- maven-compiler-plugin:2.3.2:testCompile (default-testCompile) @ gs-web-sec-cas ---
[INFO] No sources to compile
[INFO]
[INFO] --- maven-surefire-plugin:2.12.3:test (default-test) @ gs-web-sec-cas ---
[INFO] No tests to run.
[INFO]
[INFO] --- maven-jar-plugin:2.4:jar (default-jar) @ gs-web-sec-cas ---
[INFO] Building jar: <https://build.geoserver.org/job/geoserver-2.14.x/ws/src/extension/security/web/web-cas/target/gs-web-sec-cas-2.14-SNAPSHOT.jar>
[INFO]
[INFO] --- maven-jar-plugin:2.4:test-jar (default) @ gs-web-sec-cas ---
[WARNING] JAR will be empty - no content was marked for inclusion!
[INFO] Building jar: <https://build.geoserver.org/job/geoserver-2.14.x/ws/src/extension/security/web/web-cas/target/gs-web-sec-cas-2.14-SNAPSHOT-tests.jar>
[INFO]
[INFO] --- maven-source-plugin:2.2.1:jar-no-fork (attach-sources) @ gs-web-sec-cas ---
[INFO] Building jar: <https://build.geoserver.org/job/geoserver-2.14.x/ws/src/extension/security/web/web-cas/target/gs-web-sec-cas-2.14-SNAPSHOT-sources.jar>
[INFO]
[INFO] --- maven-source-plugin:2.2.1:test-jar-no-fork (attach-sources) @ gs-web-sec-cas ---
[INFO] No sources in project. Archive not created.
[INFO]
[INFO] --- fmt-maven-plugin:2.4.0:check (default) @ gs-web-sec-cas ---
[warn] Test source directory '<https://build.geoserver.org/job/geoserver-2.14.x/ws/src/extension/security/web/web-cas/src/test/java'> does not exist, ignoring.
[debug] Using AOSP style
[INFO] Processed 2 files (0 non-complying).
[INFO]
[INFO] --- maven-install-plugin:2.4:install (default-install) @ gs-web-sec-cas ---
[INFO] Installing <https://build.geoserver.org/job/geoserver-2.14.x/ws/src/extension/security/web/web-cas/target/gs-web-sec-cas-2.14-SNAPSHOT.jar> to /var/jenkins/.m2/repository/org/geoserver/security/gs-web-sec-cas/2.14-SNAPSHOT/gs-web-sec-cas-2.14-SNAPSHOT.jar
[INFO] Installing <https://build.geoserver.org/job/geoserver-2.14.x/ws/src/extension/security/web/web-cas/pom.xml> to /var/jenkins/.m2/repository/org/geoserver/security/gs-web-sec-cas/2.14-SNAPSHOT/gs-web-sec-cas-2.14-SNAPSHOT.pom
[INFO] Installing <https://build.geoserver.org/job/geoserver-2.14.x/ws/src/extension/security/web/web-cas/target/gs-web-sec-cas-2.14-SNAPSHOT-tests.jar> to /var/jenkins/.m2/repository/org/geoserver/security/gs-web-sec-cas/2.14-SNAPSHOT/gs-web-sec-cas-2.14-SNAPSHOT-tests.jar
[INFO] Installing <https://build.geoserver.org/job/geoserver-2.14.x/ws/src/extension/security/web/web-cas/target/gs-web-sec-cas-2.14-SNAPSHOT-sources.jar> to /var/jenkins/.m2/repository/org/geoserver/security/gs-web-sec-cas/2.14-SNAPSHOT/gs-web-sec-cas-2.14-SNAPSHOT-sources.jar
Running org.geoserver.wfs.web.CSWAdminPageTest
Tests run: 1, Failures: 0, Errors: 0, Skipped: 0, Time elapsed: 6.286 sec

Results :

Tests run: 1, Failures: 0, Errors: 0, Skipped: 0

[INFO]
[INFO] --- maven-jar-plugin:2.4:jar (default-jar) @ gs-web-csw ---
[INFO] Building jar: <https://build.geoserver.org/job/geoserver-2.14.x/ws/src/extension/csw/web-csw/target/gs-web-csw-2.14-SNAPSHOT.jar>
[INFO]
[INFO] --- maven-jar-plugin:2.4:test-jar (default) @ gs-web-csw ---
[INFO] Building jar: <https://build.geoserver.org/job/geoserver-2.14.x/ws/src/extension/csw/web-csw/target/gs-web-csw-2.14-SNAPSHOT-tests.jar>
[INFO]
[INFO] --- maven-source-plugin:2.2.1:jar-no-fork (attach-sources) @ gs-web-csw ---
[INFO] Building jar: <https://build.geoserver.org/job/geoserver-2.14.x/ws/src/extension/csw/web-csw/target/gs-web-csw-2.14-SNAPSHOT-sources.jar>
[INFO]
[INFO] --- maven-source-plugin:2.2.1:test-jar-no-fork (attach-sources) @ gs-web-csw ---
[INFO] Building jar: <https://build.geoserver.org/job/geoserver-2.14.x/ws/src/extension/csw/web-csw/target/gs-web-csw-2.14-SNAPSHOT-test-sources.jar>
[INFO]
[INFO] --- fmt-maven-plugin:2.4.0:check (default) @ gs-web-csw ---
[debug] Using AOSP style
[INFO] Processed 3 files (0 non-complying).
[INFO]
[INFO] --- maven-install-plugin:2.4:install (default-install) @ gs-web-csw ---
[INFO] Installing <https://build.geoserver.org/job/geoserver-2.14.x/ws/src/extension/csw/web-csw/target/gs-web-csw-2.14-SNAPSHOT.jar> to /var/jenkins/.m2/repository/org/geoserver/csw/gs-web-csw/2.14-SNAPSHOT/gs-web-csw-2.14-SNAPSHOT.jar
[INFO] Installing <https://build.geoserver.org/job/geoserver-2.14.x/ws/src/extension/csw/web-csw/pom.xml> to /var/jenkins/.m2/repository/org/geoserver/csw/gs-web-csw/2.14-SNAPSHOT/gs-web-csw-2.14-SNAPSHOT.pom
[INFO] Installing <https://build.geoserver.org/job/geoserver-2.14.x/ws/src/extension/csw/web-csw/target/gs-web-csw-2.14-SNAPSHOT-tests.jar> to /var/jenkins/.m2/repository/org/geoserver/csw/gs-web-csw/2.14-SNAPSHOT/gs-web-csw-2.14-SNAPSHOT-tests.jar
[INFO] Installing <https://build.geoserver.org/job/geoserver-2.14.x/ws/src/extension/csw/web-csw/target/gs-web-csw-2.14-SNAPSHOT-sources.jar> to /var/jenkins/.m2/repository/org/geoserver/csw/gs-web-csw/2.14-SNAPSHOT/gs-web-csw-2.14-SNAPSHOT-sources.jar
[INFO] Installing <https://build.geoserver.org/job/geoserver-2.14.x/ws/src/extension/csw/web-csw/target/gs-web-csw-2.14-SNAPSHOT-test-sources.jar> to /var/jenkins/.m2/repository/org/geoserver/csw/gs-web-csw/2.14-SNAPSHOT/gs-web-csw-2.14-SNAPSHOT-test-sources.jar
[INFO] ------------------------------------------------------------------------
[INFO] Reactor Summary:
[INFO]
[INFO] GeoServer .......................................... SUCCESS [ 10.784 s]
[INFO] Core Platform Module ............................... SUCCESS [ 20.367 s]
[INFO] Open Web Service Module ............................ SUCCESS [ 18.294 s]
[INFO] Main Module ........................................ SUCCESS [01:43 min]
[INFO] GeoServer Security Modules ......................... SUCCESS [  0.122 s]
[INFO] GeoServer Security Tests Module .................... SUCCESS [02:01 min]
[INFO] GeoServer JDBC Security Module ..................... SUCCESS [ 46.793 s]
[INFO] GeoServer LDAP Security Module ..................... SUCCESS [ 45.210 s]
[INFO] Web Coverage Service Module ........................ SUCCESS [  6.796 s]
[INFO] Web Coverage Service 1.0 Module .................... SUCCESS [ 34.000 s]
[INFO] Web Coverage Service 1.1 Module .................... SUCCESS [ 47.270 s]
[INFO] Web Coverage Service 2.0 Module .................... SUCCESS [01:07 min]
[INFO] Web Feature Service Module ......................... SUCCESS [02:37 min]
[INFO] Web Map Service Module ............................. FAILURE [ 10.983 s]
[INFO] KML support for GeoServer .......................... SKIPPED
[INFO] gs-rest ............................................ SUCCESS [ 24.067 s]
[INFO] GeoWebCache (GWC) Module ........................... SKIPPED
[INFO] gs-restconfig ...................................... SUCCESS [02:30 min]
[INFO] gs-restconfig-wcs .................................. SUCCESS [ 38.234 s]
[INFO] gs-restconfig-wfs .................................. SUCCESS [ 36.037 s]
[INFO] gs-restconfig-wms .................................. SKIPPED
[INFO] GeoServer Web Modules .............................. SUCCESS [  0.155 s]
[INFO] Core UI Module ..................................... SUCCESS [02:01 min]
[INFO] WMS UI Module ...................................... SKIPPED
[INFO] GWC UI Module ...................................... SKIPPED
[INFO] WFS UI Module ...................................... SUCCESS [ 19.393 s]
[INFO] Demos Module ....................................... SKIPPED
[INFO] WCS UI Module ...................................... SKIPPED
[INFO] Security UI Modules ................................ SUCCESS [  0.111 s]
[INFO] Security UI Core Module ............................ SUCCESS [03:16 min]
[INFO] Security UI JDBC Module ............................ SUCCESS [02:02 min]
[INFO] Security UI LDAP Module ............................ SUCCESS [ 34.751 s]
[INFO] REST UI Module ..................................... SUCCESS [ 23.378 s]
[INFO] GeoServer Extensions ............................... SUCCESS [  0.078 s]
[INFO] Printing Module .................................... SUCCESS [ 16.714 s]
[INFO] GeoServer Web Application .......................... SKIPPED
[INFO] Community Space .................................... SUCCESS [  0.067 s]
[INFO] Application Schema Support ......................... SUCCESS [  0.059 s]
[INFO] Application Schema Integration Test ................ SKIPPED
[INFO] Sample DataAccess Integration Test ................. SUCCESS [ 16.864 s]
[INFO] ArcSDE DataStore Extension ......................... SUCCESS [ 15.033 s]
[INFO] H2 DataStore Extension ............................. SUCCESS [ 25.609 s]
[INFO] SQL Server DataStore Extension ..................... SUCCESS [  1.330 s]
[INFO] Oracle DataStore Extension ......................... SUCCESS [  0.487 s]
[INFO] MySQL DataStore Extension .......................... SUCCESS [  0.317 s]
[INFO] DB2 DataStore Extension ............................ SUCCESS [  0.327 s]
[INFO] ImageMap Output Format ............................. SKIPPED
[INFO] ImageI/O-Ext GDAL Coverage Extension ............... SUCCESS [  7.230 s]
[INFO] JP2K Coverage Extension ............................ SUCCESS [  0.327 s]
[INFO] OGR parent ......................................... SUCCESS [  0.056 s]
[INFO] OGR CORE ........................................... SUCCESS [  5.243 s]
[INFO] OGR WFS ............................................ SUCCESS [ 24.046 s]
[INFO] Web Processing Service parent ...................... SUCCESS [  0.046 s]
[INFO] Web Processing Service Module ...................... SUCCESS [02:16 min]
[INFO] OGR WPS ............................................ SUCCESS [ 18.859 s]
[INFO] Excel Output Format ................................ SUCCESS [ 24.547 s]
[INFO] Chart external graphics support .................... SUCCESS [  0.566 s]
[INFO] Feature Generalization Extension ................... SUCCESS [  6.083 s]
[INFO] Image Mosaic JDBC Extension ........................ SUCCESS [  0.598 s]
[INFO] OWS request flow controller ........................ SUCCESS [ 25.642 s]
[INFO] Web process status sharing with Hazelcast .......... SUCCESS [ 25.446 s]
[INFO] Web Processing Service GUI ......................... SKIPPED
[INFO] GeoServer Layer Querying filter functions .......... SUCCESS [ 27.488 s]
[INFO] Teradata DataStore Extension ....................... SUCCESS [  4.600 s]
[INFO] GeoServer Monitor Extensions ....................... SUCCESS [  0.090 s]
[INFO] Core Monitor Extension ............................. SKIPPED
[INFO] GeoServer Security Extension Modules ............... SUCCESS [  0.122 s]
[INFO] GeoServer CAS Security Module ...................... SUCCESS [ 12.930 s]
[INFO] GeoServer Security Extension Web Modules ........... SUCCESS [  0.106 s]
[INFO] GeoServer CAS Security Web Module .................. SUCCESS [  4.390 s]
[INFO] XLST based WFS output format ....................... SUCCESS [ 33.434 s]
[INFO] GeoServer INSPIRE Extensions ....................... SKIPPED
[INFO] GeoServer CSS Styling .............................. SKIPPED
[INFO] Catalog Services for the Web parent ................ SUCCESS [  0.185 s]
[INFO] Catalog Services for the Web interfaces ............ SUCCESS [ 20.565 s]
[INFO] Catalog Services for the Web - Simple CatalogStore implementation SUCCESS [ 20.865 s]
[INFO] Catalog Services for the Web core module ........... SUCCESS [01:04 min]
[INFO] CSW UI Module ...................................... SUCCESS [ 15.092 s]
[INFO] DXF WFS output format and WPS PPIO ................. SUCCESS [  0.063 s]
[INFO] DXF WFS output format .............................. SUCCESS [ 26.630 s]
[INFO] DXF WPS PPIO ....................................... SUCCESS [ 17.637 s]
[INFO] GeoServer WCS 2.0 Earth Observation Extensions ..... SUCCESS [  0.052 s]
[INFO] Web Coverage Service 2.0 Earth Observation extensions SUCCESS [ 36.685 s]
[INFO] Web Coverage Service 2.0 Earth Observation GUI extension SUCCESS [ 22.578 s]
[INFO] GeoServer libjpeg-turbo Module ..................... SKIPPED
[INFO] GeoServer Data Importer ............................ SKIPPED
[INFO] Importer Core Module ............................... SKIPPED
[INFO] Importer REST Api Module-ng ........................ SKIPPED
[INFO] Importer Berkley DB Persistence Module ............. SKIPPED
[INFO] Importer Web UI Module ............................. SKIPPED
[INFO] GRIB Coverage Format ............................... SUCCESS [ 25.748 s]
[INFO] NetCDF Coverage format ............................. SKIPPED
[INFO] WCS NetCDF output Module ........................... SKIPPED
[INFO] Vector Tiles ....................................... SKIPPED
[INFO] Ysld GeoServer Plugin .............................. SKIPPED
[INFO] MongoDB Data Store ................................. SUCCESS [  2.141 s]
[INFO] ------------------------------------------------------------------------
[INFO] BUILD FAILURE
[INFO] ------------------------------------------------------------------------
[INFO] Total time: 19:09 min (Wall Clock)
[INFO] Finished at: 2019-02-12T10:34:05+00:00
[INFO] Final Memory: 138M/1502M
[INFO] ------------------------------------------------------------------------
[ERROR] Failed to execute goal org.apache.maven.plugins:maven-compiler-plugin:2.3.2:compile (default-compile) on project gs-wms: Compilation failure
[ERROR] <https://build.geoserver.org/job/geoserver-2.14.x/ws/src/wms/src/main/java/org/geoserver/wms/capabilities/DimensionHelper.java>:[234,34] error: cannot find symbol
[ERROR] -> [Help 1]
[ERROR]
[ERROR] To see the full stack trace of the errors, re-run Maven with the -e switch.
[ERROR] Re-run Maven using the -X switch to enable full debug logging.
[ERROR]
[ERROR] For more information about the errors and possible solutions, please read the following articles:
[ERROR] [Help 1] http://cwiki.apache.org/confluence/display/MAVEN/MojoFailureException
[ERROR]
[ERROR] After correcting the problems, you can resume the build with the command
[ERROR]   mvn <goals> -rf :gs-wms
Build step 'Invoke top-level Maven targets' marked build as failure


_______________________________________________
Geoserver-devel mailing list
[hidden email]
https://lists.sourceforge.net/lists/listinfo/geoserver-devel
Reply | Threaded
Open this post in threaded view
|

Build failed in Jenkins: geoserver-2.14.x #191

monitor
See <https://build.geoserver.org/job/geoserver-2.14.x/191/display/redirect>

------------------------------------------
[...truncated 832.65 KB...]
[INFO] --- maven-compiler-plugin:2.3.2:testCompile (default-testCompile) @ gs-web-csw ---
[INFO] Compiling 1 source file to <https://build.geoserver.org/job/geoserver-2.14.x/ws/src/extension/csw/web-csw/target/test-classes>
[INFO]
[INFO] --- maven-surefire-plugin:2.12.3:test (default-test) @ gs-sec-cas ---
[INFO] Surefire report directory: <https://build.geoserver.org/job/geoserver-2.14.x/ws/src/extension/security/cas/target/surefire-reports>

-------------------------------------------------------
 T E S T S
-------------------------------------------------------
[INFO]
[INFO] --- maven-surefire-plugin:2.12.3:test (default-test) @ gs-web-csw ---
[INFO] Surefire report directory: <https://build.geoserver.org/job/geoserver-2.14.x/ws/src/extension/csw/web-csw/target/surefire-reports>

-------------------------------------------------------
 T E S T S
-------------------------------------------------------
Running org.geoserver.security.cas.CasAuthenticationTest
Running org.geoserver.wfs.web.CSWAdminPageTest
Tests run: 5, Failures: 0, Errors: 0, Skipped: 5, Time elapsed: 1.265 sec
Running org.geoserver.security.cas.CasFilterConfigValidatorTest
Tests run: 1, Failures: 0, Errors: 0, Skipped: 0, Time elapsed: 0.621 sec

Results :

Tests run: 6, Failures: 0, Errors: 0, Skipped: 5

[INFO]
[INFO] --- maven-jar-plugin:2.4:jar (default-jar) @ gs-sec-cas ---
[INFO] Building jar: <https://build.geoserver.org/job/geoserver-2.14.x/ws/src/extension/security/cas/target/gs-sec-cas-2.14-SNAPSHOT.jar>
[INFO]
[INFO] --- maven-jar-plugin:2.4:test-jar (default) @ gs-sec-cas ---
[INFO] Building jar: <https://build.geoserver.org/job/geoserver-2.14.x/ws/src/extension/security/cas/target/gs-sec-cas-2.14-SNAPSHOT-tests.jar>
[INFO]
[INFO] --- maven-source-plugin:2.2.1:jar-no-fork (attach-sources) @ gs-sec-cas ---
[INFO] Building jar: <https://build.geoserver.org/job/geoserver-2.14.x/ws/src/extension/security/cas/target/gs-sec-cas-2.14-SNAPSHOT-sources.jar>
[INFO]
[INFO] --- maven-source-plugin:2.2.1:test-jar-no-fork (attach-sources) @ gs-sec-cas ---
[INFO] Building jar: <https://build.geoserver.org/job/geoserver-2.14.x/ws/src/extension/security/cas/target/gs-sec-cas-2.14-SNAPSHOT-test-sources.jar>
[INFO]
[INFO] --- fmt-maven-plugin:2.4.0:check (default) @ gs-sec-cas ---
[debug] Using AOSP style
[INFO] Processed 14 files (0 non-complying).
[INFO]
[INFO] --- maven-install-plugin:2.4:install (default-install) @ gs-sec-cas ---
[INFO] Installing <https://build.geoserver.org/job/geoserver-2.14.x/ws/src/extension/security/cas/target/gs-sec-cas-2.14-SNAPSHOT.jar> to /var/jenkins/.m2/repository/org/geoserver/security/gs-sec-cas/2.14-SNAPSHOT/gs-sec-cas-2.14-SNAPSHOT.jar
[INFO] Installing <https://build.geoserver.org/job/geoserver-2.14.x/ws/src/extension/security/cas/pom.xml> to /var/jenkins/.m2/repository/org/geoserver/security/gs-sec-cas/2.14-SNAPSHOT/gs-sec-cas-2.14-SNAPSHOT.pom
[INFO] Installing <https://build.geoserver.org/job/geoserver-2.14.x/ws/src/extension/security/cas/target/gs-sec-cas-2.14-SNAPSHOT-tests.jar> to /var/jenkins/.m2/repository/org/geoserver/security/gs-sec-cas/2.14-SNAPSHOT/gs-sec-cas-2.14-SNAPSHOT-tests.jar
[INFO] Installing <https://build.geoserver.org/job/geoserver-2.14.x/ws/src/extension/security/cas/target/gs-sec-cas-2.14-SNAPSHOT-sources.jar> to /var/jenkins/.m2/repository/org/geoserver/security/gs-sec-cas/2.14-SNAPSHOT/gs-sec-cas-2.14-SNAPSHOT-sources.jar
[INFO] Installing <https://build.geoserver.org/job/geoserver-2.14.x/ws/src/extension/security/cas/target/gs-sec-cas-2.14-SNAPSHOT-test-sources.jar> to /var/jenkins/.m2/repository/org/geoserver/security/gs-sec-cas/2.14-SNAPSHOT/gs-sec-cas-2.14-SNAPSHOT-test-sources.jar
[INFO]                                                                        
[INFO] ------------------------------------------------------------------------
[INFO] Building GeoServer CAS Security Web Module 2.14-SNAPSHOT
[INFO] ------------------------------------------------------------------------
[INFO]
[INFO] --- maven-clean-plugin:2.5:clean (default-clean) @ gs-web-sec-cas ---
[INFO] Deleting <https://build.geoserver.org/job/geoserver-2.14.x/ws/src/extension/security/web/web-cas/target>
[INFO]
[INFO] --- git-commit-id-plugin:2.1.15:revision (default) @ gs-web-sec-cas ---
[INFO]
[INFO] --- maven-resources-plugin:2.6:resources (default-resources) @ gs-web-sec-cas ---
[INFO] Using 'UTF-8' encoding to copy filtered resources.
[INFO] Copying 2 resources
[INFO] skip non existing resourceDirectory <https://build.geoserver.org/job/geoserver-2.14.x/ws/src/extension/security/web/web-cas/src/main/resources>
[INFO]
[INFO] --- maven-compiler-plugin:2.3.2:compile (default-compile) @ gs-web-sec-cas ---
[INFO] Compiling 2 source files to <https://build.geoserver.org/job/geoserver-2.14.x/ws/src/extension/security/web/web-cas/target/classes>
[INFO]
[INFO] --- maven-resources-plugin:2.6:testResources (default-testResources) @ gs-web-sec-cas ---
[INFO] Using 'UTF-8' encoding to copy filtered resources.
[INFO] skip non existing resourceDirectory <https://build.geoserver.org/job/geoserver-2.14.x/ws/src/extension/security/web/web-cas/src/test/java>
[INFO] skip non existing resourceDirectory <https://build.geoserver.org/job/geoserver-2.14.x/ws/src/extension/security/web/web-cas/src/test/resources>
[INFO]
[INFO] --- maven-compiler-plugin:2.3.2:testCompile (default-testCompile) @ gs-web-sec-cas ---
[INFO] No sources to compile
[INFO]
[INFO] --- maven-surefire-plugin:2.12.3:test (default-test) @ gs-web-sec-cas ---
[INFO] No tests to run.
[INFO]
[INFO] --- maven-jar-plugin:2.4:jar (default-jar) @ gs-web-sec-cas ---
[INFO] Building jar: <https://build.geoserver.org/job/geoserver-2.14.x/ws/src/extension/security/web/web-cas/target/gs-web-sec-cas-2.14-SNAPSHOT.jar>
[INFO]
[INFO] --- maven-jar-plugin:2.4:test-jar (default) @ gs-web-sec-cas ---
[WARNING] JAR will be empty - no content was marked for inclusion!
[INFO] Building jar: <https://build.geoserver.org/job/geoserver-2.14.x/ws/src/extension/security/web/web-cas/target/gs-web-sec-cas-2.14-SNAPSHOT-tests.jar>
[INFO]
[INFO] --- maven-source-plugin:2.2.1:jar-no-fork (attach-sources) @ gs-web-sec-cas ---
[INFO] Building jar: <https://build.geoserver.org/job/geoserver-2.14.x/ws/src/extension/security/web/web-cas/target/gs-web-sec-cas-2.14-SNAPSHOT-sources.jar>
[INFO]
[INFO] --- maven-source-plugin:2.2.1:test-jar-no-fork (attach-sources) @ gs-web-sec-cas ---
[INFO] No sources in project. Archive not created.
[INFO]
[INFO] --- fmt-maven-plugin:2.4.0:check (default) @ gs-web-sec-cas ---
[warn] Test source directory '<https://build.geoserver.org/job/geoserver-2.14.x/ws/src/extension/security/web/web-cas/src/test/java'> does not exist, ignoring.
[debug] Using AOSP style
[INFO] Processed 2 files (0 non-complying).
[INFO]
[INFO] --- maven-install-plugin:2.4:install (default-install) @ gs-web-sec-cas ---
[INFO] Installing <https://build.geoserver.org/job/geoserver-2.14.x/ws/src/extension/security/web/web-cas/target/gs-web-sec-cas-2.14-SNAPSHOT.jar> to /var/jenkins/.m2/repository/org/geoserver/security/gs-web-sec-cas/2.14-SNAPSHOT/gs-web-sec-cas-2.14-SNAPSHOT.jar
[INFO] Installing <https://build.geoserver.org/job/geoserver-2.14.x/ws/src/extension/security/web/web-cas/pom.xml> to /var/jenkins/.m2/repository/org/geoserver/security/gs-web-sec-cas/2.14-SNAPSHOT/gs-web-sec-cas-2.14-SNAPSHOT.pom
[INFO] Installing <https://build.geoserver.org/job/geoserver-2.14.x/ws/src/extension/security/web/web-cas/target/gs-web-sec-cas-2.14-SNAPSHOT-tests.jar> to /var/jenkins/.m2/repository/org/geoserver/security/gs-web-sec-cas/2.14-SNAPSHOT/gs-web-sec-cas-2.14-SNAPSHOT-tests.jar
[INFO] Installing <https://build.geoserver.org/job/geoserver-2.14.x/ws/src/extension/security/web/web-cas/target/gs-web-sec-cas-2.14-SNAPSHOT-sources.jar> to /var/jenkins/.m2/repository/org/geoserver/security/gs-web-sec-cas/2.14-SNAPSHOT/gs-web-sec-cas-2.14-SNAPSHOT-sources.jar
Tests run: 1, Failures: 0, Errors: 0, Skipped: 0, Time elapsed: 11.189 sec

Results :

Tests run: 1, Failures: 0, Errors: 0, Skipped: 0

[INFO]
[INFO] --- maven-jar-plugin:2.4:jar (default-jar) @ gs-web-csw ---
[INFO] Building jar: <https://build.geoserver.org/job/geoserver-2.14.x/ws/src/extension/csw/web-csw/target/gs-web-csw-2.14-SNAPSHOT.jar>
[INFO]
[INFO] --- maven-jar-plugin:2.4:test-jar (default) @ gs-web-csw ---
[INFO] Building jar: <https://build.geoserver.org/job/geoserver-2.14.x/ws/src/extension/csw/web-csw/target/gs-web-csw-2.14-SNAPSHOT-tests.jar>
[INFO]
[INFO] --- maven-source-plugin:2.2.1:jar-no-fork (attach-sources) @ gs-web-csw ---
[INFO] Building jar: <https://build.geoserver.org/job/geoserver-2.14.x/ws/src/extension/csw/web-csw/target/gs-web-csw-2.14-SNAPSHOT-sources.jar>
[INFO]
[INFO] --- maven-source-plugin:2.2.1:test-jar-no-fork (attach-sources) @ gs-web-csw ---
[INFO] Building jar: <https://build.geoserver.org/job/geoserver-2.14.x/ws/src/extension/csw/web-csw/target/gs-web-csw-2.14-SNAPSHOT-test-sources.jar>
[INFO]
[INFO] --- fmt-maven-plugin:2.4.0:check (default) @ gs-web-csw ---
[debug] Using AOSP style
[INFO] Processed 3 files (0 non-complying).
[INFO]
[INFO] --- maven-install-plugin:2.4:install (default-install) @ gs-web-csw ---
[INFO] Installing <https://build.geoserver.org/job/geoserver-2.14.x/ws/src/extension/csw/web-csw/target/gs-web-csw-2.14-SNAPSHOT.jar> to /var/jenkins/.m2/repository/org/geoserver/csw/gs-web-csw/2.14-SNAPSHOT/gs-web-csw-2.14-SNAPSHOT.jar
[INFO] Installing <https://build.geoserver.org/job/geoserver-2.14.x/ws/src/extension/csw/web-csw/pom.xml> to /var/jenkins/.m2/repository/org/geoserver/csw/gs-web-csw/2.14-SNAPSHOT/gs-web-csw-2.14-SNAPSHOT.pom
[INFO] Installing <https://build.geoserver.org/job/geoserver-2.14.x/ws/src/extension/csw/web-csw/target/gs-web-csw-2.14-SNAPSHOT-tests.jar> to /var/jenkins/.m2/repository/org/geoserver/csw/gs-web-csw/2.14-SNAPSHOT/gs-web-csw-2.14-SNAPSHOT-tests.jar
[INFO] Installing <https://build.geoserver.org/job/geoserver-2.14.x/ws/src/extension/csw/web-csw/target/gs-web-csw-2.14-SNAPSHOT-sources.jar> to /var/jenkins/.m2/repository/org/geoserver/csw/gs-web-csw/2.14-SNAPSHOT/gs-web-csw-2.14-SNAPSHOT-sources.jar
[INFO] Installing <https://build.geoserver.org/job/geoserver-2.14.x/ws/src/extension/csw/web-csw/target/gs-web-csw-2.14-SNAPSHOT-test-sources.jar> to /var/jenkins/.m2/repository/org/geoserver/csw/gs-web-csw/2.14-SNAPSHOT/gs-web-csw-2.14-SNAPSHOT-test-sources.jar
[INFO] ------------------------------------------------------------------------
[INFO] Reactor Summary:
[INFO]
[INFO] GeoServer .......................................... SUCCESS [  8.854 s]
[INFO] Core Platform Module ............................... SUCCESS [ 20.709 s]
[INFO] Open Web Service Module ............................ SUCCESS [ 20.064 s]
[INFO] Main Module ........................................ SUCCESS [01:51 min]
[INFO] GeoServer Security Modules ......................... SUCCESS [  0.105 s]
[INFO] GeoServer Security Tests Module .................... SUCCESS [01:59 min]
[INFO] GeoServer JDBC Security Module ..................... SUCCESS [ 59.355 s]
[INFO] GeoServer LDAP Security Module ..................... SUCCESS [ 37.706 s]
[INFO] Web Coverage Service Module ........................ SUCCESS [  5.815 s]
[INFO] Web Coverage Service 1.0 Module .................... SUCCESS [ 33.201 s]
[INFO] Web Coverage Service 1.1 Module .................... SUCCESS [ 42.995 s]
[INFO] Web Coverage Service 2.0 Module .................... SUCCESS [01:19 min]
[INFO] Web Feature Service Module ......................... SUCCESS [02:51 min]
[INFO] Web Map Service Module ............................. FAILURE [ 14.149 s]
[INFO] KML support for GeoServer .......................... SKIPPED
[INFO] gs-rest ............................................ SUCCESS [ 30.363 s]
[INFO] GeoWebCache (GWC) Module ........................... SKIPPED
[INFO] gs-restconfig ...................................... SUCCESS [02:41 min]
[INFO] gs-restconfig-wcs .................................. SUCCESS [ 29.789 s]
[INFO] gs-restconfig-wfs .................................. SUCCESS [ 38.650 s]
[INFO] gs-restconfig-wms .................................. SKIPPED
[INFO] GeoServer Web Modules .............................. SUCCESS [  0.110 s]
[INFO] Core UI Module ..................................... SUCCESS [02:01 min]
[INFO] WMS UI Module ...................................... SKIPPED
[INFO] GWC UI Module ...................................... SKIPPED
[INFO] WFS UI Module ...................................... SUCCESS [ 23.513 s]
[INFO] Demos Module ....................................... SKIPPED
[INFO] WCS UI Module ...................................... SKIPPED
[INFO] Security UI Modules ................................ SUCCESS [  0.140 s]
[INFO] Security UI Core Module ............................ SUCCESS [02:50 min]
[INFO] Security UI JDBC Module ............................ SUCCESS [02:19 min]
[INFO] Security UI LDAP Module ............................ SUCCESS [ 40.752 s]
[INFO] REST UI Module ..................................... SUCCESS [ 21.287 s]
[INFO] GeoServer Extensions ............................... SUCCESS [  0.077 s]
[INFO] Printing Module .................................... SUCCESS [ 23.308 s]
[INFO] GeoServer Web Application .......................... SKIPPED
[INFO] Community Space .................................... SUCCESS [  0.081 s]
[INFO] Application Schema Support ......................... SUCCESS [  0.060 s]
[INFO] Application Schema Integration Test ................ SKIPPED
[INFO] Sample DataAccess Integration Test ................. SUCCESS [ 18.753 s]
[INFO] ArcSDE DataStore Extension ......................... SUCCESS [ 19.555 s]
[INFO] H2 DataStore Extension ............................. SUCCESS [ 21.134 s]
[INFO] SQL Server DataStore Extension ..................... SUCCESS [  1.175 s]
[INFO] Oracle DataStore Extension ......................... SUCCESS [  0.532 s]
[INFO] MySQL DataStore Extension .......................... SUCCESS [  0.295 s]
[INFO] DB2 DataStore Extension ............................ SUCCESS [  0.290 s]
[INFO] ImageMap Output Format ............................. SKIPPED
[INFO] ImageI/O-Ext GDAL Coverage Extension ............... SUCCESS [  8.226 s]
[INFO] JP2K Coverage Extension ............................ SUCCESS [  0.370 s]
[INFO] OGR parent ......................................... SUCCESS [  0.080 s]
[INFO] OGR CORE ........................................... SUCCESS [  3.959 s]
[INFO] OGR WFS ............................................ SUCCESS [ 15.907 s]
[INFO] Web Processing Service parent ...................... SUCCESS [  0.040 s]
[INFO] Web Processing Service Module ...................... SUCCESS [02:32 min]
[INFO] OGR WPS ............................................ SUCCESS [ 19.999 s]
[INFO] Excel Output Format ................................ SUCCESS [ 26.306 s]
[INFO] Chart external graphics support .................... SUCCESS [  0.627 s]
[INFO] Feature Generalization Extension ................... SUCCESS [  5.385 s]
[INFO] Image Mosaic JDBC Extension ........................ SUCCESS [  0.601 s]
[INFO] OWS request flow controller ........................ SUCCESS [ 24.335 s]
[INFO] Web process status sharing with Hazelcast .......... SUCCESS [ 25.742 s]
[INFO] Web Processing Service GUI ......................... SKIPPED
[INFO] GeoServer Layer Querying filter functions .......... SUCCESS [ 29.020 s]
[INFO] Teradata DataStore Extension ....................... SUCCESS [  3.320 s]
[INFO] GeoServer Monitor Extensions ....................... SUCCESS [  0.088 s]
[INFO] Core Monitor Extension ............................. SKIPPED
[INFO] GeoServer Security Extension Modules ............... SUCCESS [  0.097 s]
[INFO] GeoServer CAS Security Module ...................... SUCCESS [ 13.387 s]
[INFO] GeoServer Security Extension Web Modules ........... SUCCESS [  0.104 s]
[INFO] GeoServer CAS Security Web Module .................. SUCCESS [  5.315 s]
[INFO] XLST based WFS output format ....................... SUCCESS [ 31.057 s]
[INFO] GeoServer INSPIRE Extensions ....................... SKIPPED
[INFO] GeoServer CSS Styling .............................. SKIPPED
[INFO] Catalog Services for the Web parent ................ SUCCESS [  0.075 s]
[INFO] Catalog Services for the Web interfaces ............ SUCCESS [ 16.517 s]
[INFO] Catalog Services for the Web - Simple CatalogStore implementation SUCCESS [ 19.660 s]
[INFO] Catalog Services for the Web core module ........... SUCCESS [01:08 min]
[INFO] CSW UI Module ...................................... SUCCESS [ 21.119 s]
[INFO] DXF WFS output format and WPS PPIO ................. SUCCESS [  0.082 s]
[INFO] DXF WFS output format .............................. SUCCESS [ 23.402 s]
[INFO] DXF WPS PPIO ....................................... SUCCESS [ 16.846 s]
[INFO] GeoServer WCS 2.0 Earth Observation Extensions ..... SUCCESS [  0.074 s]
[INFO] Web Coverage Service 2.0 Earth Observation extensions SUCCESS [ 32.003 s]
[INFO] Web Coverage Service 2.0 Earth Observation GUI extension SUCCESS [ 26.423 s]
[INFO] GeoServer libjpeg-turbo Module ..................... SKIPPED
[INFO] GeoServer Data Importer ............................ SKIPPED
[INFO] Importer Core Module ............................... SKIPPED
[INFO] Importer REST Api Module-ng ........................ SKIPPED
[INFO] Importer Berkley DB Persistence Module ............. SKIPPED
[INFO] Importer Web UI Module ............................. SKIPPED
[INFO] GRIB Coverage Format ............................... SUCCESS [ 24.759 s]
[INFO] NetCDF Coverage format ............................. SKIPPED
[INFO] WCS NetCDF output Module ........................... SKIPPED
[INFO] Vector Tiles ....................................... SKIPPED
[INFO] Ysld GeoServer Plugin .............................. SKIPPED
[INFO] MongoDB Data Store ................................. SUCCESS [  2.279 s]
[INFO] ------------------------------------------------------------------------
[INFO] BUILD FAILURE
[INFO] ------------------------------------------------------------------------
[INFO] Total time: 19:42 min (Wall Clock)
[INFO] Finished at: 2019-02-12T12:44:10+00:00
[INFO] Final Memory: 138M/1492M
[INFO] ------------------------------------------------------------------------
[ERROR] Failed to execute goal org.apache.maven.plugins:maven-compiler-plugin:2.3.2:compile (default-compile) on project gs-wms: Compilation failure
[ERROR] <https://build.geoserver.org/job/geoserver-2.14.x/ws/src/wms/src/main/java/org/geoserver/wms/capabilities/DimensionHelper.java>:[234,34] error: cannot find symbol
[ERROR] -> [Help 1]
[ERROR]
[ERROR] To see the full stack trace of the errors, re-run Maven with the -e switch.
[ERROR] Re-run Maven using the -X switch to enable full debug logging.
[ERROR]
[ERROR] For more information about the errors and possible solutions, please read the following articles:
[ERROR] [Help 1] http://cwiki.apache.org/confluence/display/MAVEN/MojoFailureException
[ERROR]
[ERROR] After correcting the problems, you can resume the build with the command
[ERROR]   mvn <goals> -rf :gs-wms
Build step 'Invoke top-level Maven targets' marked build as failure


_______________________________________________
Geoserver-devel mailing list
[hidden email]
https://lists.sourceforge.net/lists/listinfo/geoserver-devel
Reply | Threaded
Open this post in threaded view
|

Build failed in Jenkins: geoserver-2.14.x #192

monitor
See <https://build.geoserver.org/job/geoserver-2.14.x/192/display/redirect>

------------------------------------------
[...truncated 813.46 KB...]
[INFO]
[INFO] --- maven-install-plugin:2.4:install (default-install) @ gs-wps-cluster-hazelcast ---
[INFO] Installing <https://build.geoserver.org/job/geoserver-2.14.x/ws/src/extension/wps/wps-cluster-hazelcast/target/gs-wps-cluster-hazelcast-2.14-SNAPSHOT.jar> to /var/jenkins/.m2/repository/org/geoserver/extension/gs-wps-cluster-hazelcast/2.14-SNAPSHOT/gs-wps-cluster-hazelcast-2.14-SNAPSHOT.jar
[INFO] Installing <https://build.geoserver.org/job/geoserver-2.14.x/ws/src/extension/wps/wps-cluster-hazelcast/pom.xml> to /var/jenkins/.m2/repository/org/geoserver/extension/gs-wps-cluster-hazelcast/2.14-SNAPSHOT/gs-wps-cluster-hazelcast-2.14-SNAPSHOT.pom
[INFO] Installing <https://build.geoserver.org/job/geoserver-2.14.x/ws/src/extension/wps/wps-cluster-hazelcast/target/gs-wps-cluster-hazelcast-2.14-SNAPSHOT-tests.jar> to /var/jenkins/.m2/repository/org/geoserver/extension/gs-wps-cluster-hazelcast/2.14-SNAPSHOT/gs-wps-cluster-hazelcast-2.14-SNAPSHOT-tests.jar
[INFO] Installing <https://build.geoserver.org/job/geoserver-2.14.x/ws/src/extension/wps/wps-cluster-hazelcast/target/gs-wps-cluster-hazelcast-2.14-SNAPSHOT-sources.jar> to /var/jenkins/.m2/repository/org/geoserver/extension/gs-wps-cluster-hazelcast/2.14-SNAPSHOT/gs-wps-cluster-hazelcast-2.14-SNAPSHOT-sources.jar
[INFO] Installing <https://build.geoserver.org/job/geoserver-2.14.x/ws/src/extension/wps/wps-cluster-hazelcast/target/gs-wps-cluster-hazelcast-2.14-SNAPSHOT-test-sources.jar> to /var/jenkins/.m2/repository/org/geoserver/extension/gs-wps-cluster-hazelcast/2.14-SNAPSHOT/gs-wps-cluster-hazelcast-2.14-SNAPSHOT-test-sources.jar
[INFO]                                                                        
[INFO] ------------------------------------------------------------------------
[INFO] Building GeoServer Security Extension Web Modules 2.14-SNAPSHOT
[INFO] ------------------------------------------------------------------------
[INFO]
[INFO] --- maven-clean-plugin:2.5:clean (default-clean) @ gs-web-sec ---
[INFO] Deleting <https://build.geoserver.org/job/geoserver-2.14.x/ws/src/extension/security/web/target>
[INFO]
[INFO] --- git-commit-id-plugin:2.1.15:revision (default) @ gs-web-sec ---
[INFO]
[INFO] --- maven-jar-plugin:2.4:test-jar (default) @ gs-web-sec ---
[WARNING] JAR will be empty - no content was marked for inclusion!
[INFO] Building jar: <https://build.geoserver.org/job/geoserver-2.14.x/ws/src/extension/security/web/target/gs-web-sec-2.14-SNAPSHOT-tests.jar>
[INFO]
[INFO] --- maven-source-plugin:2.2.1:jar-no-fork (attach-sources) @ gs-web-sec ---
[INFO]
[INFO] --- maven-source-plugin:2.2.1:test-jar-no-fork (attach-sources) @ gs-web-sec ---
[INFO]
[INFO] --- fmt-maven-plugin:2.4.0:check (default) @ gs-web-sec ---
[warn] Source directory '<https://build.geoserver.org/job/geoserver-2.14.x/ws/src/extension/security/web/src/main/java'> does not exist, ignoring.
[warn] Test source directory '<https://build.geoserver.org/job/geoserver-2.14.x/ws/src/extension/security/web/src/test/java'> does not exist, ignoring.
[debug] Using AOSP style
[INFO] Processed 0 files (0 non-complying).
[INFO]
[INFO] --- maven-install-plugin:2.4:install (default-install) @ gs-web-sec ---
[INFO] Installing <https://build.geoserver.org/job/geoserver-2.14.x/ws/src/extension/security/web/pom.xml> to /var/jenkins/.m2/repository/org/geoserver/extension/gs-web-sec/2.14-SNAPSHOT/gs-web-sec-2.14-SNAPSHOT.pom
[INFO] Installing <https://build.geoserver.org/job/geoserver-2.14.x/ws/src/extension/security/web/target/gs-web-sec-2.14-SNAPSHOT-tests.jar> to /var/jenkins/.m2/repository/org/geoserver/extension/gs-web-sec/2.14-SNAPSHOT/gs-web-sec-2.14-SNAPSHOT-tests.jar
[INFO]                                                                        
[INFO] ------------------------------------------------------------------------
[INFO] Skipping GeoServer Web Application
[INFO] This project has been banned from the build due to previous failures.
[INFO] ------------------------------------------------------------------------
[INFO]
[INFO] --- maven-surefire-plugin:2.12.3:test (default-test) @ gs-sec-cas ---
[INFO] Surefire report directory: <https://build.geoserver.org/job/geoserver-2.14.x/ws/src/extension/security/cas/target/surefire-reports>

-------------------------------------------------------
 T E S T S
-------------------------------------------------------
Running org.geoserver.security.cas.CasAuthenticationTest
Tests run: 5, Failures: 0, Errors: 0, Skipped: 5, Time elapsed: 0.582 sec
Running org.geoserver.security.cas.CasFilterConfigValidatorTest
Tests run: 1, Failures: 0, Errors: 0, Skipped: 0, Time elapsed: 0.218 sec

Results :

Tests run: 6, Failures: 0, Errors: 0, Skipped: 5

[INFO]
[INFO] --- maven-jar-plugin:2.4:jar (default-jar) @ gs-sec-cas ---
[INFO] Building jar: <https://build.geoserver.org/job/geoserver-2.14.x/ws/src/extension/security/cas/target/gs-sec-cas-2.14-SNAPSHOT.jar>
[INFO]
[INFO] --- maven-jar-plugin:2.4:test-jar (default) @ gs-sec-cas ---
[INFO] Building jar: <https://build.geoserver.org/job/geoserver-2.14.x/ws/src/extension/security/cas/target/gs-sec-cas-2.14-SNAPSHOT-tests.jar>
[INFO]
[INFO] --- maven-source-plugin:2.2.1:jar-no-fork (attach-sources) @ gs-sec-cas ---
[INFO] Building jar: <https://build.geoserver.org/job/geoserver-2.14.x/ws/src/extension/security/cas/target/gs-sec-cas-2.14-SNAPSHOT-sources.jar>
[INFO]
[INFO] --- maven-source-plugin:2.2.1:test-jar-no-fork (attach-sources) @ gs-sec-cas ---
[INFO] Building jar: <https://build.geoserver.org/job/geoserver-2.14.x/ws/src/extension/security/cas/target/gs-sec-cas-2.14-SNAPSHOT-test-sources.jar>
[INFO]
[INFO] --- fmt-maven-plugin:2.4.0:check (default) @ gs-sec-cas ---
[debug] Using AOSP style
[INFO] Processed 14 files (0 non-complying).
[INFO]
[INFO] --- maven-install-plugin:2.4:install (default-install) @ gs-sec-cas ---
[INFO] Installing <https://build.geoserver.org/job/geoserver-2.14.x/ws/src/extension/security/cas/target/gs-sec-cas-2.14-SNAPSHOT.jar> to /var/jenkins/.m2/repository/org/geoserver/security/gs-sec-cas/2.14-SNAPSHOT/gs-sec-cas-2.14-SNAPSHOT.jar
[INFO] Installing <https://build.geoserver.org/job/geoserver-2.14.x/ws/src/extension/security/cas/pom.xml> to /var/jenkins/.m2/repository/org/geoserver/security/gs-sec-cas/2.14-SNAPSHOT/gs-sec-cas-2.14-SNAPSHOT.pom
[INFO] Installing <https://build.geoserver.org/job/geoserver-2.14.x/ws/src/extension/security/cas/target/gs-sec-cas-2.14-SNAPSHOT-tests.jar> to /var/jenkins/.m2/repository/org/geoserver/security/gs-sec-cas/2.14-SNAPSHOT/gs-sec-cas-2.14-SNAPSHOT-tests.jar
[INFO] Installing <https://build.geoserver.org/job/geoserver-2.14.x/ws/src/extension/security/cas/target/gs-sec-cas-2.14-SNAPSHOT-sources.jar> to /var/jenkins/.m2/repository/org/geoserver/security/gs-sec-cas/2.14-SNAPSHOT/gs-sec-cas-2.14-SNAPSHOT-sources.jar
[INFO] Installing <https://build.geoserver.org/job/geoserver-2.14.x/ws/src/extension/security/cas/target/gs-sec-cas-2.14-SNAPSHOT-test-sources.jar> to /var/jenkins/.m2/repository/org/geoserver/security/gs-sec-cas/2.14-SNAPSHOT/gs-sec-cas-2.14-SNAPSHOT-test-sources.jar
[INFO]                                                                        
[INFO] ------------------------------------------------------------------------
[INFO] Building GeoServer CAS Security Web Module 2.14-SNAPSHOT
[INFO] ------------------------------------------------------------------------
[INFO]
[INFO] --- maven-clean-plugin:2.5:clean (default-clean) @ gs-web-sec-cas ---
[INFO] Deleting <https://build.geoserver.org/job/geoserver-2.14.x/ws/src/extension/security/web/web-cas/target>
[INFO]
[INFO] --- git-commit-id-plugin:2.1.15:revision (default) @ gs-web-sec-cas ---
[INFO]
[INFO] --- maven-resources-plugin:2.6:resources (default-resources) @ gs-web-sec-cas ---
[INFO] Using 'UTF-8' encoding to copy filtered resources.
[INFO] Copying 2 resources
[INFO] skip non existing resourceDirectory <https://build.geoserver.org/job/geoserver-2.14.x/ws/src/extension/security/web/web-cas/src/main/resources>
[INFO]
[INFO] --- maven-compiler-plugin:2.3.2:compile (default-compile) @ gs-web-sec-cas ---
[INFO] Compiling 2 source files to <https://build.geoserver.org/job/geoserver-2.14.x/ws/src/extension/security/web/web-cas/target/classes>
[INFO]
[INFO] --- maven-resources-plugin:2.6:testResources (default-testResources) @ gs-web-sec-cas ---
[INFO] Using 'UTF-8' encoding to copy filtered resources.
[INFO] skip non existing resourceDirectory <https://build.geoserver.org/job/geoserver-2.14.x/ws/src/extension/security/web/web-cas/src/test/java>
[INFO] skip non existing resourceDirectory <https://build.geoserver.org/job/geoserver-2.14.x/ws/src/extension/security/web/web-cas/src/test/resources>
[INFO]
[INFO] --- maven-compiler-plugin:2.3.2:testCompile (default-testCompile) @ gs-web-sec-cas ---
[INFO] No sources to compile
[INFO]
[INFO] --- maven-surefire-plugin:2.12.3:test (default-test) @ gs-web-sec-cas ---
[INFO] No tests to run.
[INFO]
[INFO] --- maven-jar-plugin:2.4:jar (default-jar) @ gs-web-sec-cas ---
[INFO] Building jar: <https://build.geoserver.org/job/geoserver-2.14.x/ws/src/extension/security/web/web-cas/target/gs-web-sec-cas-2.14-SNAPSHOT.jar>
[INFO]
[INFO] --- maven-jar-plugin:2.4:test-jar (default) @ gs-web-sec-cas ---
[WARNING] JAR will be empty - no content was marked for inclusion!
[INFO] Building jar: <https://build.geoserver.org/job/geoserver-2.14.x/ws/src/extension/security/web/web-cas/target/gs-web-sec-cas-2.14-SNAPSHOT-tests.jar>
[INFO]
[INFO] --- maven-source-plugin:2.2.1:jar-no-fork (attach-sources) @ gs-web-sec-cas ---
[INFO] Building jar: <https://build.geoserver.org/job/geoserver-2.14.x/ws/src/extension/security/web/web-cas/target/gs-web-sec-cas-2.14-SNAPSHOT-sources.jar>
[INFO]
[INFO] --- maven-source-plugin:2.2.1:test-jar-no-fork (attach-sources) @ gs-web-sec-cas ---
[INFO] No sources in project. Archive not created.
[INFO]
[INFO] --- fmt-maven-plugin:2.4.0:check (default) @ gs-web-sec-cas ---
[warn] Test source directory '<https://build.geoserver.org/job/geoserver-2.14.x/ws/src/extension/security/web/web-cas/src/test/java'> does not exist, ignoring.
[debug] Using AOSP style
[INFO] Processed 2 files (0 non-complying).
[INFO]
[INFO] --- maven-install-plugin:2.4:install (default-install) @ gs-web-sec-cas ---
[INFO] Installing <https://build.geoserver.org/job/geoserver-2.14.x/ws/src/extension/security/web/web-cas/target/gs-web-sec-cas-2.14-SNAPSHOT.jar> to /var/jenkins/.m2/repository/org/geoserver/security/gs-web-sec-cas/2.14-SNAPSHOT/gs-web-sec-cas-2.14-SNAPSHOT.jar
[INFO] Installing <https://build.geoserver.org/job/geoserver-2.14.x/ws/src/extension/security/web/web-cas/pom.xml> to /var/jenkins/.m2/repository/org/geoserver/security/gs-web-sec-cas/2.14-SNAPSHOT/gs-web-sec-cas-2.14-SNAPSHOT.pom
[INFO] Installing <https://build.geoserver.org/job/geoserver-2.14.x/ws/src/extension/security/web/web-cas/target/gs-web-sec-cas-2.14-SNAPSHOT-tests.jar> to /var/jenkins/.m2/repository/org/geoserver/security/gs-web-sec-cas/2.14-SNAPSHOT/gs-web-sec-cas-2.14-SNAPSHOT-tests.jar
[INFO] Installing <https://build.geoserver.org/job/geoserver-2.14.x/ws/src/extension/security/web/web-cas/target/gs-web-sec-cas-2.14-SNAPSHOT-sources.jar> to /var/jenkins/.m2/repository/org/geoserver/security/gs-web-sec-cas/2.14-SNAPSHOT/gs-web-sec-cas-2.14-SNAPSHOT-sources.jar
[INFO] ------------------------------------------------------------------------
[INFO] Reactor Summary:
[INFO]
[INFO] GeoServer .......................................... SUCCESS [  5.255 s]
[INFO] Core Platform Module ............................... SUCCESS [ 13.387 s]
[INFO] Open Web Service Module ............................ SUCCESS [ 11.907 s]
[INFO] Main Module ........................................ SUCCESS [01:04 min]
[INFO] GeoServer Security Modules ......................... SUCCESS [  0.084 s]
[INFO] GeoServer Security Tests Module .................... SUCCESS [01:13 min]
[INFO] GeoServer JDBC Security Module ..................... SUCCESS [ 35.632 s]
[INFO] GeoServer LDAP Security Module ..................... SUCCESS [ 19.129 s]
[INFO] Web Coverage Service Module ........................ SUCCESS [  4.071 s]
[INFO] Web Coverage Service 1.0 Module .................... SUCCESS [ 16.549 s]
[INFO] Web Coverage Service 1.1 Module .................... SUCCESS [ 19.069 s]
[INFO] Web Coverage Service 2.0 Module .................... SUCCESS [ 47.730 s]
[INFO] Web Feature Service Module ......................... SUCCESS [01:36 min]
[INFO] Web Map Service Module ............................. FAILURE [  8.474 s]
[INFO] KML support for GeoServer .......................... SKIPPED
[INFO] gs-rest ............................................ SUCCESS [ 16.156 s]
[INFO] GeoWebCache (GWC) Module ........................... SKIPPED
[INFO] gs-restconfig ...................................... SUCCESS [01:31 min]
[INFO] gs-restconfig-wcs .................................. SUCCESS [ 19.495 s]
[INFO] gs-restconfig-wfs .................................. SUCCESS [ 18.430 s]
[INFO] gs-restconfig-wms .................................. SKIPPED
[INFO] GeoServer Web Modules .............................. SUCCESS [  0.055 s]
[INFO] Core UI Module ..................................... SUCCESS [01:10 min]
[INFO] WMS UI Module ...................................... SKIPPED
[INFO] GWC UI Module ...................................... SKIPPED
[INFO] WFS UI Module ...................................... SUCCESS [ 10.712 s]
[INFO] Demos Module ....................................... SKIPPED
[INFO] WCS UI Module ...................................... SKIPPED
[INFO] Security UI Modules ................................ SUCCESS [  0.106 s]
[INFO] Security UI Core Module ............................ SUCCESS [01:39 min]
[INFO] Security UI JDBC Module ............................ SUCCESS [01:06 min]
[INFO] Security UI LDAP Module ............................ SUCCESS [ 18.482 s]
[INFO] REST UI Module ..................................... SUCCESS [ 10.394 s]
[INFO] GeoServer Extensions ............................... SUCCESS [  0.057 s]
[INFO] Printing Module .................................... SUCCESS [ 15.147 s]
[INFO] GeoServer Web Application .......................... SKIPPED
[INFO] Community Space .................................... SUCCESS [  0.042 s]
[INFO] Application Schema Support ......................... SUCCESS [  0.031 s]
[INFO] Application Schema Integration Test ................ SKIPPED
[INFO] Sample DataAccess Integration Test ................. SUCCESS [  9.846 s]
[INFO] ArcSDE DataStore Extension ......................... SUCCESS [ 10.960 s]
[INFO] H2 DataStore Extension ............................. SUCCESS [ 11.021 s]
[INFO] SQL Server DataStore Extension ..................... SUCCESS [  0.900 s]
[INFO] Oracle DataStore Extension ......................... SUCCESS [  0.376 s]
[INFO] MySQL DataStore Extension .......................... SUCCESS [  0.201 s]
[INFO] DB2 DataStore Extension ............................ SUCCESS [  0.206 s]
[INFO] ImageMap Output Format ............................. SKIPPED
[INFO] ImageI/O-Ext GDAL Coverage Extension ............... SUCCESS [  4.476 s]
[INFO] JP2K Coverage Extension ............................ SUCCESS [  0.271 s]
[INFO] OGR parent ......................................... SUCCESS [  0.041 s]
[INFO] OGR CORE ........................................... SUCCESS [  2.166 s]
[INFO] OGR WFS ............................................ SUCCESS [  8.801 s]
[INFO] Web Processing Service parent ...................... SUCCESS [  0.034 s]
[INFO] Web Processing Service Module ...................... SUCCESS [01:10 min]
[INFO] OGR WPS ............................................ SUCCESS [  8.590 s]
[INFO] Excel Output Format ................................ SUCCESS [ 13.495 s]
[INFO] Chart external graphics support .................... SUCCESS [  0.495 s]
[INFO] Feature Generalization Extension ................... SUCCESS [  3.450 s]
[INFO] Image Mosaic JDBC Extension ........................ SUCCESS [  0.468 s]
[INFO] OWS request flow controller ........................ SUCCESS [ 17.396 s]
[INFO] Web process status sharing with Hazelcast .......... SUCCESS [ 16.611 s]
[INFO] Web Processing Service GUI ......................... SKIPPED
[INFO] GeoServer Layer Querying filter functions .......... SUCCESS [ 15.487 s]
[INFO] Teradata DataStore Extension ....................... SUCCESS [  2.022 s]
[INFO] GeoServer Monitor Extensions ....................... SUCCESS [  0.043 s]
[INFO] Core Monitor Extension ............................. SKIPPED
[INFO] GeoServer Security Extension Modules ............... SUCCESS [  0.046 s]
[INFO] GeoServer CAS Security Module ...................... SUCCESS [  4.918 s]
[INFO] GeoServer Security Extension Web Modules ........... SUCCESS [  0.035 s]
[INFO] GeoServer CAS Security Web Module .................. SUCCESS [  1.617 s]
[INFO] XLST based WFS output format ....................... SUCCESS [ 17.472 s]
[INFO] GeoServer INSPIRE Extensions ....................... SKIPPED
[INFO] GeoServer CSS Styling .............................. SKIPPED
[INFO] Catalog Services for the Web parent ................ SUCCESS [  0.048 s]
[INFO] Catalog Services for the Web interfaces ............ SUCCESS [ 12.477 s]
[INFO] Catalog Services for the Web - Simple CatalogStore implementation SUCCESS [  8.862 s]
[INFO] Catalog Services for the Web core module ........... SUCCESS [ 31.192 s]
[INFO] CSW UI Module ...................................... SUCCESS [  8.812 s]
[INFO] DXF WFS output format and WPS PPIO ................. SUCCESS [  0.022 s]
[INFO] DXF WFS output format .............................. SUCCESS [ 13.550 s]
[INFO] DXF WPS PPIO ....................................... SUCCESS [  7.315 s]
[INFO] GeoServer WCS 2.0 Earth Observation Extensions ..... SUCCESS [  0.049 s]
[INFO] Web Coverage Service 2.0 Earth Observation extensions SUCCESS [ 15.852 s]
[INFO] Web Coverage Service 2.0 Earth Observation GUI extension SUCCESS [ 10.959 s]
[INFO] GeoServer libjpeg-turbo Module ..................... SKIPPED
[INFO] GeoServer Data Importer ............................ SKIPPED
[INFO] Importer Core Module ............................... SKIPPED
[INFO] Importer REST Api Module-ng ........................ SKIPPED
[INFO] Importer Berkley DB Persistence Module ............. SKIPPED
[INFO] Importer Web UI Module ............................. SKIPPED
[INFO] GRIB Coverage Format ............................... SUCCESS [ 14.691 s]
[INFO] NetCDF Coverage format ............................. SKIPPED
[INFO] WCS NetCDF output Module ........................... SKIPPED
[INFO] Vector Tiles ....................................... SKIPPED
[INFO] Ysld GeoServer Plugin .............................. SKIPPED
[INFO] MongoDB Data Store ................................. SUCCESS [  1.901 s]
[INFO] ------------------------------------------------------------------------
[INFO] BUILD FAILURE
[INFO] ------------------------------------------------------------------------
[INFO] Total time: 10:46 min (Wall Clock)
[INFO] Finished at: 2019-02-12T13:42:27+00:00
[INFO] Final Memory: 137M/1572M
[INFO] ------------------------------------------------------------------------
[ERROR] Failed to execute goal org.apache.maven.plugins:maven-compiler-plugin:2.3.2:compile (default-compile) on project gs-wms: Compilation failure
[ERROR] <https://build.geoserver.org/job/geoserver-2.14.x/ws/src/wms/src/main/java/org/geoserver/wms/capabilities/DimensionHelper.java>:[234,34] error: cannot find symbol
[ERROR] -> [Help 1]
[ERROR]
[ERROR] To see the full stack trace of the errors, re-run Maven with the -e switch.
[ERROR] Re-run Maven using the -X switch to enable full debug logging.
[ERROR]
[ERROR] For more information about the errors and possible solutions, please read the following articles:
[ERROR] [Help 1] http://cwiki.apache.org/confluence/display/MAVEN/MojoFailureException
[ERROR]
[ERROR] After correcting the problems, you can resume the build with the command
[ERROR]   mvn <goals> -rf :gs-wms
Build step 'Invoke top-level Maven targets' marked build as failure


_______________________________________________
Geoserver-devel mailing list
[hidden email]
https://lists.sourceforge.net/lists/listinfo/geoserver-devel
Reply | Threaded
Open this post in threaded view
|

Build failed in Jenkins: geoserver-2.14.x #193

monitor
See <https://build.geoserver.org/job/geoserver-2.14.x/193/display/redirect>

------------------------------------------
[...truncated 825.15 KB...]
[INFO] Copying 13 resources
[INFO]
[INFO] --- maven-compiler-plugin:2.3.2:compile (default-compile) @ gs-web-csw ---
[INFO] Compiling 2 source files to <https://build.geoserver.org/job/geoserver-2.14.x/ws/src/extension/csw/web-csw/target/classes>
Tests run: 5, Failures: 0, Errors: 0, Skipped: 0, Time elapsed: 11.146 sec

Results :

Tests run: 5, Failures: 0, Errors: 0, Skipped: 0

[INFO]
[INFO] --- maven-jar-plugin:2.4:jar (default-jar) @ gs-dxf-wps ---
[INFO] Building jar: <https://build.geoserver.org/job/geoserver-2.14.x/ws/src/extension/dxf/wps/target/gs-dxf-wps-2.14-SNAPSHOT.jar>
[INFO]
[INFO] --- maven-jar-plugin:2.4:test-jar (default) @ gs-dxf-wps ---
[INFO] Building jar: <https://build.geoserver.org/job/geoserver-2.14.x/ws/src/extension/dxf/wps/target/gs-dxf-wps-2.14-SNAPSHOT-tests.jar>
[INFO]
[INFO] --- maven-source-plugin:2.2.1:jar-no-fork (attach-sources) @ gs-dxf-wps ---
[INFO] Building jar: <https://build.geoserver.org/job/geoserver-2.14.x/ws/src/extension/dxf/wps/target/gs-dxf-wps-2.14-SNAPSHOT-sources.jar>
[INFO]
[INFO] --- maven-source-plugin:2.2.1:test-jar-no-fork (attach-sources) @ gs-dxf-wps ---
[INFO] Building jar: <https://build.geoserver.org/job/geoserver-2.14.x/ws/src/extension/dxf/wps/target/gs-dxf-wps-2.14-SNAPSHOT-test-sources.jar>
[INFO]
[INFO] --- fmt-maven-plugin:2.4.0:check (default) @ gs-dxf-wps ---
[debug] Using AOSP style
[INFO] Processed 2 files (0 non-complying).
[INFO]
[INFO] --- maven-install-plugin:2.4:install (default-install) @ gs-dxf-wps ---
[INFO] Installing <https://build.geoserver.org/job/geoserver-2.14.x/ws/src/extension/dxf/wps/target/gs-dxf-wps-2.14-SNAPSHOT.jar> to /var/jenkins/.m2/repository/org/geoserver/extension/gs-dxf-wps/2.14-SNAPSHOT/gs-dxf-wps-2.14-SNAPSHOT.jar
[INFO] Installing <https://build.geoserver.org/job/geoserver-2.14.x/ws/src/extension/dxf/wps/pom.xml> to /var/jenkins/.m2/repository/org/geoserver/extension/gs-dxf-wps/2.14-SNAPSHOT/gs-dxf-wps-2.14-SNAPSHOT.pom
[INFO] Installing <https://build.geoserver.org/job/geoserver-2.14.x/ws/src/extension/dxf/wps/target/gs-dxf-wps-2.14-SNAPSHOT-tests.jar> to /var/jenkins/.m2/repository/org/geoserver/extension/gs-dxf-wps/2.14-SNAPSHOT/gs-dxf-wps-2.14-SNAPSHOT-tests.jar
[INFO] Installing <https://build.geoserver.org/job/geoserver-2.14.x/ws/src/extension/dxf/wps/target/gs-dxf-wps-2.14-SNAPSHOT-sources.jar> to /var/jenkins/.m2/repository/org/geoserver/extension/gs-dxf-wps/2.14-SNAPSHOT/gs-dxf-wps-2.14-SNAPSHOT-sources.jar
[INFO] Installing <https://build.geoserver.org/job/geoserver-2.14.x/ws/src/extension/dxf/wps/target/gs-dxf-wps-2.14-SNAPSHOT-test-sources.jar> to /var/jenkins/.m2/repository/org/geoserver/extension/gs-dxf-wps/2.14-SNAPSHOT/gs-dxf-wps-2.14-SNAPSHOT-test-sources.jar
[INFO]                                                                        
[INFO] ------------------------------------------------------------------------
[INFO] Building GeoServer CAS Security Web Module 2.14-SNAPSHOT
[INFO] ------------------------------------------------------------------------
[INFO]
[INFO] --- maven-clean-plugin:2.5:clean (default-clean) @ gs-web-sec-cas ---
[INFO] Deleting <https://build.geoserver.org/job/geoserver-2.14.x/ws/src/extension/security/web/web-cas/target>
[INFO]
[INFO] --- git-commit-id-plugin:2.1.15:revision (default) @ gs-web-sec-cas ---
[INFO]
[INFO] --- maven-resources-plugin:2.6:resources (default-resources) @ gs-web-sec-cas ---
[INFO] Using 'UTF-8' encoding to copy filtered resources.
[INFO] Copying 2 resources
[INFO] skip non existing resourceDirectory <https://build.geoserver.org/job/geoserver-2.14.x/ws/src/extension/security/web/web-cas/src/main/resources>
[INFO]
[INFO] --- maven-compiler-plugin:2.3.2:compile (default-compile) @ gs-web-sec-cas ---
[INFO] Compiling 2 source files to <https://build.geoserver.org/job/geoserver-2.14.x/ws/src/extension/security/web/web-cas/target/classes>
[INFO]
[INFO] --- maven-resources-plugin:2.6:testResources (default-testResources) @ gs-web-csw ---
[INFO] Using 'UTF-8' encoding to copy filtered resources.
[INFO] Copying 0 resource
[INFO] skip non existing resourceDirectory <https://build.geoserver.org/job/geoserver-2.14.x/ws/src/extension/csw/web-csw/src/test/resources>
[INFO]
[INFO] --- maven-compiler-plugin:2.3.2:testCompile (default-testCompile) @ gs-web-csw ---
[INFO] Compiling 1 source file to <https://build.geoserver.org/job/geoserver-2.14.x/ws/src/extension/csw/web-csw/target/test-classes>
[INFO]
[INFO] --- maven-resources-plugin:2.6:testResources (default-testResources) @ gs-web-sec-cas ---
[INFO] Using 'UTF-8' encoding to copy filtered resources.
[INFO] skip non existing resourceDirectory <https://build.geoserver.org/job/geoserver-2.14.x/ws/src/extension/security/web/web-cas/src/test/java>
[INFO] skip non existing resourceDirectory <https://build.geoserver.org/job/geoserver-2.14.x/ws/src/extension/security/web/web-cas/src/test/resources>
[INFO]
[INFO] --- maven-compiler-plugin:2.3.2:testCompile (default-testCompile) @ gs-web-sec-cas ---
[INFO] No sources to compile
[INFO]
[INFO] --- maven-surefire-plugin:2.12.3:test (default-test) @ gs-web-sec-cas ---
[INFO] No tests to run.
[INFO]
[INFO] --- maven-jar-plugin:2.4:jar (default-jar) @ gs-web-sec-cas ---
[INFO] Building jar: <https://build.geoserver.org/job/geoserver-2.14.x/ws/src/extension/security/web/web-cas/target/gs-web-sec-cas-2.14-SNAPSHOT.jar>
[INFO]
[INFO] --- maven-jar-plugin:2.4:test-jar (default) @ gs-web-sec-cas ---
[WARNING] JAR will be empty - no content was marked for inclusion!
[INFO] Building jar: <https://build.geoserver.org/job/geoserver-2.14.x/ws/src/extension/security/web/web-cas/target/gs-web-sec-cas-2.14-SNAPSHOT-tests.jar>
[INFO]
[INFO] --- maven-source-plugin:2.2.1:jar-no-fork (attach-sources) @ gs-web-sec-cas ---
[INFO] Building jar: <https://build.geoserver.org/job/geoserver-2.14.x/ws/src/extension/security/web/web-cas/target/gs-web-sec-cas-2.14-SNAPSHOT-sources.jar>
[INFO]
[INFO] --- maven-source-plugin:2.2.1:test-jar-no-fork (attach-sources) @ gs-web-sec-cas ---
[INFO] No sources in project. Archive not created.
[INFO]
[INFO] --- fmt-maven-plugin:2.4.0:check (default) @ gs-web-sec-cas ---
[warn] Test source directory '<https://build.geoserver.org/job/geoserver-2.14.x/ws/src/extension/security/web/web-cas/src/test/java'> does not exist, ignoring.
[debug] Using AOSP style
[INFO] Processed 2 files (0 non-complying).
[INFO]
[INFO] --- maven-install-plugin:2.4:install (default-install) @ gs-web-sec-cas ---
[INFO] Installing <https://build.geoserver.org/job/geoserver-2.14.x/ws/src/extension/security/web/web-cas/target/gs-web-sec-cas-2.14-SNAPSHOT.jar> to /var/jenkins/.m2/repository/org/geoserver/security/gs-web-sec-cas/2.14-SNAPSHOT/gs-web-sec-cas-2.14-SNAPSHOT.jar
[INFO] Installing <https://build.geoserver.org/job/geoserver-2.14.x/ws/src/extension/security/web/web-cas/pom.xml> to /var/jenkins/.m2/repository/org/geoserver/security/gs-web-sec-cas/2.14-SNAPSHOT/gs-web-sec-cas-2.14-SNAPSHOT.pom
[INFO] Installing <https://build.geoserver.org/job/geoserver-2.14.x/ws/src/extension/security/web/web-cas/target/gs-web-sec-cas-2.14-SNAPSHOT-tests.jar> to /var/jenkins/.m2/repository/org/geoserver/security/gs-web-sec-cas/2.14-SNAPSHOT/gs-web-sec-cas-2.14-SNAPSHOT-tests.jar
[INFO] Installing <https://build.geoserver.org/job/geoserver-2.14.x/ws/src/extension/security/web/web-cas/target/gs-web-sec-cas-2.14-SNAPSHOT-sources.jar> to /var/jenkins/.m2/repository/org/geoserver/security/gs-web-sec-cas/2.14-SNAPSHOT/gs-web-sec-cas-2.14-SNAPSHOT-sources.jar
[INFO]
[INFO] --- maven-surefire-plugin:2.12.3:test (default-test) @ gs-web-csw ---
[INFO] Surefire report directory: <https://build.geoserver.org/job/geoserver-2.14.x/ws/src/extension/csw/web-csw/target/surefire-reports>

-------------------------------------------------------
 T E S T S
-------------------------------------------------------
Running org.geoserver.wfs.web.CSWAdminPageTest
Tests run: 1, Failures: 0, Errors: 0, Skipped: 0, Time elapsed: 7.262 sec

Results :

Tests run: 1, Failures: 0, Errors: 0, Skipped: 0

[INFO]
[INFO] --- maven-jar-plugin:2.4:jar (default-jar) @ gs-web-csw ---
[INFO] Building jar: <https://build.geoserver.org/job/geoserver-2.14.x/ws/src/extension/csw/web-csw/target/gs-web-csw-2.14-SNAPSHOT.jar>
[INFO]
[INFO] --- maven-jar-plugin:2.4:test-jar (default) @ gs-web-csw ---
[INFO] Building jar: <https://build.geoserver.org/job/geoserver-2.14.x/ws/src/extension/csw/web-csw/target/gs-web-csw-2.14-SNAPSHOT-tests.jar>
[INFO]
[INFO] --- maven-source-plugin:2.2.1:jar-no-fork (attach-sources) @ gs-web-csw ---
[INFO] Building jar: <https://build.geoserver.org/job/geoserver-2.14.x/ws/src/extension/csw/web-csw/target/gs-web-csw-2.14-SNAPSHOT-sources.jar>
[INFO]
[INFO] --- maven-source-plugin:2.2.1:test-jar-no-fork (attach-sources) @ gs-web-csw ---
[INFO] Building jar: <https://build.geoserver.org/job/geoserver-2.14.x/ws/src/extension/csw/web-csw/target/gs-web-csw-2.14-SNAPSHOT-test-sources.jar>
[INFO]
[INFO] --- fmt-maven-plugin:2.4.0:check (default) @ gs-web-csw ---
[debug] Using AOSP style
[INFO] Processed 3 files (0 non-complying).
[INFO]
[INFO] --- maven-install-plugin:2.4:install (default-install) @ gs-web-csw ---
[INFO] Installing <https://build.geoserver.org/job/geoserver-2.14.x/ws/src/extension/csw/web-csw/target/gs-web-csw-2.14-SNAPSHOT.jar> to /var/jenkins/.m2/repository/org/geoserver/csw/gs-web-csw/2.14-SNAPSHOT/gs-web-csw-2.14-SNAPSHOT.jar
[INFO] Installing <https://build.geoserver.org/job/geoserver-2.14.x/ws/src/extension/csw/web-csw/pom.xml> to /var/jenkins/.m2/repository/org/geoserver/csw/gs-web-csw/2.14-SNAPSHOT/gs-web-csw-2.14-SNAPSHOT.pom
[INFO] Installing <https://build.geoserver.org/job/geoserver-2.14.x/ws/src/extension/csw/web-csw/target/gs-web-csw-2.14-SNAPSHOT-tests.jar> to /var/jenkins/.m2/repository/org/geoserver/csw/gs-web-csw/2.14-SNAPSHOT/gs-web-csw-2.14-SNAPSHOT-tests.jar
[INFO] Installing <https://build.geoserver.org/job/geoserver-2.14.x/ws/src/extension/csw/web-csw/target/gs-web-csw-2.14-SNAPSHOT-sources.jar> to /var/jenkins/.m2/repository/org/geoserver/csw/gs-web-csw/2.14-SNAPSHOT/gs-web-csw-2.14-SNAPSHOT-sources.jar
[INFO] Installing <https://build.geoserver.org/job/geoserver-2.14.x/ws/src/extension/csw/web-csw/target/gs-web-csw-2.14-SNAPSHOT-test-sources.jar> to /var/jenkins/.m2/repository/org/geoserver/csw/gs-web-csw/2.14-SNAPSHOT/gs-web-csw-2.14-SNAPSHOT-test-sources.jar
[INFO] ------------------------------------------------------------------------
[INFO] Reactor Summary:
[INFO]
[INFO] GeoServer .......................................... SUCCESS [  9.508 s]
[INFO] Core Platform Module ............................... SUCCESS [ 20.781 s]
[INFO] Open Web Service Module ............................ SUCCESS [ 16.195 s]
[INFO] Main Module ........................................ SUCCESS [01:49 min]
[INFO] GeoServer Security Modules ......................... SUCCESS [  0.272 s]
[INFO] GeoServer Security Tests Module .................... SUCCESS [01:50 min]
[INFO] GeoServer JDBC Security Module ..................... SUCCESS [01:00 min]
[INFO] GeoServer LDAP Security Module ..................... SUCCESS [ 33.172 s]
[INFO] Web Coverage Service Module ........................ SUCCESS [  8.458 s]
[INFO] Web Coverage Service 1.0 Module .................... SUCCESS [ 32.596 s]
[INFO] Web Coverage Service 1.1 Module .................... SUCCESS [ 31.055 s]
[INFO] Web Coverage Service 2.0 Module .................... SUCCESS [01:20 min]
[INFO] Web Feature Service Module ......................... SUCCESS [02:58 min]
[INFO] Web Map Service Module ............................. FAILURE [ 14.136 s]
[INFO] KML support for GeoServer .......................... SKIPPED
[INFO] gs-rest ............................................ SUCCESS [ 30.924 s]
[INFO] GeoWebCache (GWC) Module ........................... SKIPPED
[INFO] gs-restconfig ...................................... SUCCESS [02:44 min]
[INFO] gs-restconfig-wcs .................................. SUCCESS [ 38.853 s]
[INFO] gs-restconfig-wfs .................................. SUCCESS [ 33.246 s]
[INFO] gs-restconfig-wms .................................. SKIPPED
[INFO] GeoServer Web Modules .............................. SUCCESS [  0.107 s]
[INFO] Core UI Module ..................................... SUCCESS [02:12 min]
[INFO] WMS UI Module ...................................... SKIPPED
[INFO] GWC UI Module ...................................... SKIPPED
[INFO] WFS UI Module ...................................... SUCCESS [ 24.445 s]
[INFO] Demos Module ....................................... SKIPPED
[INFO] WCS UI Module ...................................... SKIPPED
[INFO] Security UI Modules ................................ SUCCESS [  0.099 s]
[INFO] Security UI Core Module ............................ SUCCESS [02:47 min]
[INFO] Security UI JDBC Module ............................ SUCCESS [01:48 min]
[INFO] Security UI LDAP Module ............................ SUCCESS [ 35.689 s]
[INFO] REST UI Module ..................................... SUCCESS [ 20.425 s]
[INFO] GeoServer Extensions ............................... SUCCESS [  0.073 s]
[INFO] Printing Module .................................... SUCCESS [ 23.006 s]
[INFO] GeoServer Web Application .......................... SKIPPED
[INFO] Community Space .................................... SUCCESS [  0.056 s]
[INFO] Application Schema Support ......................... SUCCESS [  0.034 s]
[INFO] Application Schema Integration Test ................ SKIPPED
[INFO] Sample DataAccess Integration Test ................. SUCCESS [ 18.445 s]
[INFO] ArcSDE DataStore Extension ......................... SUCCESS [ 18.957 s]
[INFO] H2 DataStore Extension ............................. SUCCESS [ 20.233 s]
[INFO] SQL Server DataStore Extension ..................... SUCCESS [  1.260 s]
[INFO] Oracle DataStore Extension ......................... SUCCESS [  0.527 s]
[INFO] MySQL DataStore Extension .......................... SUCCESS [  0.333 s]
[INFO] DB2 DataStore Extension ............................ SUCCESS [  0.306 s]
[INFO] ImageMap Output Format ............................. SKIPPED
[INFO] ImageI/O-Ext GDAL Coverage Extension ............... SUCCESS [  6.152 s]
[INFO] JP2K Coverage Extension ............................ SUCCESS [  0.345 s]
[INFO] OGR parent ......................................... SUCCESS [  0.046 s]
[INFO] OGR CORE ........................................... SUCCESS [  4.662 s]
[INFO] OGR WFS ............................................ SUCCESS [ 15.431 s]
[INFO] Web Processing Service parent ...................... SUCCESS [  0.060 s]
[INFO] Web Processing Service Module ...................... SUCCESS [02:00 min]
[INFO] OGR WPS ............................................ SUCCESS [ 17.237 s]
[INFO] Excel Output Format ................................ SUCCESS [ 23.805 s]
[INFO] Chart external graphics support .................... SUCCESS [  0.515 s]
[INFO] Feature Generalization Extension ................... SUCCESS [  6.428 s]
[INFO] Image Mosaic JDBC Extension ........................ SUCCESS [  0.661 s]
[INFO] OWS request flow controller ........................ SUCCESS [ 24.351 s]
[INFO] Web process status sharing with Hazelcast .......... SUCCESS [ 18.152 s]
[INFO] Web Processing Service GUI ......................... SKIPPED
[INFO] GeoServer Layer Querying filter functions .......... SUCCESS [ 26.032 s]
[INFO] Teradata DataStore Extension ....................... SUCCESS [  4.373 s]
[INFO] GeoServer Monitor Extensions ....................... SUCCESS [  0.058 s]
[INFO] Core Monitor Extension ............................. SKIPPED
[INFO] GeoServer Security Extension Modules ............... SUCCESS [  0.085 s]
[INFO] GeoServer CAS Security Module ...................... SUCCESS [ 13.330 s]
[INFO] GeoServer Security Extension Web Modules ........... SUCCESS [  0.108 s]
[INFO] GeoServer CAS Security Web Module .................. SUCCESS [  6.094 s]
[INFO] XLST based WFS output format ....................... SUCCESS [ 34.526 s]
[INFO] GeoServer INSPIRE Extensions ....................... SKIPPED
[INFO] GeoServer CSS Styling .............................. SKIPPED
[INFO] Catalog Services for the Web parent ................ SUCCESS [  0.109 s]
[INFO] Catalog Services for the Web interfaces ............ SUCCESS [ 18.263 s]
[INFO] Catalog Services for the Web - Simple CatalogStore implementation SUCCESS [ 17.946 s]
[INFO] Catalog Services for the Web core module ........... SUCCESS [01:02 min]
[INFO] CSW UI Module ...................................... SUCCESS [ 16.320 s]
[INFO] DXF WFS output format and WPS PPIO ................. SUCCESS [  0.067 s]
[INFO] DXF WFS output format .............................. SUCCESS [ 22.807 s]
[INFO] DXF WPS PPIO ....................................... SUCCESS [ 19.533 s]
[INFO] GeoServer WCS 2.0 Earth Observation Extensions ..... SUCCESS [  0.062 s]
[INFO] Web Coverage Service 2.0 Earth Observation extensions SUCCESS [ 30.703 s]
[INFO] Web Coverage Service 2.0 Earth Observation GUI extension SUCCESS [ 22.740 s]
[INFO] GeoServer libjpeg-turbo Module ..................... SKIPPED
[INFO] GeoServer Data Importer ............................ SKIPPED
[INFO] Importer Core Module ............................... SKIPPED
[INFO] Importer REST Api Module-ng ........................ SKIPPED
[INFO] Importer Berkley DB Persistence Module ............. SKIPPED
[INFO] Importer Web UI Module ............................. SKIPPED
[INFO] GRIB Coverage Format ............................... SUCCESS [ 25.617 s]
[INFO] NetCDF Coverage format ............................. SKIPPED
[INFO] WCS NetCDF output Module ........................... SKIPPED
[INFO] Vector Tiles ....................................... SKIPPED
[INFO] Ysld GeoServer Plugin .............................. SKIPPED
[INFO] MongoDB Data Store ................................. SUCCESS [  2.124 s]
[INFO] ------------------------------------------------------------------------
[INFO] BUILD FAILURE
[INFO] ------------------------------------------------------------------------
[INFO] Total time: 18:53 min (Wall Clock)
[INFO] Finished at: 2019-02-14T11:13:13+00:00
[INFO] Final Memory: 138M/1588M
[INFO] ------------------------------------------------------------------------
[ERROR] Failed to execute goal org.apache.maven.plugins:maven-compiler-plugin:2.3.2:compile (default-compile) on project gs-wms: Compilation failure
[ERROR] <https://build.geoserver.org/job/geoserver-2.14.x/ws/src/wms/src/main/java/org/geoserver/wms/capabilities/DimensionHelper.java>:[234,34] error: cannot find symbol
[ERROR] -> [Help 1]
[ERROR]
[ERROR] To see the full stack trace of the errors, re-run Maven with the -e switch.
[ERROR] Re-run Maven using the -X switch to enable full debug logging.
[ERROR]
[ERROR] For more information about the errors and possible solutions, please read the following articles:
[ERROR] [Help 1] http://cwiki.apache.org/confluence/display/MAVEN/MojoFailureException
[ERROR]
[ERROR] After correcting the problems, you can resume the build with the command
[ERROR]   mvn <goals> -rf :gs-wms
Build step 'Invoke top-level Maven targets' marked build as failure


_______________________________________________
Geoserver-devel mailing list
[hidden email]
https://lists.sourceforge.net/lists/listinfo/geoserver-devel
Reply | Threaded
Open this post in threaded view
|

Build failed in Jenkins: geoserver-2.14.x #194

monitor
See <https://build.geoserver.org/job/geoserver-2.14.x/194/display/redirect>

------------------------------------------
[...truncated 807.50 KB...]
INFO: [127.0.0.1]:5010 [dev] [3.3.1] Master Address[127.0.0.1]:5009 left the cluster. Assigning new master Member [127.0.0.1]:5010 this
Feb 14, 2019 1:10:29 PM com.hazelcast.cluster.ClusterService
INFO: [127.0.0.1]:5010 [dev] [3.3.1] Removing Member [127.0.0.1]:5009
Feb 14, 2019 1:10:29 PM com.hazelcast.cluster.ClusterService
INFO: [127.0.0.1]:5010 [dev] [3.3.1]

Members [1] {
        Member [127.0.0.1]:5010 this
}

Feb 14, 2019 1:10:29 PM com.hazelcast.initializer
INFO: [127.0.0.1]:5009 [dev] [3.3.1] Destroying node initializer.
Feb 14, 2019 1:10:29 PM com.hazelcast.instance.Node
INFO: [127.0.0.1]:5009 [dev] [3.3.1] Hazelcast Shutdown is completed in 15 ms.
Feb 14, 2019 1:10:29 PM com.hazelcast.core.LifecycleService
INFO: [127.0.0.1]:5009 [dev] [3.3.1] Address[127.0.0.1]:5009 is SHUTDOWN
Feb 14, 2019 1:10:29 PM com.hazelcast.core.LifecycleService
INFO: [127.0.0.1]:5010 [dev] [3.3.1] Address[127.0.0.1]:5010 is SHUTTING_DOWN
Feb 14, 2019 1:10:29 PM com.hazelcast.initializer
INFO: [127.0.0.1]:5010 [dev] [3.3.1] Destroying node initializer.
Feb 14, 2019 1:10:29 PM com.hazelcast.instance.Node
INFO: [127.0.0.1]:5010 [dev] [3.3.1] Hazelcast Shutdown is completed in 8 ms.
Feb 14, 2019 1:10:29 PM com.hazelcast.core.LifecycleService
INFO: [127.0.0.1]:5010 [dev] [3.3.1] Address[127.0.0.1]:5010 is SHUTDOWN
Feb 14, 2019 1:10:29 PM com.hazelcast.spi.impl.BasicOperationScheduler
INFO: [127.0.0.1]:5011 [dev] [3.3.1] Starting with 8 generic operation threads and 8 partition operation threads.
Feb 14, 2019 1:10:29 PM com.hazelcast.system
INFO: [127.0.0.1]:5011 [dev] [3.3.1] Hazelcast 3.3.1 (20140929 - a1b45ef) starting at Address[127.0.0.1]:5011
Feb 14, 2019 1:10:29 PM com.hazelcast.system
INFO: [127.0.0.1]:5011 [dev] [3.3.1] Copyright (C) 2008-2014 Hazelcast.com
Feb 14, 2019 1:10:29 PM com.hazelcast.core.LifecycleService
INFO: [127.0.0.1]:5011 [dev] [3.3.1] Address[127.0.0.1]:5011 is STARTING
Feb 14, 2019 1:10:29 PM com.hazelcast.test.TestNodeRegistry$MockNodeContext$MockJoiner
INFO: [127.0.0.1]:5011 [dev] [3.3.1]


Members [1] {
        Member [127.0.0.1]:5011 this
}

Feb 14, 2019 1:10:29 PM com.hazelcast.core.LifecycleService
INFO: [127.0.0.1]:5011 [dev] [3.3.1] Address[127.0.0.1]:5011 is STARTED
Feb 14, 2019 1:10:29 PM com.hazelcast.spi.impl.BasicOperationScheduler
INFO: [127.0.0.1]:5012 [dev] [3.3.1] Starting with 8 generic operation threads and 8 partition operation threads.
Feb 14, 2019 1:10:29 PM com.hazelcast.system
INFO: [127.0.0.1]:5012 [dev] [3.3.1] Hazelcast 3.3.1 (20140929 - a1b45ef) starting at Address[127.0.0.1]:5012
Feb 14, 2019 1:10:29 PM com.hazelcast.system
INFO: [127.0.0.1]:5012 [dev] [3.3.1] Copyright (C) 2008-2014 Hazelcast.com
Feb 14, 2019 1:10:29 PM com.hazelcast.core.LifecycleService
INFO: [127.0.0.1]:5012 [dev] [3.3.1] Address[127.0.0.1]:5012 is STARTING
Feb 14, 2019 1:10:30 PM com.hazelcast.cluster.ClusterService
INFO: [127.0.0.1]:5011 [dev] [3.3.1]

Members [2] {
        Member [127.0.0.1]:5011 this
        Member [127.0.0.1]:5012
}

Feb 14, 2019 1:10:30 PM com.hazelcast.cluster.ClusterService
INFO: [127.0.0.1]:5012 [dev] [3.3.1]

Members [2] {
        Member [127.0.0.1]:5011
        Member [127.0.0.1]:5012 this
}

Feb 14, 2019 1:10:31 PM com.hazelcast.core.LifecycleService
INFO: [127.0.0.1]:5012 [dev] [3.3.1] Address[127.0.0.1]:5012 is STARTED
Feb 14, 2019 1:10:31 PM org.geoserver.wps.hz.HazelcastLoader validateConfiguration
WARNING: The WPS status map wpsExecutionStatusMap has a max size set, it should be unbounded so that no status is lost before the configured timeout
Feb 14, 2019 1:10:31 PM org.geoserver.wps.hz.HazelcastLoader validateConfiguration
WARNING: The WPS status map wpsExecutionStatusMap has a max size set, it should be unbounded so that no status is lost before the configured timeout
Feb 14, 2019 1:10:31 PM com.hazelcast.partition.InternalPartitionService
INFO: [127.0.0.1]:5011 [dev] [3.3.1] Initializing cluster partition table first arrangement...
Feb 14, 2019 1:10:36 PM com.hazelcast.core.LifecycleService
INFO: [127.0.0.1]:5011 [dev] [3.3.1] Address[127.0.0.1]:5011 is SHUTTING_DOWN
Feb 14, 2019 1:10:36 PM com.hazelcast.cluster.ClusterService
INFO: [127.0.0.1]:5012 [dev] [3.3.1] Master Address[127.0.0.1]:5011 left the cluster. Assigning new master Member [127.0.0.1]:5012 this
Feb 14, 2019 1:10:36 PM com.hazelcast.cluster.ClusterService
INFO: [127.0.0.1]:5012 [dev] [3.3.1] Removing Member [127.0.0.1]:5011
Feb 14, 2019 1:10:36 PM com.hazelcast.cluster.ClusterService
INFO: [127.0.0.1]:5012 [dev] [3.3.1]

Members [1] {
        Member [127.0.0.1]:5012 this
}

Feb 14, 2019 1:10:36 PM com.hazelcast.initializer
INFO: [127.0.0.1]:5011 [dev] [3.3.1] Destroying node initializer.
Feb 14, 2019 1:10:36 PM com.hazelcast.instance.Node
INFO: [127.0.0.1]:5011 [dev] [3.3.1] Hazelcast Shutdown is completed in 14 ms.
Feb 14, 2019 1:10:36 PM com.hazelcast.core.LifecycleService
INFO: [127.0.0.1]:5011 [dev] [3.3.1] Address[127.0.0.1]:5011 is SHUTDOWN
Feb 14, 2019 1:10:36 PM com.hazelcast.core.LifecycleService
INFO: [127.0.0.1]:5012 [dev] [3.3.1] Address[127.0.0.1]:5012 is SHUTTING_DOWN
Feb 14, 2019 1:10:36 PM com.hazelcast.initializer
INFO: [127.0.0.1]:5012 [dev] [3.3.1] Destroying node initializer.
Feb 14, 2019 1:10:36 PM com.hazelcast.instance.Node
INFO: [127.0.0.1]:5012 [dev] [3.3.1] Hazelcast Shutdown is completed in 9 ms.
Feb 14, 2019 1:10:36 PM com.hazelcast.core.LifecycleService
INFO: [127.0.0.1]:5012 [dev] [3.3.1] Address[127.0.0.1]:5012 is SHUTDOWN
Tests run: 4, Failures: 0, Errors: 0, Skipped: 0, Time elapsed: 19.964 sec

Results :

Tests run: 8, Failures: 0, Errors: 0, Skipped: 0

[INFO]
[INFO] --- maven-jar-plugin:2.4:jar (default-jar) @ gs-wps-cluster-hazelcast ---
[INFO] Building jar: <https://build.geoserver.org/job/geoserver-2.14.x/ws/src/extension/wps/wps-cluster-hazelcast/target/gs-wps-cluster-hazelcast-2.14-SNAPSHOT.jar>
[INFO]
[INFO] --- maven-jar-plugin:2.4:test-jar (default) @ gs-wps-cluster-hazelcast ---
[INFO] Building jar: <https://build.geoserver.org/job/geoserver-2.14.x/ws/src/extension/wps/wps-cluster-hazelcast/target/gs-wps-cluster-hazelcast-2.14-SNAPSHOT-tests.jar>
[INFO]
[INFO] --- maven-source-plugin:2.2.1:jar-no-fork (attach-sources) @ gs-wps-cluster-hazelcast ---
[INFO] Building jar: <https://build.geoserver.org/job/geoserver-2.14.x/ws/src/extension/wps/wps-cluster-hazelcast/target/gs-wps-cluster-hazelcast-2.14-SNAPSHOT-sources.jar>
[INFO]
[INFO] --- maven-source-plugin:2.2.1:test-jar-no-fork (attach-sources) @ gs-wps-cluster-hazelcast ---
[INFO] Building jar: <https://build.geoserver.org/job/geoserver-2.14.x/ws/src/extension/wps/wps-cluster-hazelcast/target/gs-wps-cluster-hazelcast-2.14-SNAPSHOT-test-sources.jar>
[INFO]
[INFO] --- fmt-maven-plugin:2.4.0:check (default) @ gs-wps-cluster-hazelcast ---
[debug] Using AOSP style
[INFO] Processed 5 files (0 non-complying).
[INFO]
[INFO] --- maven-install-plugin:2.4:install (default-install) @ gs-wps-cluster-hazelcast ---
[INFO] Installing <https://build.geoserver.org/job/geoserver-2.14.x/ws/src/extension/wps/wps-cluster-hazelcast/target/gs-wps-cluster-hazelcast-2.14-SNAPSHOT.jar> to /var/jenkins/.m2/repository/org/geoserver/extension/gs-wps-cluster-hazelcast/2.14-SNAPSHOT/gs-wps-cluster-hazelcast-2.14-SNAPSHOT.jar
[INFO] Installing <https://build.geoserver.org/job/geoserver-2.14.x/ws/src/extension/wps/wps-cluster-hazelcast/pom.xml> to /var/jenkins/.m2/repository/org/geoserver/extension/gs-wps-cluster-hazelcast/2.14-SNAPSHOT/gs-wps-cluster-hazelcast-2.14-SNAPSHOT.pom
[INFO] Installing <https://build.geoserver.org/job/geoserver-2.14.x/ws/src/extension/wps/wps-cluster-hazelcast/target/gs-wps-cluster-hazelcast-2.14-SNAPSHOT-tests.jar> to /var/jenkins/.m2/repository/org/geoserver/extension/gs-wps-cluster-hazelcast/2.14-SNAPSHOT/gs-wps-cluster-hazelcast-2.14-SNAPSHOT-tests.jar
[INFO] Installing <https://build.geoserver.org/job/geoserver-2.14.x/ws/src/extension/wps/wps-cluster-hazelcast/target/gs-wps-cluster-hazelcast-2.14-SNAPSHOT-sources.jar> to /var/jenkins/.m2/repository/org/geoserver/extension/gs-wps-cluster-hazelcast/2.14-SNAPSHOT/gs-wps-cluster-hazelcast-2.14-SNAPSHOT-sources.jar
[INFO] Installing <https://build.geoserver.org/job/geoserver-2.14.x/ws/src/extension/wps/wps-cluster-hazelcast/target/gs-wps-cluster-hazelcast-2.14-SNAPSHOT-test-sources.jar> to /var/jenkins/.m2/repository/org/geoserver/extension/gs-wps-cluster-hazelcast/2.14-SNAPSHOT/gs-wps-cluster-hazelcast-2.14-SNAPSHOT-test-sources.jar
[INFO] ------------------------------------------------------------------------
[INFO] Reactor Summary:
[INFO]
[INFO] GeoServer .......................................... SUCCESS [  5.795 s]
[INFO] Core Platform Module ............................... SUCCESS [ 13.423 s]
[INFO] Open Web Service Module ............................ SUCCESS [ 12.398 s]
[INFO] Main Module ........................................ SUCCESS [01:03 min]
[INFO] GeoServer Security Modules ......................... SUCCESS [  0.059 s]
[INFO] GeoServer Security Tests Module .................... SUCCESS [01:19 min]
[INFO] GeoServer JDBC Security Module ..................... SUCCESS [ 36.182 s]
[INFO] GeoServer LDAP Security Module ..................... SUCCESS [ 19.603 s]
[INFO] Web Coverage Service Module ........................ SUCCESS [  4.194 s]
[INFO] Web Coverage Service 1.0 Module .................... SUCCESS [ 16.425 s]
[INFO] Web Coverage Service 1.1 Module .................... SUCCESS [ 19.247 s]
[INFO] Web Coverage Service 2.0 Module .................... SUCCESS [ 47.668 s]
[INFO] Web Feature Service Module ......................... SUCCESS [01:36 min]
[INFO] Web Map Service Module ............................. FAILURE [  7.937 s]
[INFO] KML support for GeoServer .......................... SKIPPED
[INFO] gs-rest ............................................ SUCCESS [ 16.511 s]
[INFO] GeoWebCache (GWC) Module ........................... SKIPPED
[INFO] gs-restconfig ...................................... SUCCESS [01:31 min]
[INFO] gs-restconfig-wcs .................................. SUCCESS [ 17.030 s]
[INFO] gs-restconfig-wfs .................................. SUCCESS [ 17.849 s]
[INFO] gs-restconfig-wms .................................. SKIPPED
[INFO] GeoServer Web Modules .............................. SUCCESS [  0.067 s]
[INFO] Core UI Module ..................................... SUCCESS [01:09 min]
[INFO] WMS UI Module ...................................... SKIPPED
[INFO] GWC UI Module ...................................... SKIPPED
[INFO] WFS UI Module ...................................... SUCCESS [ 10.947 s]
[INFO] Demos Module ....................................... SKIPPED
[INFO] WCS UI Module ...................................... SKIPPED
[INFO] Security UI Modules ................................ SUCCESS [  0.119 s]
[INFO] Security UI Core Module ............................ SUCCESS [01:36 min]
[INFO] Security UI JDBC Module ............................ SUCCESS [01:06 min]
[INFO] Security UI LDAP Module ............................ SUCCESS [ 18.090 s]
[INFO] REST UI Module ..................................... SUCCESS [ 10.633 s]
[INFO] GeoServer Extensions ............................... SUCCESS [  0.051 s]
[INFO] Printing Module .................................... SUCCESS [ 13.596 s]
[INFO] GeoServer Web Application .......................... SKIPPED
[INFO] Community Space .................................... SUCCESS [  0.032 s]
[INFO] Application Schema Support ......................... SUCCESS [  0.030 s]
[INFO] Application Schema Integration Test ................ SKIPPED
[INFO] Sample DataAccess Integration Test ................. SUCCESS [  9.760 s]
[INFO] ArcSDE DataStore Extension ......................... SUCCESS [ 11.359 s]
[INFO] H2 DataStore Extension ............................. SUCCESS [ 11.060 s]
[INFO] SQL Server DataStore Extension ..................... SUCCESS [  0.906 s]
[INFO] Oracle DataStore Extension ......................... SUCCESS [  0.378 s]
[INFO] MySQL DataStore Extension .......................... SUCCESS [  0.220 s]
[INFO] DB2 DataStore Extension ............................ SUCCESS [  0.222 s]
[INFO] ImageMap Output Format ............................. SKIPPED
[INFO] ImageI/O-Ext GDAL Coverage Extension ............... SUCCESS [  4.972 s]
[INFO] JP2K Coverage Extension ............................ SUCCESS [  0.269 s]
[INFO] OGR parent ......................................... SUCCESS [  0.048 s]
[INFO] OGR CORE ........................................... SUCCESS [  2.305 s]
[INFO] OGR WFS ............................................ SUCCESS [  8.594 s]
[INFO] Web Processing Service parent ...................... SUCCESS [  0.081 s]
[INFO] Web Processing Service Module ...................... SUCCESS [01:11 min]
[INFO] OGR WPS ............................................ SUCCESS [  8.887 s]
[INFO] Excel Output Format ................................ SUCCESS [ 13.995 s]
[INFO] Chart external graphics support .................... SUCCESS [  0.491 s]
[INFO] Feature Generalization Extension ................... SUCCESS [  3.047 s]
[INFO] Image Mosaic JDBC Extension ........................ SUCCESS [  0.504 s]
[INFO] OWS request flow controller ........................ SUCCESS [ 17.950 s]
[INFO] Web process status sharing with Hazelcast .......... SUCCESS [ 27.580 s]
[INFO] Web Processing Service GUI ......................... SKIPPED
[INFO] GeoServer Layer Querying filter functions .......... SUCCESS [ 15.744 s]
[INFO] Teradata DataStore Extension ....................... SUCCESS [  2.167 s]
[INFO] GeoServer Monitor Extensions ....................... SUCCESS [  0.068 s]
[INFO] Core Monitor Extension ............................. SKIPPED
[INFO] GeoServer Security Extension Modules ............... SUCCESS [  0.039 s]
[INFO] GeoServer CAS Security Module ...................... SUCCESS [  4.739 s]
[INFO] GeoServer Security Extension Web Modules ........... SUCCESS [  0.040 s]
[INFO] GeoServer CAS Security Web Module .................. SUCCESS [  1.758 s]
[INFO] XLST based WFS output format ....................... SUCCESS [ 17.305 s]
[INFO] GeoServer INSPIRE Extensions ....................... SKIPPED
[INFO] GeoServer CSS Styling .............................. SKIPPED
[INFO] Catalog Services for the Web parent ................ SUCCESS [  0.047 s]
[INFO] Catalog Services for the Web interfaces ............ SUCCESS [ 10.799 s]
[INFO] Catalog Services for the Web - Simple CatalogStore implementation SUCCESS [  8.552 s]
[INFO] Catalog Services for the Web core module ........... SUCCESS [ 31.299 s]
[INFO] CSW UI Module ...................................... SUCCESS [  8.845 s]
[INFO] DXF WFS output format and WPS PPIO ................. SUCCESS [  0.036 s]
[INFO] DXF WFS output format .............................. SUCCESS [ 13.770 s]
[INFO] DXF WPS PPIO ....................................... SUCCESS [  8.811 s]
[INFO] GeoServer WCS 2.0 Earth Observation Extensions ..... SUCCESS [  0.033 s]
[INFO] Web Coverage Service 2.0 Earth Observation extensions SUCCESS [ 17.817 s]
[INFO] Web Coverage Service 2.0 Earth Observation GUI extension SUCCESS [ 10.807 s]
[INFO] GeoServer libjpeg-turbo Module ..................... SKIPPED
[INFO] GeoServer Data Importer ............................ SKIPPED
[INFO] Importer Core Module ............................... SKIPPED
[INFO] Importer REST Api Module-ng ........................ SKIPPED
[INFO] Importer Berkley DB Persistence Module ............. SKIPPED
[INFO] Importer Web UI Module ............................. SKIPPED
[INFO] GRIB Coverage Format ............................... SUCCESS [ 15.604 s]
[INFO] NetCDF Coverage format ............................. SKIPPED
[INFO] WCS NetCDF output Module ........................... SKIPPED
[INFO] Vector Tiles ....................................... SKIPPED
[INFO] Ysld GeoServer Plugin .............................. SKIPPED
[INFO] MongoDB Data Store ................................. SUCCESS [  1.866 s]
[INFO] ------------------------------------------------------------------------
[INFO] BUILD FAILURE
[INFO] ------------------------------------------------------------------------
[INFO] Total time: 10:56 min (Wall Clock)
[INFO] Finished at: 2019-02-14T13:10:36+00:00
[INFO] Final Memory: 137M/1576M
[INFO] ------------------------------------------------------------------------
[ERROR] Failed to execute goal org.apache.maven.plugins:maven-compiler-plugin:2.3.2:compile (default-compile) on project gs-wms: Compilation failure
[ERROR] <https://build.geoserver.org/job/geoserver-2.14.x/ws/src/wms/src/main/java/org/geoserver/wms/capabilities/DimensionHelper.java>:[234,34] error: cannot find symbol
[ERROR] -> [Help 1]
[ERROR]
[ERROR] To see the full stack trace of the errors, re-run Maven with the -e switch.
[ERROR] Re-run Maven using the -X switch to enable full debug logging.
[ERROR]
[ERROR] For more information about the errors and possible solutions, please read the following articles:
[ERROR] [Help 1] http://cwiki.apache.org/confluence/display/MAVEN/MojoFailureException
[ERROR]
[ERROR] After correcting the problems, you can resume the build with the command
[ERROR]   mvn <goals> -rf :gs-wms
Build step 'Invoke top-level Maven targets' marked build as failure


_______________________________________________
Geoserver-devel mailing list
[hidden email]
https://lists.sourceforge.net/lists/listinfo/geoserver-devel
Reply | Threaded
Open this post in threaded view
|

Jenkins build is back to normal : geoserver-2.14.x #195

monitor
Reply | Threaded
Open this post in threaded view
|

Re: Build failed in Jenkins: geoserver-2.14.x #189

Torben Barsballe
In reply to this post by monitor
Looks like the backport of GEOS-8970 was missing an import, I've fixed it here. The 2.14.x build is green again.

Torben

On Mon, Feb 11, 2019 at 1:30 AM <[hidden email]> wrote:
See <https://build.geoserver.org/job/geoserver-2.14.x/189/display/redirect?page=changes>

Changes:

[Andrea Aime] [GEOS-9022] geoserver Style page, after expand button, html brokes

[Andrea Aime] [GEOS-8970] WMS GetCapabilities throws ConcurrentModificationException

------------------------------------------
[...truncated 828.25 KB...]
[INFO] Compiling 2 source files to <https://build.geoserver.org/job/geoserver-2.14.x/ws/src/extension/csw/web-csw/target/classes>
Running org.geoserver.security.cas.CasAuthenticationTest
Tests run: 5, Failures: 0, Errors: 0, Skipped: 5, Time elapsed: 1.447 sec
Running org.geoserver.security.cas.CasFilterConfigValidatorTest
Tests run: 1, Failures: 0, Errors: 0, Skipped: 0, Time elapsed: 0.669 sec

Results :

Tests run: 6, Failures: 0, Errors: 0, Skipped: 5

[INFO]
[INFO] --- maven-jar-plugin:2.4:jar (default-jar) @ gs-sec-cas ---
[INFO] Building jar: <https://build.geoserver.org/job/geoserver-2.14.x/ws/src/extension/security/cas/target/gs-sec-cas-2.14-SNAPSHOT.jar>
[INFO]
[INFO] --- maven-jar-plugin:2.4:test-jar (default) @ gs-sec-cas ---
[INFO] Building jar: <https://build.geoserver.org/job/geoserver-2.14.x/ws/src/extension/security/cas/target/gs-sec-cas-2.14-SNAPSHOT-tests.jar>
[INFO]
[INFO] --- maven-source-plugin:2.2.1:jar-no-fork (attach-sources) @ gs-sec-cas ---
[INFO] Building jar: <https://build.geoserver.org/job/geoserver-2.14.x/ws/src/extension/security/cas/target/gs-sec-cas-2.14-SNAPSHOT-sources.jar>
[INFO]
[INFO] --- maven-source-plugin:2.2.1:test-jar-no-fork (attach-sources) @ gs-sec-cas ---
[INFO] Building jar: <https://build.geoserver.org/job/geoserver-2.14.x/ws/src/extension/security/cas/target/gs-sec-cas-2.14-SNAPSHOT-test-sources.jar>
[INFO]
[INFO] --- fmt-maven-plugin:2.4.0:check (default) @ gs-sec-cas ---
[debug] Using AOSP style
[INFO] Processed 14 files (0 non-complying).
[INFO]
[INFO] --- maven-install-plugin:2.4:install (default-install) @ gs-sec-cas ---
[INFO] Installing <https://build.geoserver.org/job/geoserver-2.14.x/ws/src/extension/security/cas/target/gs-sec-cas-2.14-SNAPSHOT.jar> to /var/jenkins/.m2/repository/org/geoserver/security/gs-sec-cas/2.14-SNAPSHOT/gs-sec-cas-2.14-SNAPSHOT.jar
[INFO] Installing <https://build.geoserver.org/job/geoserver-2.14.x/ws/src/extension/security/cas/pom.xml> to /var/jenkins/.m2/repository/org/geoserver/security/gs-sec-cas/2.14-SNAPSHOT/gs-sec-cas-2.14-SNAPSHOT.pom
[INFO] Installing <https://build.geoserver.org/job/geoserver-2.14.x/ws/src/extension/security/cas/target/gs-sec-cas-2.14-SNAPSHOT-tests.jar> to /var/jenkins/.m2/repository/org/geoserver/security/gs-sec-cas/2.14-SNAPSHOT/gs-sec-cas-2.14-SNAPSHOT-tests.jar
[INFO] Installing <https://build.geoserver.org/job/geoserver-2.14.x/ws/src/extension/security/cas/target/gs-sec-cas-2.14-SNAPSHOT-sources.jar> to /var/jenkins/.m2/repository/org/geoserver/security/gs-sec-cas/2.14-SNAPSHOT/gs-sec-cas-2.14-SNAPSHOT-sources.jar
[INFO] Installing <https://build.geoserver.org/job/geoserver-2.14.x/ws/src/extension/security/cas/target/gs-sec-cas-2.14-SNAPSHOT-test-sources.jar> to /var/jenkins/.m2/repository/org/geoserver/security/gs-sec-cas/2.14-SNAPSHOT/gs-sec-cas-2.14-SNAPSHOT-test-sources.jar
[INFO]                                                                         
[INFO] ------------------------------------------------------------------------
[INFO] Building GeoServer CAS Security Web Module 2.14-SNAPSHOT
[INFO] ------------------------------------------------------------------------
[INFO]
[INFO] --- maven-clean-plugin:2.5:clean (default-clean) @ gs-web-sec-cas ---
[INFO] Deleting <https://build.geoserver.org/job/geoserver-2.14.x/ws/src/extension/security/web/web-cas/target>
[INFO]
[INFO] --- git-commit-id-plugin:2.1.15:revision (default) @ gs-web-sec-cas ---
[INFO]
[INFO] --- maven-resources-plugin:2.6:resources (default-resources) @ gs-web-sec-cas ---
[INFO] Using 'UTF-8' encoding to copy filtered resources.
[INFO] Copying 2 resources
[INFO] skip non existing resourceDirectory <https://build.geoserver.org/job/geoserver-2.14.x/ws/src/extension/security/web/web-cas/src/main/resources>
[INFO]
[INFO] --- maven-compiler-plugin:2.3.2:compile (default-compile) @ gs-web-sec-cas ---
[INFO] Compiling 2 source files to <https://build.geoserver.org/job/geoserver-2.14.x/ws/src/extension/security/web/web-cas/target/classes>
[INFO]
[INFO] --- maven-resources-plugin:2.6:testResources (default-testResources) @ gs-web-csw ---
[INFO] Using 'UTF-8' encoding to copy filtered resources.
[INFO] Copying 0 resource
[INFO] skip non existing resourceDirectory <https://build.geoserver.org/job/geoserver-2.14.x/ws/src/extension/csw/web-csw/src/test/resources>
[INFO]
[INFO] --- maven-compiler-plugin:2.3.2:testCompile (default-testCompile) @ gs-web-csw ---
[INFO] Compiling 1 source file to <https://build.geoserver.org/job/geoserver-2.14.x/ws/src/extension/csw/web-csw/target/test-classes>
[INFO]
[INFO] --- maven-resources-plugin:2.6:testResources (default-testResources) @ gs-web-sec-cas ---
[INFO] Using 'UTF-8' encoding to copy filtered resources.
[INFO] skip non existing resourceDirectory <https://build.geoserver.org/job/geoserver-2.14.x/ws/src/extension/security/web/web-cas/src/test/java>
[INFO] skip non existing resourceDirectory <https://build.geoserver.org/job/geoserver-2.14.x/ws/src/extension/security/web/web-cas/src/test/resources>
[INFO]
[INFO] --- maven-compiler-plugin:2.3.2:testCompile (default-testCompile) @ gs-web-sec-cas ---
[INFO] No sources to compile
[INFO]
[INFO] --- maven-surefire-plugin:2.12.3:test (default-test) @ gs-web-sec-cas ---
[INFO] No tests to run.
[INFO]
[INFO] --- maven-jar-plugin:2.4:jar (default-jar) @ gs-web-sec-cas ---
[INFO] Building jar: <https://build.geoserver.org/job/geoserver-2.14.x/ws/src/extension/security/web/web-cas/target/gs-web-sec-cas-2.14-SNAPSHOT.jar>
[INFO]
[INFO] --- maven-jar-plugin:2.4:test-jar (default) @ gs-web-sec-cas ---
[WARNING] JAR will be empty - no content was marked for inclusion!
[INFO] Building jar: <https://build.geoserver.org/job/geoserver-2.14.x/ws/src/extension/security/web/web-cas/target/gs-web-sec-cas-2.14-SNAPSHOT-tests.jar>
[INFO]
[INFO] --- maven-source-plugin:2.2.1:jar-no-fork (attach-sources) @ gs-web-sec-cas ---
[INFO] Building jar: <https://build.geoserver.org/job/geoserver-2.14.x/ws/src/extension/security/web/web-cas/target/gs-web-sec-cas-2.14-SNAPSHOT-sources.jar>
[INFO]
[INFO] --- maven-source-plugin:2.2.1:test-jar-no-fork (attach-sources) @ gs-web-sec-cas ---
[INFO] No sources in project. Archive not created.
[INFO]
[INFO] --- fmt-maven-plugin:2.4.0:check (default) @ gs-web-sec-cas ---
[warn] Test source directory '<https://build.geoserver.org/job/geoserver-2.14.x/ws/src/extension/security/web/web-cas/src/test/java'> does not exist, ignoring.
[debug] Using AOSP style
[INFO] Processed 2 files (0 non-complying).
[INFO]
[INFO] --- maven-install-plugin:2.4:install (default-install) @ gs-web-sec-cas ---
[INFO] Installing <https://build.geoserver.org/job/geoserver-2.14.x/ws/src/extension/security/web/web-cas/target/gs-web-sec-cas-2.14-SNAPSHOT.jar> to /var/jenkins/.m2/repository/org/geoserver/security/gs-web-sec-cas/2.14-SNAPSHOT/gs-web-sec-cas-2.14-SNAPSHOT.jar
[INFO] Installing <https://build.geoserver.org/job/geoserver-2.14.x/ws/src/extension/security/web/web-cas/pom.xml> to /var/jenkins/.m2/repository/org/geoserver/security/gs-web-sec-cas/2.14-SNAPSHOT/gs-web-sec-cas-2.14-SNAPSHOT.pom
[INFO] Installing <https://build.geoserver.org/job/geoserver-2.14.x/ws/src/extension/security/web/web-cas/target/gs-web-sec-cas-2.14-SNAPSHOT-tests.jar> to /var/jenkins/.m2/repository/org/geoserver/security/gs-web-sec-cas/2.14-SNAPSHOT/gs-web-sec-cas-2.14-SNAPSHOT-tests.jar
[INFO]
[INFO] --- maven-surefire-plugin:2.12.3:test (default-test) @ gs-web-csw ---
[INFO] Installing <https://build.geoserver.org/job/geoserver-2.14.x/ws/src/extension/security/web/web-cas/target/gs-web-sec-cas-2.14-SNAPSHOT-sources.jar> to /var/jenkins/.m2/repository/org/geoserver/security/gs-web-sec-cas/2.14-SNAPSHOT/gs-web-sec-cas-2.14-SNAPSHOT-sources.jar
[INFO] Surefire report directory: <https://build.geoserver.org/job/geoserver-2.14.x/ws/src/extension/csw/web-csw/target/surefire-reports>

-------------------------------------------------------
 T E S T S
-------------------------------------------------------
Running org.geoserver.wfs.web.CSWAdminPageTest
Tests run: 1, Failures: 0, Errors: 0, Skipped: 0, Time elapsed: 7.132 sec

Results :

Tests run: 1, Failures: 0, Errors: 0, Skipped: 0

[INFO]
[INFO] --- maven-jar-plugin:2.4:jar (default-jar) @ gs-web-csw ---
[INFO] Building jar: <https://build.geoserver.org/job/geoserver-2.14.x/ws/src/extension/csw/web-csw/target/gs-web-csw-2.14-SNAPSHOT.jar>
[INFO]
[INFO] --- maven-jar-plugin:2.4:test-jar (default) @ gs-web-csw ---
[INFO] Building jar: <https://build.geoserver.org/job/geoserver-2.14.x/ws/src/extension/csw/web-csw/target/gs-web-csw-2.14-SNAPSHOT-tests.jar>
[INFO]
[INFO] --- maven-source-plugin:2.2.1:jar-no-fork (attach-sources) @ gs-web-csw ---
[INFO] Building jar: <https://build.geoserver.org/job/geoserver-2.14.x/ws/src/extension/csw/web-csw/target/gs-web-csw-2.14-SNAPSHOT-sources.jar>
[INFO]
[INFO] --- maven-source-plugin:2.2.1:test-jar-no-fork (attach-sources) @ gs-web-csw ---
[INFO] Building jar: <https://build.geoserver.org/job/geoserver-2.14.x/ws/src/extension/csw/web-csw/target/gs-web-csw-2.14-SNAPSHOT-test-sources.jar>
[INFO]
[INFO] --- fmt-maven-plugin:2.4.0:check (default) @ gs-web-csw ---
[debug] Using AOSP style
[INFO] Processed 3 files (0 non-complying).
[INFO]
[INFO] --- maven-install-plugin:2.4:install (default-install) @ gs-web-csw ---
[INFO] Installing <https://build.geoserver.org/job/geoserver-2.14.x/ws/src/extension/csw/web-csw/target/gs-web-csw-2.14-SNAPSHOT.jar> to /var/jenkins/.m2/repository/org/geoserver/csw/gs-web-csw/2.14-SNAPSHOT/gs-web-csw-2.14-SNAPSHOT.jar
[INFO] Installing <https://build.geoserver.org/job/geoserver-2.14.x/ws/src/extension/csw/web-csw/pom.xml> to /var/jenkins/.m2/repository/org/geoserver/csw/gs-web-csw/2.14-SNAPSHOT/gs-web-csw-2.14-SNAPSHOT.pom
[INFO] Installing <https://build.geoserver.org/job/geoserver-2.14.x/ws/src/extension/csw/web-csw/target/gs-web-csw-2.14-SNAPSHOT-tests.jar> to /var/jenkins/.m2/repository/org/geoserver/csw/gs-web-csw/2.14-SNAPSHOT/gs-web-csw-2.14-SNAPSHOT-tests.jar
[INFO] Installing <https://build.geoserver.org/job/geoserver-2.14.x/ws/src/extension/csw/web-csw/target/gs-web-csw-2.14-SNAPSHOT-sources.jar> to /var/jenkins/.m2/repository/org/geoserver/csw/gs-web-csw/2.14-SNAPSHOT/gs-web-csw-2.14-SNAPSHOT-sources.jar
[INFO] Installing <https://build.geoserver.org/job/geoserver-2.14.x/ws/src/extension/csw/web-csw/target/gs-web-csw-2.14-SNAPSHOT-test-sources.jar> to /var/jenkins/.m2/repository/org/geoserver/csw/gs-web-csw/2.14-SNAPSHOT/gs-web-csw-2.14-SNAPSHOT-test-sources.jar
[INFO] ------------------------------------------------------------------------
[INFO] Reactor Summary:
[INFO]
[INFO] GeoServer .......................................... SUCCESS [  9.804 s]
[INFO] Core Platform Module ............................... SUCCESS [ 21.769 s]
[INFO] Open Web Service Module ............................ SUCCESS [ 23.457 s]
[INFO] Main Module ........................................ SUCCESS [01:56 min]
[INFO] GeoServer Security Modules ......................... SUCCESS [  0.126 s]
[INFO] GeoServer Security Tests Module .................... SUCCESS [01:32 min]
[INFO] GeoServer JDBC Security Module ..................... SUCCESS [01:06 min]
[INFO] GeoServer LDAP Security Module ..................... SUCCESS [ 28.578 s]
[INFO] Web Coverage Service Module ........................ SUCCESS [  6.896 s]
[INFO] Web Coverage Service 1.0 Module .................... SUCCESS [ 26.343 s]
[INFO] Web Coverage Service 1.1 Module .................... SUCCESS [ 40.662 s]
[INFO] Web Coverage Service 2.0 Module .................... SUCCESS [01:37 min]
[INFO] Web Feature Service Module ......................... SUCCESS [02:42 min]
[INFO] Web Map Service Module ............................. FAILURE [ 14.203 s]
[INFO] KML support for GeoServer .......................... SKIPPED
[INFO] gs-rest ............................................ SUCCESS [ 26.625 s]
[INFO] GeoWebCache (GWC) Module ........................... SKIPPED
[INFO] gs-restconfig ...................................... SUCCESS [02:36 min]
[INFO] gs-restconfig-wcs .................................. SUCCESS [ 32.318 s]
[INFO] gs-restconfig-wfs .................................. SUCCESS [ 30.967 s]
[INFO] gs-restconfig-wms .................................. SKIPPED
[INFO] GeoServer Web Modules .............................. SUCCESS [  0.101 s]
[INFO] Core UI Module ..................................... SUCCESS [01:59 min]
[INFO] WMS UI Module ...................................... SKIPPED
[INFO] GWC UI Module ...................................... SKIPPED
[INFO] WFS UI Module ...................................... SUCCESS [ 18.421 s]
[INFO] Demos Module ....................................... SKIPPED
[INFO] WCS UI Module ...................................... SKIPPED
[INFO] Security UI Modules ................................ SUCCESS [  0.068 s]
[INFO] Security UI Core Module ............................ SUCCESS [03:00 min]
[INFO] Security UI JDBC Module ............................ SUCCESS [01:47 min]
[INFO] Security UI LDAP Module ............................ SUCCESS [ 33.557 s]
[INFO] REST UI Module ..................................... SUCCESS [ 19.874 s]
[INFO] GeoServer Extensions ............................... SUCCESS [  0.062 s]
[INFO] Printing Module .................................... SUCCESS [ 20.932 s]
[INFO] GeoServer Web Application .......................... SKIPPED
[INFO] Community Space .................................... SUCCESS [  0.036 s]
[INFO] Application Schema Support ......................... SUCCESS [  0.085 s]
[INFO] Application Schema Integration Test ................ SKIPPED
[INFO] Sample DataAccess Integration Test ................. SUCCESS [ 13.218 s]
[INFO] ArcSDE DataStore Extension ......................... SUCCESS [ 22.611 s]
[INFO] H2 DataStore Extension ............................. SUCCESS [ 21.264 s]
[INFO] SQL Server DataStore Extension ..................... SUCCESS [  1.081 s]
[INFO] Oracle DataStore Extension ......................... SUCCESS [  0.564 s]
[INFO] MySQL DataStore Extension .......................... SUCCESS [  0.344 s]
[INFO] DB2 DataStore Extension ............................ SUCCESS [  0.352 s]
[INFO] ImageMap Output Format ............................. SKIPPED
[INFO] ImageI/O-Ext GDAL Coverage Extension ............... SUCCESS [  7.825 s]
[INFO] JP2K Coverage Extension ............................ SUCCESS [  0.368 s]
[INFO] OGR parent ......................................... SUCCESS [  0.077 s]
[INFO] OGR CORE ........................................... SUCCESS [  3.614 s]
[INFO] OGR WFS ............................................ SUCCESS [ 11.167 s]
[INFO] Web Processing Service parent ...................... SUCCESS [  0.073 s]
[INFO] Web Processing Service Module ...................... SUCCESS [02:00 min]
[INFO] OGR WPS ............................................ SUCCESS [ 16.400 s]
[INFO] Excel Output Format ................................ SUCCESS [ 18.120 s]
[INFO] Chart external graphics support .................... SUCCESS [  0.623 s]
[INFO] Feature Generalization Extension ................... SUCCESS [  3.579 s]
[INFO] Image Mosaic JDBC Extension ........................ SUCCESS [  0.701 s]
[INFO] OWS request flow controller ........................ SUCCESS [ 21.560 s]
[INFO] Web process status sharing with Hazelcast .......... SUCCESS [ 30.736 s]
[INFO] Web Processing Service GUI ......................... SKIPPED
[INFO] GeoServer Layer Querying filter functions .......... SUCCESS [ 19.700 s]
[INFO] Teradata DataStore Extension ....................... SUCCESS [  2.924 s]
[INFO] GeoServer Monitor Extensions ....................... SUCCESS [  0.175 s]
[INFO] Core Monitor Extension ............................. SKIPPED
[INFO] GeoServer Security Extension Modules ............... SUCCESS [  0.076 s]
[INFO] GeoServer CAS Security Module ...................... SUCCESS [ 12.337 s]
[INFO] GeoServer Security Extension Web Modules ........... SUCCESS [  0.078 s]
[INFO] GeoServer CAS Security Web Module .................. SUCCESS [  4.698 s]
[INFO] XLST based WFS output format ....................... SUCCESS [ 41.884 s]
[INFO] GeoServer INSPIRE Extensions ....................... SKIPPED
[INFO] GeoServer CSS Styling .............................. SKIPPED
[INFO] Catalog Services for the Web parent ................ SUCCESS [  0.106 s]
[INFO] Catalog Services for the Web interfaces ............ SUCCESS [ 12.352 s]
[INFO] Catalog Services for the Web - Simple CatalogStore implementation SUCCESS [ 22.906 s]
[INFO] Catalog Services for the Web core module ........... SUCCESS [01:01 min]
[INFO] CSW UI Module ...................................... SUCCESS [ 15.631 s]
[INFO] DXF WFS output format and WPS PPIO ................. SUCCESS [  0.088 s]
[INFO] DXF WFS output format .............................. SUCCESS [ 18.005 s]
[INFO] DXF WPS PPIO ....................................... SUCCESS [ 19.271 s]
[INFO] GeoServer WCS 2.0 Earth Observation Extensions ..... SUCCESS [  0.076 s]
[INFO] Web Coverage Service 2.0 Earth Observation extensions SUCCESS [ 28.248 s]
[INFO] Web Coverage Service 2.0 Earth Observation GUI extension SUCCESS [ 21.827 s]
[INFO] GeoServer libjpeg-turbo Module ..................... SKIPPED
[INFO] GeoServer Data Importer ............................ SKIPPED
[INFO] Importer Core Module ............................... SKIPPED
[INFO] Importer REST Api Module-ng ........................ SKIPPED
[INFO] Importer Berkley DB Persistence Module ............. SKIPPED
[INFO] Importer Web UI Module ............................. SKIPPED
[INFO] GRIB Coverage Format ............................... SUCCESS [ 28.051 s]
[INFO] NetCDF Coverage format ............................. SKIPPED
[INFO] WCS NetCDF output Module ........................... SKIPPED
[INFO] Vector Tiles ....................................... SKIPPED
[INFO] Ysld GeoServer Plugin .............................. SKIPPED
[INFO] MongoDB Data Store ................................. SUCCESS [  2.291 s]
[INFO] ------------------------------------------------------------------------
[INFO] BUILD FAILURE
[INFO] ------------------------------------------------------------------------
[INFO] Total time: 18:37 min (Wall Clock)
[INFO] Finished at: 2019-02-11T09:30:04+00:00
[INFO] Final Memory: 138M/1357M
[INFO] ------------------------------------------------------------------------
[ERROR] Failed to execute goal org.apache.maven.plugins:maven-compiler-plugin:2.3.2:compile (default-compile) on project gs-wms: Compilation failure
[ERROR] <https://build.geoserver.org/job/geoserver-2.14.x/ws/src/wms/src/main/java/org/geoserver/wms/capabilities/DimensionHelper.java>:[234,34] error: cannot find symbol
[ERROR] -> [Help 1]
[ERROR]
[ERROR] To see the full stack trace of the errors, re-run Maven with the -e switch.
[ERROR] Re-run Maven using the -X switch to enable full debug logging.
[ERROR]
[ERROR] For more information about the errors and possible solutions, please read the following articles:
[ERROR] [Help 1] http://cwiki.apache.org/confluence/display/MAVEN/MojoFailureException
[ERROR]
[ERROR] After correcting the problems, you can resume the build with the command
[ERROR]   mvn <goals> -rf :gs-wms
Build step 'Invoke top-level Maven targets' marked build as failure


_______________________________________________
Geoserver-devel mailing list
[hidden email]
https://lists.sourceforge.net/lists/listinfo/geoserver-devel


_______________________________________________
Geoserver-devel mailing list
[hidden email]
https://lists.sourceforge.net/lists/listinfo/geoserver-devel
Reply | Threaded
Open this post in threaded view
|

Re: Build failed in Jenkins: geoserver-2.14.x #189

geowolf
Doh sorry did not notice, been a bit behind with mail lately. Thanks a lot for fixing!

Cheers
Andrea

Il giorno ven 15 feb 2019, 01:57 Torben Barsballe <[hidden email]> ha scritto:
Looks like the backport of GEOS-8970 was missing an import, I've fixed it here. The 2.14.x build is green again.

Torben

On Mon, Feb 11, 2019 at 1:30 AM <[hidden email]> wrote:
See <https://build.geoserver.org/job/geoserver-2.14.x/189/display/redirect?page=changes>

Changes:

[Andrea Aime] [GEOS-9022] geoserver Style page, after expand button, html brokes

[Andrea Aime] [GEOS-8970] WMS GetCapabilities throws ConcurrentModificationException

------------------------------------------
[...truncated 828.25 KB...]
[INFO] Compiling 2 source files to <https://build.geoserver.org/job/geoserver-2.14.x/ws/src/extension/csw/web-csw/target/classes>
Running org.geoserver.security.cas.CasAuthenticationTest
Tests run: 5, Failures: 0, Errors: 0, Skipped: 5, Time elapsed: 1.447 sec
Running org.geoserver.security.cas.CasFilterConfigValidatorTest
Tests run: 1, Failures: 0, Errors: 0, Skipped: 0, Time elapsed: 0.669 sec

Results :

Tests run: 6, Failures: 0, Errors: 0, Skipped: 5

[INFO]
[INFO] --- maven-jar-plugin:2.4:jar (default-jar) @ gs-sec-cas ---
[INFO] Building jar: <https://build.geoserver.org/job/geoserver-2.14.x/ws/src/extension/security/cas/target/gs-sec-cas-2.14-SNAPSHOT.jar>
[INFO]
[INFO] --- maven-jar-plugin:2.4:test-jar (default) @ gs-sec-cas ---
[INFO] Building jar: <https://build.geoserver.org/job/geoserver-2.14.x/ws/src/extension/security/cas/target/gs-sec-cas-2.14-SNAPSHOT-tests.jar>
[INFO]
[INFO] --- maven-source-plugin:2.2.1:jar-no-fork (attach-sources) @ gs-sec-cas ---
[INFO] Building jar: <https://build.geoserver.org/job/geoserver-2.14.x/ws/src/extension/security/cas/target/gs-sec-cas-2.14-SNAPSHOT-sources.jar>
[INFO]
[INFO] --- maven-source-plugin:2.2.1:test-jar-no-fork (attach-sources) @ gs-sec-cas ---
[INFO] Building jar: <https://build.geoserver.org/job/geoserver-2.14.x/ws/src/extension/security/cas/target/gs-sec-cas-2.14-SNAPSHOT-test-sources.jar>
[INFO]
[INFO] --- fmt-maven-plugin:2.4.0:check (default) @ gs-sec-cas ---
[debug] Using AOSP style
[INFO] Processed 14 files (0 non-complying).
[INFO]
[INFO] --- maven-install-plugin:2.4:install (default-install) @ gs-sec-cas ---
[INFO] Installing <https://build.geoserver.org/job/geoserver-2.14.x/ws/src/extension/security/cas/target/gs-sec-cas-2.14-SNAPSHOT.jar> to /var/jenkins/.m2/repository/org/geoserver/security/gs-sec-cas/2.14-SNAPSHOT/gs-sec-cas-2.14-SNAPSHOT.jar
[INFO] Installing <https://build.geoserver.org/job/geoserver-2.14.x/ws/src/extension/security/cas/pom.xml> to /var/jenkins/.m2/repository/org/geoserver/security/gs-sec-cas/2.14-SNAPSHOT/gs-sec-cas-2.14-SNAPSHOT.pom
[INFO] Installing <https://build.geoserver.org/job/geoserver-2.14.x/ws/src/extension/security/cas/target/gs-sec-cas-2.14-SNAPSHOT-tests.jar> to /var/jenkins/.m2/repository/org/geoserver/security/gs-sec-cas/2.14-SNAPSHOT/gs-sec-cas-2.14-SNAPSHOT-tests.jar
[INFO] Installing <https://build.geoserver.org/job/geoserver-2.14.x/ws/src/extension/security/cas/target/gs-sec-cas-2.14-SNAPSHOT-sources.jar> to /var/jenkins/.m2/repository/org/geoserver/security/gs-sec-cas/2.14-SNAPSHOT/gs-sec-cas-2.14-SNAPSHOT-sources.jar
[INFO] Installing <https://build.geoserver.org/job/geoserver-2.14.x/ws/src/extension/security/cas/target/gs-sec-cas-2.14-SNAPSHOT-test-sources.jar> to /var/jenkins/.m2/repository/org/geoserver/security/gs-sec-cas/2.14-SNAPSHOT/gs-sec-cas-2.14-SNAPSHOT-test-sources.jar
[INFO]                                                                         
[INFO] ------------------------------------------------------------------------
[INFO] Building GeoServer CAS Security Web Module 2.14-SNAPSHOT
[INFO] ------------------------------------------------------------------------
[INFO]
[INFO] --- maven-clean-plugin:2.5:clean (default-clean) @ gs-web-sec-cas ---
[INFO] Deleting <https://build.geoserver.org/job/geoserver-2.14.x/ws/src/extension/security/web/web-cas/target>
[INFO]
[INFO] --- git-commit-id-plugin:2.1.15:revision (default) @ gs-web-sec-cas ---
[INFO]
[INFO] --- maven-resources-plugin:2.6:resources (default-resources) @ gs-web-sec-cas ---
[INFO] Using 'UTF-8' encoding to copy filtered resources.
[INFO] Copying 2 resources
[INFO] skip non existing resourceDirectory <https://build.geoserver.org/job/geoserver-2.14.x/ws/src/extension/security/web/web-cas/src/main/resources>
[INFO]
[INFO] --- maven-compiler-plugin:2.3.2:compile (default-compile) @ gs-web-sec-cas ---
[INFO] Compiling 2 source files to <https://build.geoserver.org/job/geoserver-2.14.x/ws/src/extension/security/web/web-cas/target/classes>
[INFO]
[INFO] --- maven-resources-plugin:2.6:testResources (default-testResources) @ gs-web-csw ---
[INFO] Using 'UTF-8' encoding to copy filtered resources.
[INFO] Copying 0 resource
[INFO] skip non existing resourceDirectory <https://build.geoserver.org/job/geoserver-2.14.x/ws/src/extension/csw/web-csw/src/test/resources>
[INFO]
[INFO] --- maven-compiler-plugin:2.3.2:testCompile (default-testCompile) @ gs-web-csw ---
[INFO] Compiling 1 source file to <https://build.geoserver.org/job/geoserver-2.14.x/ws/src/extension/csw/web-csw/target/test-classes>
[INFO]
[INFO] --- maven-resources-plugin:2.6:testResources (default-testResources) @ gs-web-sec-cas ---
[INFO] Using 'UTF-8' encoding to copy filtered resources.
[INFO] skip non existing resourceDirectory <https://build.geoserver.org/job/geoserver-2.14.x/ws/src/extension/security/web/web-cas/src/test/java>
[INFO] skip non existing resourceDirectory <https://build.geoserver.org/job/geoserver-2.14.x/ws/src/extension/security/web/web-cas/src/test/resources>
[INFO]
[INFO] --- maven-compiler-plugin:2.3.2:testCompile (default-testCompile) @ gs-web-sec-cas ---
[INFO] No sources to compile
[INFO]
[INFO] --- maven-surefire-plugin:2.12.3:test (default-test) @ gs-web-sec-cas ---
[INFO] No tests to run.
[INFO]
[INFO] --- maven-jar-plugin:2.4:jar (default-jar) @ gs-web-sec-cas ---
[INFO] Building jar: <https://build.geoserver.org/job/geoserver-2.14.x/ws/src/extension/security/web/web-cas/target/gs-web-sec-cas-2.14-SNAPSHOT.jar>
[INFO]
[INFO] --- maven-jar-plugin:2.4:test-jar (default) @ gs-web-sec-cas ---
[WARNING] JAR will be empty - no content was marked for inclusion!
[INFO] Building jar: <https://build.geoserver.org/job/geoserver-2.14.x/ws/src/extension/security/web/web-cas/target/gs-web-sec-cas-2.14-SNAPSHOT-tests.jar>
[INFO]
[INFO] --- maven-source-plugin:2.2.1:jar-no-fork (attach-sources) @ gs-web-sec-cas ---
[INFO] Building jar: <https://build.geoserver.org/job/geoserver-2.14.x/ws/src/extension/security/web/web-cas/target/gs-web-sec-cas-2.14-SNAPSHOT-sources.jar>
[INFO]
[INFO] --- maven-source-plugin:2.2.1:test-jar-no-fork (attach-sources) @ gs-web-sec-cas ---
[INFO] No sources in project. Archive not created.
[INFO]
[INFO] --- fmt-maven-plugin:2.4.0:check (default) @ gs-web-sec-cas ---
[warn] Test source directory '<https://build.geoserver.org/job/geoserver-2.14.x/ws/src/extension/security/web/web-cas/src/test/java'> does not exist, ignoring.
[debug] Using AOSP style
[INFO] Processed 2 files (0 non-complying).
[INFO]
[INFO] --- maven-install-plugin:2.4:install (default-install) @ gs-web-sec-cas ---
[INFO] Installing <https://build.geoserver.org/job/geoserver-2.14.x/ws/src/extension/security/web/web-cas/target/gs-web-sec-cas-2.14-SNAPSHOT.jar> to /var/jenkins/.m2/repository/org/geoserver/security/gs-web-sec-cas/2.14-SNAPSHOT/gs-web-sec-cas-2.14-SNAPSHOT.jar
[INFO] Installing <https://build.geoserver.org/job/geoserver-2.14.x/ws/src/extension/security/web/web-cas/pom.xml> to /var/jenkins/.m2/repository/org/geoserver/security/gs-web-sec-cas/2.14-SNAPSHOT/gs-web-sec-cas-2.14-SNAPSHOT.pom
[INFO] Installing <https://build.geoserver.org/job/geoserver-2.14.x/ws/src/extension/security/web/web-cas/target/gs-web-sec-cas-2.14-SNAPSHOT-tests.jar> to /var/jenkins/.m2/repository/org/geoserver/security/gs-web-sec-cas/2.14-SNAPSHOT/gs-web-sec-cas-2.14-SNAPSHOT-tests.jar
[INFO]
[INFO] --- maven-surefire-plugin:2.12.3:test (default-test) @ gs-web-csw ---
[INFO] Installing <https://build.geoserver.org/job/geoserver-2.14.x/ws/src/extension/security/web/web-cas/target/gs-web-sec-cas-2.14-SNAPSHOT-sources.jar> to /var/jenkins/.m2/repository/org/geoserver/security/gs-web-sec-cas/2.14-SNAPSHOT/gs-web-sec-cas-2.14-SNAPSHOT-sources.jar
[INFO] Surefire report directory: <https://build.geoserver.org/job/geoserver-2.14.x/ws/src/extension/csw/web-csw/target/surefire-reports>

-------------------------------------------------------
 T E S T S
-------------------------------------------------------
Running org.geoserver.wfs.web.CSWAdminPageTest
Tests run: 1, Failures: 0, Errors: 0, Skipped: 0, Time elapsed: 7.132 sec

Results :

Tests run: 1, Failures: 0, Errors: 0, Skipped: 0

[INFO]
[INFO] --- maven-jar-plugin:2.4:jar (default-jar) @ gs-web-csw ---
[INFO] Building jar: <https://build.geoserver.org/job/geoserver-2.14.x/ws/src/extension/csw/web-csw/target/gs-web-csw-2.14-SNAPSHOT.jar>
[INFO]
[INFO] --- maven-jar-plugin:2.4:test-jar (default) @ gs-web-csw ---
[INFO] Building jar: <https://build.geoserver.org/job/geoserver-2.14.x/ws/src/extension/csw/web-csw/target/gs-web-csw-2.14-SNAPSHOT-tests.jar>
[INFO]
[INFO] --- maven-source-plugin:2.2.1:jar-no-fork (attach-sources) @ gs-web-csw ---
[INFO] Building jar: <https://build.geoserver.org/job/geoserver-2.14.x/ws/src/extension/csw/web-csw/target/gs-web-csw-2.14-SNAPSHOT-sources.jar>
[INFO]
[INFO] --- maven-source-plugin:2.2.1:test-jar-no-fork (attach-sources) @ gs-web-csw ---
[INFO] Building jar: <https://build.geoserver.org/job/geoserver-2.14.x/ws/src/extension/csw/web-csw/target/gs-web-csw-2.14-SNAPSHOT-test-sources.jar>
[INFO]
[INFO] --- fmt-maven-plugin:2.4.0:check (default) @ gs-web-csw ---
[debug] Using AOSP style
[INFO] Processed 3 files (0 non-complying).
[INFO]
[INFO] --- maven-install-plugin:2.4:install (default-install) @ gs-web-csw ---
[INFO] Installing <https://build.geoserver.org/job/geoserver-2.14.x/ws/src/extension/csw/web-csw/target/gs-web-csw-2.14-SNAPSHOT.jar> to /var/jenkins/.m2/repository/org/geoserver/csw/gs-web-csw/2.14-SNAPSHOT/gs-web-csw-2.14-SNAPSHOT.jar
[INFO] Installing <https://build.geoserver.org/job/geoserver-2.14.x/ws/src/extension/csw/web-csw/pom.xml> to /var/jenkins/.m2/repository/org/geoserver/csw/gs-web-csw/2.14-SNAPSHOT/gs-web-csw-2.14-SNAPSHOT.pom
[INFO] Installing <https://build.geoserver.org/job/geoserver-2.14.x/ws/src/extension/csw/web-csw/target/gs-web-csw-2.14-SNAPSHOT-tests.jar> to /var/jenkins/.m2/repository/org/geoserver/csw/gs-web-csw/2.14-SNAPSHOT/gs-web-csw-2.14-SNAPSHOT-tests.jar
[INFO] Installing <https://build.geoserver.org/job/geoserver-2.14.x/ws/src/extension/csw/web-csw/target/gs-web-csw-2.14-SNAPSHOT-sources.jar> to /var/jenkins/.m2/repository/org/geoserver/csw/gs-web-csw/2.14-SNAPSHOT/gs-web-csw-2.14-SNAPSHOT-sources.jar
[INFO] Installing <https://build.geoserver.org/job/geoserver-2.14.x/ws/src/extension/csw/web-csw/target/gs-web-csw-2.14-SNAPSHOT-test-sources.jar> to /var/jenkins/.m2/repository/org/geoserver/csw/gs-web-csw/2.14-SNAPSHOT/gs-web-csw-2.14-SNAPSHOT-test-sources.jar
[INFO] ------------------------------------------------------------------------
[INFO] Reactor Summary:
[INFO]
[INFO] GeoServer .......................................... SUCCESS [  9.804 s]
[INFO] Core Platform Module ............................... SUCCESS [ 21.769 s]
[INFO] Open Web Service Module ............................ SUCCESS [ 23.457 s]
[INFO] Main Module ........................................ SUCCESS [01:56 min]
[INFO] GeoServer Security Modules ......................... SUCCESS [  0.126 s]
[INFO] GeoServer Security Tests Module .................... SUCCESS [01:32 min]
[INFO] GeoServer JDBC Security Module ..................... SUCCESS [01:06 min]
[INFO] GeoServer LDAP Security Module ..................... SUCCESS [ 28.578 s]
[INFO] Web Coverage Service Module ........................ SUCCESS [  6.896 s]
[INFO] Web Coverage Service 1.0 Module .................... SUCCESS [ 26.343 s]
[INFO] Web Coverage Service 1.1 Module .................... SUCCESS [ 40.662 s]
[INFO] Web Coverage Service 2.0 Module .................... SUCCESS [01:37 min]
[INFO] Web Feature Service Module ......................... SUCCESS [02:42 min]
[INFO] Web Map Service Module ............................. FAILURE [ 14.203 s]
[INFO] KML support for GeoServer .......................... SKIPPED
[INFO] gs-rest ............................................ SUCCESS [ 26.625 s]
[INFO] GeoWebCache (GWC) Module ........................... SKIPPED
[INFO] gs-restconfig ...................................... SUCCESS [02:36 min]
[INFO] gs-restconfig-wcs .................................. SUCCESS [ 32.318 s]
[INFO] gs-restconfig-wfs .................................. SUCCESS [ 30.967 s]
[INFO] gs-restconfig-wms .................................. SKIPPED
[INFO] GeoServer Web Modules .............................. SUCCESS [  0.101 s]
[INFO] Core UI Module ..................................... SUCCESS [01:59 min]
[INFO] WMS UI Module ...................................... SKIPPED
[INFO] GWC UI Module ...................................... SKIPPED
[INFO] WFS UI Module ...................................... SUCCESS [ 18.421 s]
[INFO] Demos Module ....................................... SKIPPED
[INFO] WCS UI Module ...................................... SKIPPED
[INFO] Security UI Modules ................................ SUCCESS [  0.068 s]
[INFO] Security UI Core Module ............................ SUCCESS [03:00 min]
[INFO] Security UI JDBC Module ............................ SUCCESS [01:47 min]
[INFO] Security UI LDAP Module ............................ SUCCESS [ 33.557 s]
[INFO] REST UI Module ..................................... SUCCESS [ 19.874 s]
[INFO] GeoServer Extensions ............................... SUCCESS [  0.062 s]
[INFO] Printing Module .................................... SUCCESS [ 20.932 s]
[INFO] GeoServer Web Application .......................... SKIPPED
[INFO] Community Space .................................... SUCCESS [  0.036 s]
[INFO] Application Schema Support ......................... SUCCESS [  0.085 s]
[INFO] Application Schema Integration Test ................ SKIPPED
[INFO] Sample DataAccess Integration Test ................. SUCCESS [ 13.218 s]
[INFO] ArcSDE DataStore Extension ......................... SUCCESS [ 22.611 s]
[INFO] H2 DataStore Extension ............................. SUCCESS [ 21.264 s]
[INFO] SQL Server DataStore Extension ..................... SUCCESS [  1.081 s]
[INFO] Oracle DataStore Extension ......................... SUCCESS [  0.564 s]
[INFO] MySQL DataStore Extension .......................... SUCCESS [  0.344 s]
[INFO] DB2 DataStore Extension ............................ SUCCESS [  0.352 s]
[INFO] ImageMap Output Format ............................. SKIPPED
[INFO] ImageI/O-Ext GDAL Coverage Extension ............... SUCCESS [  7.825 s]
[INFO] JP2K Coverage Extension ............................ SUCCESS [  0.368 s]
[INFO] OGR parent ......................................... SUCCESS [  0.077 s]
[INFO] OGR CORE ........................................... SUCCESS [  3.614 s]
[INFO] OGR WFS ............................................ SUCCESS [ 11.167 s]
[INFO] Web Processing Service parent ...................... SUCCESS [  0.073 s]
[INFO] Web Processing Service Module ...................... SUCCESS [02:00 min]
[INFO] OGR WPS ............................................ SUCCESS [ 16.400 s]
[INFO] Excel Output Format ................................ SUCCESS [ 18.120 s]
[INFO] Chart external graphics support .................... SUCCESS [  0.623 s]
[INFO] Feature Generalization Extension ................... SUCCESS [  3.579 s]
[INFO] Image Mosaic JDBC Extension ........................ SUCCESS [  0.701 s]
[INFO] OWS request flow controller ........................ SUCCESS [ 21.560 s]
[INFO] Web process status sharing with Hazelcast .......... SUCCESS [ 30.736 s]
[INFO] Web Processing Service GUI ......................... SKIPPED
[INFO] GeoServer Layer Querying filter functions .......... SUCCESS [ 19.700 s]
[INFO] Teradata DataStore Extension ....................... SUCCESS [  2.924 s]
[INFO] GeoServer Monitor Extensions ....................... SUCCESS [  0.175 s]
[INFO] Core Monitor Extension ............................. SKIPPED
[INFO] GeoServer Security Extension Modules ............... SUCCESS [  0.076 s]
[INFO] GeoServer CAS Security Module ...................... SUCCESS [ 12.337 s]
[INFO] GeoServer Security Extension Web Modules ........... SUCCESS [  0.078 s]
[INFO] GeoServer CAS Security Web Module .................. SUCCESS [  4.698 s]
[INFO] XLST based WFS output format ....................... SUCCESS [ 41.884 s]
[INFO] GeoServer INSPIRE Extensions ....................... SKIPPED
[INFO] GeoServer CSS Styling .............................. SKIPPED
[INFO] Catalog Services for the Web parent ................ SUCCESS [  0.106 s]
[INFO] Catalog Services for the Web interfaces ............ SUCCESS [ 12.352 s]
[INFO] Catalog Services for the Web - Simple CatalogStore implementation SUCCESS [ 22.906 s]
[INFO] Catalog Services for the Web core module ........... SUCCESS [01:01 min]
[INFO] CSW UI Module ...................................... SUCCESS [ 15.631 s]
[INFO] DXF WFS output format and WPS PPIO ................. SUCCESS [  0.088 s]
[INFO] DXF WFS output format .............................. SUCCESS [ 18.005 s]
[INFO] DXF WPS PPIO ....................................... SUCCESS [ 19.271 s]
[INFO] GeoServer WCS 2.0 Earth Observation Extensions ..... SUCCESS [  0.076 s]
[INFO] Web Coverage Service 2.0 Earth Observation extensions SUCCESS [ 28.248 s]
[INFO] Web Coverage Service 2.0 Earth Observation GUI extension SUCCESS [ 21.827 s]
[INFO] GeoServer libjpeg-turbo Module ..................... SKIPPED
[INFO] GeoServer Data Importer ............................ SKIPPED
[INFO] Importer Core Module ............................... SKIPPED
[INFO] Importer REST Api Module-ng ........................ SKIPPED
[INFO] Importer Berkley DB Persistence Module ............. SKIPPED
[INFO] Importer Web UI Module ............................. SKIPPED
[INFO] GRIB Coverage Format ............................... SUCCESS [ 28.051 s]
[INFO] NetCDF Coverage format ............................. SKIPPED
[INFO] WCS NetCDF output Module ........................... SKIPPED
[INFO] Vector Tiles ....................................... SKIPPED
[INFO] Ysld GeoServer Plugin .............................. SKIPPED
[INFO] MongoDB Data Store ................................. SUCCESS [  2.291 s]
[INFO] ------------------------------------------------------------------------
[INFO] BUILD FAILURE
[INFO] ------------------------------------------------------------------------
[INFO] Total time: 18:37 min (Wall Clock)
[INFO] Finished at: 2019-02-11T09:30:04+00:00
[INFO] Final Memory: 138M/1357M
[INFO] ------------------------------------------------------------------------
[ERROR] Failed to execute goal org.apache.maven.plugins:maven-compiler-plugin:2.3.2:compile (default-compile) on project gs-wms: Compilation failure
[ERROR] <https://build.geoserver.org/job/geoserver-2.14.x/ws/src/wms/src/main/java/org/geoserver/wms/capabilities/DimensionHelper.java>:[234,34] error: cannot find symbol
[ERROR] -> [Help 1]
[ERROR]
[ERROR] To see the full stack trace of the errors, re-run Maven with the -e switch.
[ERROR] Re-run Maven using the -X switch to enable full debug logging.
[ERROR]
[ERROR] For more information about the errors and possible solutions, please read the following articles:
[ERROR] [Help 1] http://cwiki.apache.org/confluence/display/MAVEN/MojoFailureException
[ERROR]
[ERROR] After correcting the problems, you can resume the build with the command
[ERROR]   mvn <goals> -rf :gs-wms
Build step 'Invoke top-level Maven targets' marked build as failure


_______________________________________________
Geoserver-devel mailing list
[hidden email]
https://lists.sourceforge.net/lists/listinfo/geoserver-devel


_______________________________________________
Geoserver-devel mailing list
[hidden email]
https://lists.sourceforge.net/lists/listinfo/geoserver-devel