Build failed in Jenkins: geoserver-2.14.x #185

classic Classic list List threaded Threaded
3 messages Options
Reply | Threaded
Open this post in threaded view
|

Build failed in Jenkins: geoserver-2.14.x #185

monitor
See <https://build.geoserver.org/job/geoserver-2.14.x/185/display/redirect>

------------------------------------------
[...truncated 635.45 KB...]
Tests run: 3, Failures: 0, Errors: 0, Skipped: 0, Time elapsed: 1.022 sec
Running org.geoserver.csw.store.internal.ResourceAccessManagerCSWTest
Tests run: 2, Failures: 0, Errors: 0, Skipped: 0, Time elapsed: 1.311 sec

Results :

Tests run: 108, Failures: 0, Errors: 0, Skipped: 0

[INFO]
[INFO] --- maven-jar-plugin:2.4:jar (default-jar) @ gs-csw-core ---
[INFO] Building jar: <https://build.geoserver.org/job/geoserver-2.14.x/ws/src/extension/csw/core/target/gs-csw-core-2.14-SNAPSHOT.jar>
[INFO]
[INFO] --- maven-jar-plugin:2.4:test-jar (default) @ gs-csw-core ---
[INFO] Building jar: <https://build.geoserver.org/job/geoserver-2.14.x/ws/src/extension/csw/core/target/gs-csw-core-2.14-SNAPSHOT-tests.jar>
[INFO]
[INFO] --- maven-source-plugin:2.2.1:jar-no-fork (attach-sources) @ gs-csw-core ---
[INFO] Building jar: <https://build.geoserver.org/job/geoserver-2.14.x/ws/src/extension/csw/core/target/gs-csw-core-2.14-SNAPSHOT-sources.jar>
[INFO]
[INFO] --- maven-source-plugin:2.2.1:test-jar-no-fork (attach-sources) @ gs-csw-core ---
[INFO] Building jar: <https://build.geoserver.org/job/geoserver-2.14.x/ws/src/extension/csw/core/target/gs-csw-core-2.14-SNAPSHOT-test-sources.jar>
[INFO]
[INFO] --- fmt-maven-plugin:2.4.0:check (default) @ gs-csw-core ---
[debug] Using AOSP style
[INFO] Processed 93 files (0 non-complying).
[INFO]
[INFO] --- maven-install-plugin:2.4:install (default-install) @ gs-csw-core ---
[INFO] Installing <https://build.geoserver.org/job/geoserver-2.14.x/ws/src/extension/csw/core/target/gs-csw-core-2.14-SNAPSHOT.jar> to /var/jenkins/.m2/repository/org/geoserver/csw/gs-csw-core/2.14-SNAPSHOT/gs-csw-core-2.14-SNAPSHOT.jar
[INFO] Installing <https://build.geoserver.org/job/geoserver-2.14.x/ws/src/extension/csw/core/pom.xml> to /var/jenkins/.m2/repository/org/geoserver/csw/gs-csw-core/2.14-SNAPSHOT/gs-csw-core-2.14-SNAPSHOT.pom
[INFO] Installing <https://build.geoserver.org/job/geoserver-2.14.x/ws/src/extension/csw/core/target/gs-csw-core-2.14-SNAPSHOT-tests.jar> to /var/jenkins/.m2/repository/org/geoserver/csw/gs-csw-core/2.14-SNAPSHOT/gs-csw-core-2.14-SNAPSHOT-tests.jar
[INFO] Installing <https://build.geoserver.org/job/geoserver-2.14.x/ws/src/extension/csw/core/target/gs-csw-core-2.14-SNAPSHOT-sources.jar> to /var/jenkins/.m2/repository/org/geoserver/csw/gs-csw-core/2.14-SNAPSHOT/gs-csw-core-2.14-SNAPSHOT-sources.jar
[INFO] Installing <https://build.geoserver.org/job/geoserver-2.14.x/ws/src/extension/csw/core/target/gs-csw-core-2.14-SNAPSHOT-test-sources.jar> to /var/jenkins/.m2/repository/org/geoserver/csw/gs-csw-core/2.14-SNAPSHOT/gs-csw-core-2.14-SNAPSHOT-test-sources.jar
[INFO]                                                                        
[INFO] ------------------------------------------------------------------------
[INFO] Skipping GeoServer CAS Security Web Module
[INFO] This project has been banned from the build due to previous failures.
[INFO] ------------------------------------------------------------------------
[INFO]                                                                        
[INFO] ------------------------------------------------------------------------
[INFO] Building CSW UI Module 2.14-SNAPSHOT
[INFO] ------------------------------------------------------------------------
[INFO]
[INFO] --- maven-clean-plugin:2.5:clean (default-clean) @ gs-web-csw ---
[INFO] Deleting <https://build.geoserver.org/job/geoserver-2.14.x/ws/src/extension/csw/web-csw/target>
[INFO]
[INFO] --- git-commit-id-plugin:2.1.15:revision (default) @ gs-web-csw ---
[INFO]
[INFO] --- maven-resources-plugin:2.6:resources (default-resources) @ gs-web-csw ---
[INFO] Using 'UTF-8' encoding to copy filtered resources.
[INFO] Copying 4 resources
[INFO] Copying 13 resources
[INFO]
[INFO] --- maven-compiler-plugin:2.3.2:compile (default-compile) @ gs-web-csw ---
[INFO] Compiling 2 source files to <https://build.geoserver.org/job/geoserver-2.14.x/ws/src/extension/csw/web-csw/target/classes>
Tests run: 1, Failures: 0, Errors: 0, Skipped: 0, Time elapsed: 8.203 sec
Running org.geoserver.wcs2_0.eo.web.WCSEOLayerConfigTest
[INFO]
[INFO] --- maven-resources-plugin:2.6:testResources (default-testResources) @ gs-web-csw ---
[INFO] Using 'UTF-8' encoding to copy filtered resources.
[INFO] Copying 0 resource
[INFO] skip non existing resourceDirectory <https://build.geoserver.org/job/geoserver-2.14.x/ws/src/extension/csw/web-csw/src/test/resources>
[INFO]
[INFO] --- maven-compiler-plugin:2.3.2:testCompile (default-testCompile) @ gs-web-csw ---
[INFO] Compiling 1 source file to <https://build.geoserver.org/job/geoserver-2.14.x/ws/src/extension/csw/web-csw/target/test-classes>
Tests run: 2, Failures: 0, Errors: 0, Skipped: 0, Time elapsed: 4.059 sec

Results :

Tests run: 3, Failures: 0, Errors: 0, Skipped: 0

[INFO]
[INFO] --- maven-jar-plugin:2.4:jar (default-jar) @ gs-web-wcs2_0-eo ---
[INFO] Building jar: <https://build.geoserver.org/job/geoserver-2.14.x/ws/src/extension/wcs2_0-eo/web/target/gs-web-wcs2_0-eo-2.14-SNAPSHOT.jar>
[INFO]
[INFO] --- maven-jar-plugin:2.4:test-jar (default) @ gs-web-wcs2_0-eo ---
[INFO] Building jar: <https://build.geoserver.org/job/geoserver-2.14.x/ws/src/extension/wcs2_0-eo/web/target/gs-web-wcs2_0-eo-2.14-SNAPSHOT-tests.jar>
[INFO]
[INFO] --- maven-source-plugin:2.2.1:jar-no-fork (attach-sources) @ gs-web-wcs2_0-eo ---
[INFO] Building jar: <https://build.geoserver.org/job/geoserver-2.14.x/ws/src/extension/wcs2_0-eo/web/target/gs-web-wcs2_0-eo-2.14-SNAPSHOT-sources.jar>
[INFO]
[INFO] --- maven-source-plugin:2.2.1:test-jar-no-fork (attach-sources) @ gs-web-wcs2_0-eo ---
[INFO] Building jar: <https://build.geoserver.org/job/geoserver-2.14.x/ws/src/extension/wcs2_0-eo/web/target/gs-web-wcs2_0-eo-2.14-SNAPSHOT-test-sources.jar>
[INFO]
[INFO] --- fmt-maven-plugin:2.4.0:check (default) @ gs-web-wcs2_0-eo ---
[debug] Using AOSP style
[INFO] Processed 4 files (0 non-complying).
[INFO]
[INFO] --- maven-install-plugin:2.4:install (default-install) @ gs-web-wcs2_0-eo ---
[INFO] Installing <https://build.geoserver.org/job/geoserver-2.14.x/ws/src/extension/wcs2_0-eo/web/target/gs-web-wcs2_0-eo-2.14-SNAPSHOT.jar> to /var/jenkins/.m2/repository/org/geoserver/extension/gs-web-wcs2_0-eo/2.14-SNAPSHOT/gs-web-wcs2_0-eo-2.14-SNAPSHOT.jar
[INFO] Installing <https://build.geoserver.org/job/geoserver-2.14.x/ws/src/extension/wcs2_0-eo/web/pom.xml> to /var/jenkins/.m2/repository/org/geoserver/extension/gs-web-wcs2_0-eo/2.14-SNAPSHOT/gs-web-wcs2_0-eo-2.14-SNAPSHOT.pom
[INFO] Installing <https://build.geoserver.org/job/geoserver-2.14.x/ws/src/extension/wcs2_0-eo/web/target/gs-web-wcs2_0-eo-2.14-SNAPSHOT-tests.jar> to /var/jenkins/.m2/repository/org/geoserver/extension/gs-web-wcs2_0-eo/2.14-SNAPSHOT/gs-web-wcs2_0-eo-2.14-SNAPSHOT-tests.jar
[INFO] Installing <https://build.geoserver.org/job/geoserver-2.14.x/ws/src/extension/wcs2_0-eo/web/target/gs-web-wcs2_0-eo-2.14-SNAPSHOT-sources.jar> to /var/jenkins/.m2/repository/org/geoserver/extension/gs-web-wcs2_0-eo/2.14-SNAPSHOT/gs-web-wcs2_0-eo-2.14-SNAPSHOT-sources.jar
[INFO] Installing <https://build.geoserver.org/job/geoserver-2.14.x/ws/src/extension/wcs2_0-eo/web/target/gs-web-wcs2_0-eo-2.14-SNAPSHOT-test-sources.jar> to /var/jenkins/.m2/repository/org/geoserver/extension/gs-web-wcs2_0-eo/2.14-SNAPSHOT/gs-web-wcs2_0-eo-2.14-SNAPSHOT-test-sources.jar
[INFO]
[INFO] --- maven-surefire-plugin:2.12.3:test (default-test) @ gs-web-csw ---
[INFO] Surefire report directory: <https://build.geoserver.org/job/geoserver-2.14.x/ws/src/extension/csw/web-csw/target/surefire-reports>

-------------------------------------------------------
 T E S T S
-------------------------------------------------------
Running org.geoserver.wfs.web.CSWAdminPageTest
Tests run: 1, Failures: 0, Errors: 0, Skipped: 0, Time elapsed: 5.472 sec

Results :

Tests run: 1, Failures: 0, Errors: 0, Skipped: 0

[INFO]
[INFO] --- maven-jar-plugin:2.4:jar (default-jar) @ gs-web-csw ---
[INFO] Building jar: <https://build.geoserver.org/job/geoserver-2.14.x/ws/src/extension/csw/web-csw/target/gs-web-csw-2.14-SNAPSHOT.jar>
[INFO]
[INFO] --- maven-jar-plugin:2.4:test-jar (default) @ gs-web-csw ---
[INFO] Building jar: <https://build.geoserver.org/job/geoserver-2.14.x/ws/src/extension/csw/web-csw/target/gs-web-csw-2.14-SNAPSHOT-tests.jar>
[INFO]
[INFO] --- maven-source-plugin:2.2.1:jar-no-fork (attach-sources) @ gs-web-csw ---
[INFO] Building jar: <https://build.geoserver.org/job/geoserver-2.14.x/ws/src/extension/csw/web-csw/target/gs-web-csw-2.14-SNAPSHOT-sources.jar>
[INFO]
[INFO] --- maven-source-plugin:2.2.1:test-jar-no-fork (attach-sources) @ gs-web-csw ---
[INFO] Building jar: <https://build.geoserver.org/job/geoserver-2.14.x/ws/src/extension/csw/web-csw/target/gs-web-csw-2.14-SNAPSHOT-test-sources.jar>
[INFO]
[INFO] --- fmt-maven-plugin:2.4.0:check (default) @ gs-web-csw ---
[debug] Using AOSP style
[INFO] Processed 3 files (0 non-complying).
[INFO]
[INFO] --- maven-install-plugin:2.4:install (default-install) @ gs-web-csw ---
[INFO] Installing <https://build.geoserver.org/job/geoserver-2.14.x/ws/src/extension/csw/web-csw/target/gs-web-csw-2.14-SNAPSHOT.jar> to /var/jenkins/.m2/repository/org/geoserver/csw/gs-web-csw/2.14-SNAPSHOT/gs-web-csw-2.14-SNAPSHOT.jar
[INFO] Installing <https://build.geoserver.org/job/geoserver-2.14.x/ws/src/extension/csw/web-csw/pom.xml> to /var/jenkins/.m2/repository/org/geoserver/csw/gs-web-csw/2.14-SNAPSHOT/gs-web-csw-2.14-SNAPSHOT.pom
[INFO] Installing <https://build.geoserver.org/job/geoserver-2.14.x/ws/src/extension/csw/web-csw/target/gs-web-csw-2.14-SNAPSHOT-tests.jar> to /var/jenkins/.m2/repository/org/geoserver/csw/gs-web-csw/2.14-SNAPSHOT/gs-web-csw-2.14-SNAPSHOT-tests.jar
[INFO] Installing <https://build.geoserver.org/job/geoserver-2.14.x/ws/src/extension/csw/web-csw/target/gs-web-csw-2.14-SNAPSHOT-sources.jar> to /var/jenkins/.m2/repository/org/geoserver/csw/gs-web-csw/2.14-SNAPSHOT/gs-web-csw-2.14-SNAPSHOT-sources.jar
[INFO] Installing <https://build.geoserver.org/job/geoserver-2.14.x/ws/src/extension/csw/web-csw/target/gs-web-csw-2.14-SNAPSHOT-test-sources.jar> to /var/jenkins/.m2/repository/org/geoserver/csw/gs-web-csw/2.14-SNAPSHOT/gs-web-csw-2.14-SNAPSHOT-test-sources.jar
[INFO] ------------------------------------------------------------------------
[INFO] Reactor Summary:
[INFO]
[INFO] GeoServer .......................................... SUCCESS [  8.947 s]
[INFO] Core Platform Module ............................... SUCCESS [ 21.483 s]
[INFO] Open Web Service Module ............................ SUCCESS [ 15.384 s]
[INFO] Main Module ........................................ SUCCESS [01:41 min]
[INFO] GeoServer Security Modules ......................... SUCCESS [  0.145 s]
[INFO] GeoServer Security Tests Module .................... SUCCESS [01:39 min]
[INFO] GeoServer JDBC Security Module ..................... SUCCESS [ 45.769 s]
[INFO] GeoServer LDAP Security Module ..................... SUCCESS [ 31.845 s]
[INFO] Web Coverage Service Module ........................ SUCCESS [  5.498 s]
[INFO] Web Coverage Service 1.0 Module .................... SUCCESS [ 26.795 s]
[INFO] Web Coverage Service 1.1 Module .................... SUCCESS [ 25.774 s]
[INFO] Web Coverage Service 2.0 Module .................... SUCCESS [01:23 min]
[INFO] Web Feature Service Module ......................... FAILURE [02:13 min]
[INFO] Web Map Service Module ............................. SKIPPED
[INFO] KML support for GeoServer .......................... SKIPPED
[INFO] gs-rest ............................................ SUCCESS [ 24.560 s]
[INFO] GeoWebCache (GWC) Module ........................... SKIPPED
[INFO] gs-restconfig ...................................... SUCCESS [02:03 min]
[INFO] gs-restconfig-wcs .................................. SUCCESS [ 34.337 s]
[INFO] gs-restconfig-wfs .................................. SKIPPED
[INFO] gs-restconfig-wms .................................. SKIPPED
[INFO] GeoServer Web Modules .............................. SUCCESS [  0.101 s]
[INFO] Core UI Module ..................................... SUCCESS [01:40 min]
[INFO] WMS UI Module ...................................... SKIPPED
[INFO] GWC UI Module ...................................... SKIPPED
[INFO] WFS UI Module ...................................... SKIPPED
[INFO] Demos Module ....................................... SKIPPED
[INFO] WCS UI Module ...................................... SKIPPED
[INFO] Security UI Modules ................................ SUCCESS [  0.076 s]
[INFO] Security UI Core Module ............................ SKIPPED
[INFO] Security UI JDBC Module ............................ SKIPPED
[INFO] Security UI LDAP Module ............................ SKIPPED
[INFO] REST UI Module ..................................... SUCCESS [ 18.865 s]
[INFO] GeoServer Extensions ............................... SUCCESS [  0.064 s]
[INFO] Printing Module .................................... SUCCESS [ 20.110 s]
[INFO] GeoServer Web Application .......................... SKIPPED
[INFO] Community Space .................................... SUCCESS [  0.057 s]
[INFO] Application Schema Support ......................... SUCCESS [  0.091 s]
[INFO] Application Schema Integration Test ................ SKIPPED
[INFO] Sample DataAccess Integration Test ................. SKIPPED
[INFO] ArcSDE DataStore Extension ......................... SUCCESS [ 15.360 s]
[INFO] H2 DataStore Extension ............................. SUCCESS [ 28.095 s]
[INFO] SQL Server DataStore Extension ..................... SUCCESS [  1.163 s]
[INFO] Oracle DataStore Extension ......................... SUCCESS [  0.479 s]
[INFO] MySQL DataStore Extension .......................... SUCCESS [  0.262 s]
[INFO] DB2 DataStore Extension ............................ SUCCESS [  0.280 s]
[INFO] ImageMap Output Format ............................. SKIPPED
[INFO] ImageI/O-Ext GDAL Coverage Extension ............... SUCCESS [  5.434 s]
[INFO] JP2K Coverage Extension ............................ SUCCESS [  0.356 s]
[INFO] OGR parent ......................................... SUCCESS [  0.043 s]
[INFO] OGR CORE ........................................... SUCCESS [  4.371 s]
[INFO] OGR WFS ............................................ SKIPPED
[INFO] Web Processing Service parent ...................... SUCCESS [  0.033 s]
[INFO] Web Processing Service Module ...................... SKIPPED
[INFO] OGR WPS ............................................ SKIPPED
[INFO] Excel Output Format ................................ SKIPPED
[INFO] Chart external graphics support .................... SUCCESS [  0.431 s]
[INFO] Feature Generalization Extension ................... SUCCESS [  4.319 s]
[INFO] Image Mosaic JDBC Extension ........................ SUCCESS [  0.594 s]
[INFO] OWS request flow controller ........................ SUCCESS [ 19.967 s]
[INFO] Web process status sharing with Hazelcast .......... SKIPPED
[INFO] Web Processing Service GUI ......................... SKIPPED
[INFO] GeoServer Layer Querying filter functions .......... SKIPPED
[INFO] Teradata DataStore Extension ....................... SUCCESS [  2.218 s]
[INFO] GeoServer Monitor Extensions ....................... SKIPPED
[INFO] Core Monitor Extension ............................. SKIPPED
[INFO] GeoServer Security Extension Modules ............... SKIPPED
[INFO] GeoServer CAS Security Module ...................... SKIPPED
[INFO] GeoServer Security Extension Web Modules ........... SKIPPED
[INFO] GeoServer CAS Security Web Module .................. SKIPPED
[INFO] XLST based WFS output format ....................... SKIPPED
[INFO] GeoServer INSPIRE Extensions ....................... SKIPPED
[INFO] GeoServer CSS Styling .............................. SKIPPED
[INFO] Catalog Services for the Web parent ................ SUCCESS [  0.128 s]
[INFO] Catalog Services for the Web interfaces ............ SUCCESS [ 14.040 s]
[INFO] Catalog Services for the Web - Simple CatalogStore implementation SUCCESS [ 15.678 s]
[INFO] Catalog Services for the Web core module ........... SUCCESS [01:05 min]
[INFO] CSW UI Module ...................................... SUCCESS [ 11.451 s]
[INFO] DXF WFS output format and WPS PPIO ................. SUCCESS [  0.097 s]
[INFO] DXF WFS output format .............................. SKIPPED
[INFO] DXF WPS PPIO ....................................... SKIPPED
[INFO] GeoServer WCS 2.0 Earth Observation Extensions ..... SUCCESS [  0.059 s]
[INFO] Web Coverage Service 2.0 Earth Observation extensions SUCCESS [ 31.858 s]
[INFO] Web Coverage Service 2.0 Earth Observation GUI extension SUCCESS [ 20.324 s]
[INFO] GeoServer libjpeg-turbo Module ..................... SKIPPED
[INFO] GeoServer Data Importer ............................ SKIPPED
[INFO] Importer Core Module ............................... SKIPPED
[INFO] Importer REST Api Module-ng ........................ SKIPPED
[INFO] Importer Berkley DB Persistence Module ............. SKIPPED
[INFO] Importer Web UI Module ............................. SKIPPED
[INFO] GRIB Coverage Format ............................... SUCCESS [ 20.027 s]
[INFO] NetCDF Coverage format ............................. SKIPPED
[INFO] WCS NetCDF output Module ........................... SKIPPED
[INFO] Vector Tiles ....................................... SKIPPED
[INFO] Ysld GeoServer Plugin .............................. SKIPPED
[INFO] MongoDB Data Store ................................. SUCCESS [  2.160 s]
[INFO] ------------------------------------------------------------------------
[INFO] BUILD FAILURE
[INFO] ------------------------------------------------------------------------
[INFO] Total time: 11:10 min (Wall Clock)
[INFO] Finished at: 2019-02-09T12:16:04+00:00
[INFO] Final Memory: 130M/1591M
[INFO] ------------------------------------------------------------------------
[ERROR] Failed to execute goal org.apache.maven.plugins:maven-surefire-plugin:2.12.3:test (default-test) on project gs-wfs: There are test failures.
[ERROR]
[ERROR] Please refer to <https://build.geoserver.org/job/geoserver-2.14.x/ws/src/wfs/target/surefire-reports> for the individual test results.
[ERROR] -> [Help 1]
[ERROR]
[ERROR] To see the full stack trace of the errors, re-run Maven with the -e switch.
[ERROR] Re-run Maven using the -X switch to enable full debug logging.
[ERROR]
[ERROR] For more information about the errors and possible solutions, please read the following articles:
[ERROR] [Help 1] http://cwiki.apache.org/confluence/display/MAVEN/MojoFailureException
[ERROR]
[ERROR] After correcting the problems, you can resume the build with the command
[ERROR]   mvn <goals> -rf :gs-wfs
Build step 'Invoke top-level Maven targets' marked build as failure


_______________________________________________
Geoserver-devel mailing list
[hidden email]
https://lists.sourceforge.net/lists/listinfo/geoserver-devel
Reply | Threaded
Open this post in threaded view
|

Build failed in Jenkins: geoserver-2.14.x #186

monitor
See <https://build.geoserver.org/job/geoserver-2.14.x/186/display/redirect>

------------------------------------------
[...truncated 637.15 KB...]
Tests run: 3, Failures: 0, Errors: 0, Skipped: 0, Time elapsed: 0.763 sec
Running org.geoserver.csw.store.internal.ResourceAccessManagerCSWTest
Tests run: 2, Failures: 0, Errors: 0, Skipped: 0, Time elapsed: 1.182 sec

Results :

Tests run: 108, Failures: 0, Errors: 0, Skipped: 0

[INFO]
[INFO] --- maven-jar-plugin:2.4:jar (default-jar) @ gs-csw-core ---
[INFO] Building jar: <https://build.geoserver.org/job/geoserver-2.14.x/ws/src/extension/csw/core/target/gs-csw-core-2.14-SNAPSHOT.jar>
[INFO]
[INFO] --- maven-jar-plugin:2.4:test-jar (default) @ gs-csw-core ---
[INFO] Building jar: <https://build.geoserver.org/job/geoserver-2.14.x/ws/src/extension/csw/core/target/gs-csw-core-2.14-SNAPSHOT-tests.jar>
[INFO]
[INFO] --- maven-source-plugin:2.2.1:jar-no-fork (attach-sources) @ gs-csw-core ---
[INFO] Building jar: <https://build.geoserver.org/job/geoserver-2.14.x/ws/src/extension/csw/core/target/gs-csw-core-2.14-SNAPSHOT-sources.jar>
[INFO]
[INFO] --- maven-source-plugin:2.2.1:test-jar-no-fork (attach-sources) @ gs-csw-core ---
[INFO] Building jar: <https://build.geoserver.org/job/geoserver-2.14.x/ws/src/extension/csw/core/target/gs-csw-core-2.14-SNAPSHOT-test-sources.jar>
[INFO]
[INFO] --- fmt-maven-plugin:2.4.0:check (default) @ gs-csw-core ---
[debug] Using AOSP style
[INFO] Processed 93 files (0 non-complying).
[INFO]
[INFO] --- maven-install-plugin:2.4:install (default-install) @ gs-csw-core ---
[INFO] Installing <https://build.geoserver.org/job/geoserver-2.14.x/ws/src/extension/csw/core/target/gs-csw-core-2.14-SNAPSHOT.jar> to /var/jenkins/.m2/repository/org/geoserver/csw/gs-csw-core/2.14-SNAPSHOT/gs-csw-core-2.14-SNAPSHOT.jar
[INFO] Installing <https://build.geoserver.org/job/geoserver-2.14.x/ws/src/extension/csw/core/pom.xml> to /var/jenkins/.m2/repository/org/geoserver/csw/gs-csw-core/2.14-SNAPSHOT/gs-csw-core-2.14-SNAPSHOT.pom
[INFO] Installing <https://build.geoserver.org/job/geoserver-2.14.x/ws/src/extension/csw/core/target/gs-csw-core-2.14-SNAPSHOT-tests.jar> to /var/jenkins/.m2/repository/org/geoserver/csw/gs-csw-core/2.14-SNAPSHOT/gs-csw-core-2.14-SNAPSHOT-tests.jar
[INFO] Installing <https://build.geoserver.org/job/geoserver-2.14.x/ws/src/extension/csw/core/target/gs-csw-core-2.14-SNAPSHOT-sources.jar> to /var/jenkins/.m2/repository/org/geoserver/csw/gs-csw-core/2.14-SNAPSHOT/gs-csw-core-2.14-SNAPSHOT-sources.jar
[INFO] Installing <https://build.geoserver.org/job/geoserver-2.14.x/ws/src/extension/csw/core/target/gs-csw-core-2.14-SNAPSHOT-test-sources.jar> to /var/jenkins/.m2/repository/org/geoserver/csw/gs-csw-core/2.14-SNAPSHOT/gs-csw-core-2.14-SNAPSHOT-test-sources.jar
[INFO]                                                                        
[INFO] ------------------------------------------------------------------------
[INFO] Skipping GeoServer CAS Security Web Module
[INFO] This project has been banned from the build due to previous failures.
[INFO] ------------------------------------------------------------------------
[INFO]                                                                        
[INFO] ------------------------------------------------------------------------
[INFO] Building CSW UI Module 2.14-SNAPSHOT
[INFO] ------------------------------------------------------------------------
Tests run: 1, Failures: 0, Errors: 0, Skipped: 0, Time elapsed: 8.556 sec
Running org.geoserver.wcs2_0.eo.web.WCSEOLayerConfigTest
[INFO]
[INFO] --- maven-clean-plugin:2.5:clean (default-clean) @ gs-web-csw ---
[INFO] Deleting <https://build.geoserver.org/job/geoserver-2.14.x/ws/src/extension/csw/web-csw/target>
[INFO]
[INFO] --- git-commit-id-plugin:2.1.15:revision (default) @ gs-web-csw ---
[INFO]
[INFO] --- maven-resources-plugin:2.6:resources (default-resources) @ gs-web-csw ---
[INFO] Using 'UTF-8' encoding to copy filtered resources.
[INFO] Copying 4 resources
[INFO] Copying 13 resources
[INFO]
[INFO] --- maven-compiler-plugin:2.3.2:compile (default-compile) @ gs-web-csw ---
[INFO] Compiling 2 source files to <https://build.geoserver.org/job/geoserver-2.14.x/ws/src/extension/csw/web-csw/target/classes>
[INFO]
[INFO] --- maven-resources-plugin:2.6:testResources (default-testResources) @ gs-web-csw ---
[INFO] Using 'UTF-8' encoding to copy filtered resources.
[INFO] Copying 0 resource
[INFO] skip non existing resourceDirectory <https://build.geoserver.org/job/geoserver-2.14.x/ws/src/extension/csw/web-csw/src/test/resources>
[INFO]
[INFO] --- maven-compiler-plugin:2.3.2:testCompile (default-testCompile) @ gs-web-csw ---
[INFO] Compiling 1 source file to <https://build.geoserver.org/job/geoserver-2.14.x/ws/src/extension/csw/web-csw/target/test-classes>
Tests run: 2, Failures: 0, Errors: 0, Skipped: 0, Time elapsed: 4.359 sec

Results :

Tests run: 3, Failures: 0, Errors: 0, Skipped: 0

[INFO]
[INFO] --- maven-jar-plugin:2.4:jar (default-jar) @ gs-web-wcs2_0-eo ---
[INFO] Building jar: <https://build.geoserver.org/job/geoserver-2.14.x/ws/src/extension/wcs2_0-eo/web/target/gs-web-wcs2_0-eo-2.14-SNAPSHOT.jar>
[INFO]
[INFO] --- maven-jar-plugin:2.4:test-jar (default) @ gs-web-wcs2_0-eo ---
[INFO] Building jar: <https://build.geoserver.org/job/geoserver-2.14.x/ws/src/extension/wcs2_0-eo/web/target/gs-web-wcs2_0-eo-2.14-SNAPSHOT-tests.jar>
[INFO]
[INFO] --- maven-source-plugin:2.2.1:jar-no-fork (attach-sources) @ gs-web-wcs2_0-eo ---
[INFO] Building jar: <https://build.geoserver.org/job/geoserver-2.14.x/ws/src/extension/wcs2_0-eo/web/target/gs-web-wcs2_0-eo-2.14-SNAPSHOT-sources.jar>
[INFO]
[INFO] --- maven-source-plugin:2.2.1:test-jar-no-fork (attach-sources) @ gs-web-wcs2_0-eo ---
[INFO] Building jar: <https://build.geoserver.org/job/geoserver-2.14.x/ws/src/extension/wcs2_0-eo/web/target/gs-web-wcs2_0-eo-2.14-SNAPSHOT-test-sources.jar>
[INFO]
[INFO] --- fmt-maven-plugin:2.4.0:check (default) @ gs-web-wcs2_0-eo ---
[debug] Using AOSP style
[INFO] Processed 4 files (0 non-complying).
[INFO]
[INFO] --- maven-install-plugin:2.4:install (default-install) @ gs-web-wcs2_0-eo ---
[INFO] Installing <https://build.geoserver.org/job/geoserver-2.14.x/ws/src/extension/wcs2_0-eo/web/target/gs-web-wcs2_0-eo-2.14-SNAPSHOT.jar> to /var/jenkins/.m2/repository/org/geoserver/extension/gs-web-wcs2_0-eo/2.14-SNAPSHOT/gs-web-wcs2_0-eo-2.14-SNAPSHOT.jar
[INFO] Installing <https://build.geoserver.org/job/geoserver-2.14.x/ws/src/extension/wcs2_0-eo/web/pom.xml> to /var/jenkins/.m2/repository/org/geoserver/extension/gs-web-wcs2_0-eo/2.14-SNAPSHOT/gs-web-wcs2_0-eo-2.14-SNAPSHOT.pom
[INFO] Installing <https://build.geoserver.org/job/geoserver-2.14.x/ws/src/extension/wcs2_0-eo/web/target/gs-web-wcs2_0-eo-2.14-SNAPSHOT-tests.jar> to /var/jenkins/.m2/repository/org/geoserver/extension/gs-web-wcs2_0-eo/2.14-SNAPSHOT/gs-web-wcs2_0-eo-2.14-SNAPSHOT-tests.jar
[INFO] Installing <https://build.geoserver.org/job/geoserver-2.14.x/ws/src/extension/wcs2_0-eo/web/target/gs-web-wcs2_0-eo-2.14-SNAPSHOT-sources.jar> to /var/jenkins/.m2/repository/org/geoserver/extension/gs-web-wcs2_0-eo/2.14-SNAPSHOT/gs-web-wcs2_0-eo-2.14-SNAPSHOT-sources.jar
[INFO] Installing <https://build.geoserver.org/job/geoserver-2.14.x/ws/src/extension/wcs2_0-eo/web/target/gs-web-wcs2_0-eo-2.14-SNAPSHOT-test-sources.jar> to /var/jenkins/.m2/repository/org/geoserver/extension/gs-web-wcs2_0-eo/2.14-SNAPSHOT/gs-web-wcs2_0-eo-2.14-SNAPSHOT-test-sources.jar
[INFO]
[INFO] --- maven-surefire-plugin:2.12.3:test (default-test) @ gs-web-csw ---
[INFO] Surefire report directory: <https://build.geoserver.org/job/geoserver-2.14.x/ws/src/extension/csw/web-csw/target/surefire-reports>

-------------------------------------------------------
 T E S T S
-------------------------------------------------------
Running org.geoserver.wfs.web.CSWAdminPageTest
Tests run: 1, Failures: 0, Errors: 0, Skipped: 0, Time elapsed: 7.285 sec

Results :

Tests run: 1, Failures: 0, Errors: 0, Skipped: 0

[INFO]
[INFO] --- maven-jar-plugin:2.4:jar (default-jar) @ gs-web-csw ---
[INFO] Building jar: <https://build.geoserver.org/job/geoserver-2.14.x/ws/src/extension/csw/web-csw/target/gs-web-csw-2.14-SNAPSHOT.jar>
[INFO]
[INFO] --- maven-jar-plugin:2.4:test-jar (default) @ gs-web-csw ---
[INFO] Building jar: <https://build.geoserver.org/job/geoserver-2.14.x/ws/src/extension/csw/web-csw/target/gs-web-csw-2.14-SNAPSHOT-tests.jar>
[INFO]
[INFO] --- maven-source-plugin:2.2.1:jar-no-fork (attach-sources) @ gs-web-csw ---
[INFO] Building jar: <https://build.geoserver.org/job/geoserver-2.14.x/ws/src/extension/csw/web-csw/target/gs-web-csw-2.14-SNAPSHOT-sources.jar>
[INFO]
[INFO] --- maven-source-plugin:2.2.1:test-jar-no-fork (attach-sources) @ gs-web-csw ---
[INFO] Building jar: <https://build.geoserver.org/job/geoserver-2.14.x/ws/src/extension/csw/web-csw/target/gs-web-csw-2.14-SNAPSHOT-test-sources.jar>
[INFO]
[INFO] --- fmt-maven-plugin:2.4.0:check (default) @ gs-web-csw ---
[debug] Using AOSP style
[INFO] Processed 3 files (0 non-complying).
[INFO]
[INFO] --- maven-install-plugin:2.4:install (default-install) @ gs-web-csw ---
[INFO] Installing <https://build.geoserver.org/job/geoserver-2.14.x/ws/src/extension/csw/web-csw/target/gs-web-csw-2.14-SNAPSHOT.jar> to /var/jenkins/.m2/repository/org/geoserver/csw/gs-web-csw/2.14-SNAPSHOT/gs-web-csw-2.14-SNAPSHOT.jar
[INFO] Installing <https://build.geoserver.org/job/geoserver-2.14.x/ws/src/extension/csw/web-csw/pom.xml> to /var/jenkins/.m2/repository/org/geoserver/csw/gs-web-csw/2.14-SNAPSHOT/gs-web-csw-2.14-SNAPSHOT.pom
[INFO] Installing <https://build.geoserver.org/job/geoserver-2.14.x/ws/src/extension/csw/web-csw/target/gs-web-csw-2.14-SNAPSHOT-tests.jar> to /var/jenkins/.m2/repository/org/geoserver/csw/gs-web-csw/2.14-SNAPSHOT/gs-web-csw-2.14-SNAPSHOT-tests.jar
[INFO] Installing <https://build.geoserver.org/job/geoserver-2.14.x/ws/src/extension/csw/web-csw/target/gs-web-csw-2.14-SNAPSHOT-sources.jar> to /var/jenkins/.m2/repository/org/geoserver/csw/gs-web-csw/2.14-SNAPSHOT/gs-web-csw-2.14-SNAPSHOT-sources.jar
[INFO] Installing <https://build.geoserver.org/job/geoserver-2.14.x/ws/src/extension/csw/web-csw/target/gs-web-csw-2.14-SNAPSHOT-test-sources.jar> to /var/jenkins/.m2/repository/org/geoserver/csw/gs-web-csw/2.14-SNAPSHOT/gs-web-csw-2.14-SNAPSHOT-test-sources.jar
[INFO] ------------------------------------------------------------------------
[INFO] Reactor Summary:
[INFO]
[INFO] GeoServer .......................................... SUCCESS [  8.058 s]
[INFO] Core Platform Module ............................... SUCCESS [ 17.424 s]
[INFO] Open Web Service Module ............................ SUCCESS [ 17.154 s]
[INFO] Main Module ........................................ SUCCESS [01:51 min]
[INFO] GeoServer Security Modules ......................... SUCCESS [  0.091 s]
[INFO] GeoServer Security Tests Module .................... SUCCESS [01:44 min]
[INFO] GeoServer JDBC Security Module ..................... SUCCESS [ 50.373 s]
[INFO] GeoServer LDAP Security Module ..................... SUCCESS [ 31.533 s]
[INFO] Web Coverage Service Module ........................ SUCCESS [  6.387 s]
[INFO] Web Coverage Service 1.0 Module .................... SUCCESS [ 31.519 s]
[INFO] Web Coverage Service 1.1 Module .................... SUCCESS [ 34.001 s]
[INFO] Web Coverage Service 2.0 Module .................... SUCCESS [01:20 min]
[INFO] Web Feature Service Module ......................... FAILURE [02:21 min]
[INFO] Web Map Service Module ............................. SKIPPED
[INFO] KML support for GeoServer .......................... SKIPPED
[INFO] gs-rest ............................................ SUCCESS [ 27.213 s]
[INFO] GeoWebCache (GWC) Module ........................... SKIPPED
[INFO] gs-restconfig ...................................... SUCCESS [02:09 min]
[INFO] gs-restconfig-wcs .................................. SUCCESS [ 25.683 s]
[INFO] gs-restconfig-wfs .................................. SKIPPED
[INFO] gs-restconfig-wms .................................. SKIPPED
[INFO] GeoServer Web Modules .............................. SUCCESS [  0.093 s]
[INFO] Core UI Module ..................................... SUCCESS [01:41 min]
[INFO] WMS UI Module ...................................... SKIPPED
[INFO] GWC UI Module ...................................... SKIPPED
[INFO] WFS UI Module ...................................... SKIPPED
[INFO] Demos Module ....................................... SKIPPED
[INFO] WCS UI Module ...................................... SKIPPED
[INFO] Security UI Modules ................................ SUCCESS [  0.113 s]
[INFO] Security UI Core Module ............................ SKIPPED
[INFO] Security UI JDBC Module ............................ SKIPPED
[INFO] Security UI LDAP Module ............................ SKIPPED
[INFO] REST UI Module ..................................... SUCCESS [ 26.353 s]
[INFO] GeoServer Extensions ............................... SUCCESS [  0.067 s]
[INFO] Printing Module .................................... SUCCESS [ 18.342 s]
[INFO] GeoServer Web Application .......................... SKIPPED
[INFO] Community Space .................................... SUCCESS [  0.062 s]
[INFO] Application Schema Support ......................... SUCCESS [  0.083 s]
[INFO] Application Schema Integration Test ................ SKIPPED
[INFO] Sample DataAccess Integration Test ................. SKIPPED
[INFO] ArcSDE DataStore Extension ......................... SUCCESS [ 17.676 s]
[INFO] H2 DataStore Extension ............................. SUCCESS [ 22.622 s]
[INFO] SQL Server DataStore Extension ..................... SUCCESS [  1.048 s]
[INFO] Oracle DataStore Extension ......................... SUCCESS [  0.448 s]
[INFO] MySQL DataStore Extension .......................... SUCCESS [  0.292 s]
[INFO] DB2 DataStore Extension ............................ SUCCESS [  0.267 s]
[INFO] ImageMap Output Format ............................. SKIPPED
[INFO] ImageI/O-Ext GDAL Coverage Extension ............... SUCCESS [  7.539 s]
[INFO] JP2K Coverage Extension ............................ SUCCESS [  0.314 s]
[INFO] OGR parent ......................................... SUCCESS [  0.068 s]
[INFO] OGR CORE ........................................... SUCCESS [  3.013 s]
[INFO] OGR WFS ............................................ SKIPPED
[INFO] Web Processing Service parent ...................... SUCCESS [  0.069 s]
[INFO] Web Processing Service Module ...................... SKIPPED
[INFO] OGR WPS ............................................ SKIPPED
[INFO] Excel Output Format ................................ SKIPPED
[INFO] Chart external graphics support .................... SUCCESS [  0.568 s]
[INFO] Feature Generalization Extension ................... SUCCESS [  3.513 s]
[INFO] Image Mosaic JDBC Extension ........................ SUCCESS [  0.507 s]
[INFO] OWS request flow controller ........................ SUCCESS [ 20.175 s]
[INFO] Web process status sharing with Hazelcast .......... SKIPPED
[INFO] Web Processing Service GUI ......................... SKIPPED
[INFO] GeoServer Layer Querying filter functions .......... SKIPPED
[INFO] Teradata DataStore Extension ....................... SUCCESS [  3.053 s]
[INFO] GeoServer Monitor Extensions ....................... SKIPPED
[INFO] Core Monitor Extension ............................. SKIPPED
[INFO] GeoServer Security Extension Modules ............... SKIPPED
[INFO] GeoServer CAS Security Module ...................... SKIPPED
[INFO] GeoServer Security Extension Web Modules ........... SKIPPED
[INFO] GeoServer CAS Security Web Module .................. SKIPPED
[INFO] XLST based WFS output format ....................... SKIPPED
[INFO] GeoServer INSPIRE Extensions ....................... SKIPPED
[INFO] GeoServer CSS Styling .............................. SKIPPED
[INFO] Catalog Services for the Web parent ................ SUCCESS [  0.100 s]
[INFO] Catalog Services for the Web interfaces ............ SUCCESS [ 12.173 s]
[INFO] Catalog Services for the Web - Simple CatalogStore implementation SUCCESS [ 17.107 s]
[INFO] Catalog Services for the Web core module ........... SUCCESS [ 56.573 s]
[INFO] CSW UI Module ...................................... SUCCESS [ 14.226 s]
[INFO] DXF WFS output format and WPS PPIO ................. SUCCESS [  0.056 s]
[INFO] DXF WFS output format .............................. SKIPPED
[INFO] DXF WPS PPIO ....................................... SKIPPED
[INFO] GeoServer WCS 2.0 Earth Observation Extensions ..... SUCCESS [  0.040 s]
[INFO] Web Coverage Service 2.0 Earth Observation extensions SUCCESS [ 26.487 s]
[INFO] Web Coverage Service 2.0 Earth Observation GUI extension SUCCESS [ 19.159 s]
[INFO] GeoServer libjpeg-turbo Module ..................... SKIPPED
[INFO] GeoServer Data Importer ............................ SKIPPED
[INFO] Importer Core Module ............................... SKIPPED
[INFO] Importer REST Api Module-ng ........................ SKIPPED
[INFO] Importer Berkley DB Persistence Module ............. SKIPPED
[INFO] Importer Web UI Module ............................. SKIPPED
[INFO] GRIB Coverage Format ............................... SUCCESS [ 19.673 s]
[INFO] NetCDF Coverage format ............................. SKIPPED
[INFO] WCS NetCDF output Module ........................... SKIPPED
[INFO] Vector Tiles ....................................... SKIPPED
[INFO] Ysld GeoServer Plugin .............................. SKIPPED
[INFO] MongoDB Data Store ................................. SUCCESS [  2.235 s]
[INFO] ------------------------------------------------------------------------
[INFO] BUILD FAILURE
[INFO] ------------------------------------------------------------------------
[INFO] Total time: 11:26 min (Wall Clock)
[INFO] Finished at: 2019-02-09T12:34:34+00:00
[INFO] Final Memory: 135M/1526M
[INFO] ------------------------------------------------------------------------
[ERROR] Failed to execute goal org.apache.maven.plugins:maven-surefire-plugin:2.12.3:test (default-test) on project gs-wfs: There are test failures.
[ERROR]
[ERROR] Please refer to <https://build.geoserver.org/job/geoserver-2.14.x/ws/src/wfs/target/surefire-reports> for the individual test results.
[ERROR] -> [Help 1]
[ERROR]
[ERROR] To see the full stack trace of the errors, re-run Maven with the -e switch.
[ERROR] Re-run Maven using the -X switch to enable full debug logging.
[ERROR]
[ERROR] For more information about the errors and possible solutions, please read the following articles:
[ERROR] [Help 1] http://cwiki.apache.org/confluence/display/MAVEN/MojoFailureException
[ERROR]
[ERROR] After correcting the problems, you can resume the build with the command
[ERROR]   mvn <goals> -rf :gs-wfs
Build step 'Invoke top-level Maven targets' marked build as failure


_______________________________________________
Geoserver-devel mailing list
[hidden email]
https://lists.sourceforge.net/lists/listinfo/geoserver-devel
Reply | Threaded
Open this post in threaded view
|

Jenkins build is back to normal : geoserver-2.14.x #187

monitor