Build failed in Jenkins: geoserver-2.13.x #134

Previous Topic Next Topic
 
classic Classic list List threaded Threaded
4 messages Options
Reply | Threaded
Open this post in threaded view
|

Build failed in Jenkins: geoserver-2.13.x #134

monitor
See <https://build.geoserver.org/job/geoserver-2.13.x/134/display/redirect>

------------------------------------------
[...truncated 11.03 MB...]
        at sun.reflect.NativeMethodAccessorImpl.invoke(NativeMethodAccessorImpl.java:62)
        at sun.reflect.DelegatingMethodAccessorImpl.invoke(DelegatingMethodAccessorImpl.java:43)
        at java.lang.reflect.Method.invoke(Method.java:498)
        at org.apache.maven.surefire.util.ReflectionUtils.invokeMethodWithArray(ReflectionUtils.java:189)
        at org.apache.maven.surefire.booter.ProviderFactory$ProviderProxy.invoke(ProviderFactory.java:165)
        at org.apache.maven.surefire.booter.ProviderFactory.invokeProvider(ProviderFactory.java:85)
        at org.apache.maven.surefire.booter.ForkedBooter.runSuitesInProcess(ForkedBooter.java:115)
        at org.apache.maven.surefire.booter.ForkedBooter.main(ForkedBooter.java:75)
Jun 05, 2018 9:00:22 AM org.geoserver.importer.Importer copyFromFeatureReader
INFO: load to target took 16
Jun 05, 2018 9:00:25 AM org.geoserver.catalog.ResourcePool getFeatureType
WARNING: Error while getting feature type, flushing cache and retrying: Failed to find the datastore factory for dummy, did you forget to install the store extension jar?
Jun 05, 2018 9:00:25 AM org.geoserver.importer.Importer copyFromFeatureReader
INFO: load to target took 17
05 Jun 09:00:26 ERROR [geoserver.rest] - No such import: 0
org.geoserver.rest.RestException 404 NOT_FOUND: No such import: 0
        at org.geoserver.importer.rest.ImportBaseController.context(ImportBaseController.java:43)
        at org.geoserver.importer.rest.ImportBaseController.context(ImportBaseController.java:27)
        at org.geoserver.importer.rest.ImportBaseController.context(ImportBaseController.java:23)
        at org.geoserver.importer.rest.ImportController.getImports(ImportController.java:97)
        at sun.reflect.GeneratedMethodAccessor257.invoke(Unknown Source)
        at sun.reflect.DelegatingMethodAccessorImpl.invoke(DelegatingMethodAccessorImpl.java:43)
        at java.lang.reflect.Method.invoke(Method.java:498)
        at org.springframework.web.method.support.InvocableHandlerMethod.doInvoke(InvocableHandlerMethod.java:205)
        at org.springframework.web.method.support.InvocableHandlerMethod.invokeForRequest(InvocableHandlerMethod.java:133)
        at org.springframework.web.servlet.mvc.method.annotation.ServletInvocableHandlerMethod.invokeAndHandle(ServletInvocableHandlerMethod.java:116)
        at org.springframework.web.servlet.mvc.method.annotation.RequestMappingHandlerAdapter.invokeHandlerMethod(RequestMappingHandlerAdapter.java:827)
        at org.springframework.web.servlet.mvc.method.annotation.RequestMappingHandlerAdapter.handleInternal(RequestMappingHandlerAdapter.java:738)
        at org.springframework.web.servlet.mvc.method.AbstractHandlerMethodAdapter.handle(AbstractHandlerMethodAdapter.java:85)
        at org.springframework.web.servlet.DispatcherServlet.doDispatch(DispatcherServlet.java:963)
        at org.springframework.web.servlet.DispatcherServlet.doService(DispatcherServlet.java:897)
        at org.springframework.web.servlet.FrameworkServlet.processRequest(FrameworkServlet.java:970)
        at org.springframework.web.servlet.FrameworkServlet.doGet(FrameworkServlet.java:861)
        at javax.servlet.http.HttpServlet.service(HttpServlet.java:668)
        at org.springframework.web.servlet.FrameworkServlet.service(FrameworkServlet.java:846)
        at javax.servlet.http.HttpServlet.service(HttpServlet.java:770)
        at org.geoserver.test.GeoServerSystemTestSupport$2.service(GeoServerSystemTestSupport.java:1689)
        at javax.servlet.http.HttpServlet.service(HttpServlet.java:770)
        at org.springframework.mock.web.MockFilterChain$ServletFilterProxy.doFilter(MockFilterChain.java:167)
        at org.springframework.mock.web.MockFilterChain.doFilter(MockFilterChain.java:134)
        at org.geoserver.test.GeoServerSystemTestSupport.dispatch(GeoServerSystemTestSupport.java:1716)
        at org.geoserver.test.GeoServerSystemTestSupport.dispatch(GeoServerSystemTestSupport.java:1647)
        at org.geoserver.test.GeoServerSystemTestSupport.getAsServletResponse(GeoServerSystemTestSupport.java:1066)
        at org.geoserver.test.GeoServerSystemTestSupport.getAsServletResponse(GeoServerSystemTestSupport.java:1049)
        at org.geoserver.importer.rest.ImporterIntegrationTest.testDirectExecuteInternal(ImporterIntegrationTest.java:311)
        at org.geoserver.importer.rest.ImporterIntegrationTest.testDirectExecuteSync(ImporterIntegrationTest.java:239)
        at sun.reflect.NativeMethodAccessorImpl.invoke0(Native Method)
        at sun.reflect.NativeMethodAccessorImpl.invoke(NativeMethodAccessorImpl.java:62)
        at sun.reflect.DelegatingMethodAccessorImpl.invoke(DelegatingMethodAccessorImpl.java:43)
        at java.lang.reflect.Method.invoke(Method.java:498)
        at org.junit.runners.model.FrameworkMethod$1.runReflectiveCall(FrameworkMethod.java:47)
        at org.junit.internal.runners.model.ReflectiveCallable.run(ReflectiveCallable.java:12)
        at org.junit.runners.model.FrameworkMethod.invokeExplosively(FrameworkMethod.java:44)
        at org.junit.internal.runners.statements.InvokeMethod.evaluate(InvokeMethod.java:17)
        at org.junit.internal.runners.statements.RunBefores.evaluate(RunBefores.java:26)
        at org.junit.internal.runners.statements.RunAfters.evaluate(RunAfters.java:27)
        at org.junit.rules.RunRules.evaluate(RunRules.java:20)
        at org.junit.runners.ParentRunner.runLeaf(ParentRunner.java:271)
        at org.junit.runners.BlockJUnit4ClassRunner.runChild(BlockJUnit4ClassRunner.java:70)
        at org.junit.runners.BlockJUnit4ClassRunner.runChild(BlockJUnit4ClassRunner.java:50)
        at org.junit.runners.ParentRunner$3.run(ParentRunner.java:238)
        at org.junit.runners.ParentRunner$1.schedule(ParentRunner.java:63)
        at org.junit.runners.ParentRunner.runChildren(ParentRunner.java:236)
        at org.junit.runners.ParentRunner.access$000(ParentRunner.java:53)
        at org.junit.runners.ParentRunner$2.evaluate(ParentRunner.java:229)
        at org.junit.internal.runners.statements.RunBefores.evaluate(RunBefores.java:26)
        at org.junit.internal.runners.statements.RunAfters.evaluate(RunAfters.java:27)
        at org.junit.runners.ParentRunner.run(ParentRunner.java:309)
        at org.apache.maven.surefire.junit4.JUnit4Provider.execute(JUnit4Provider.java:252)
        at org.apache.maven.surefire.junit4.JUnit4Provider.executeTestSet(JUnit4Provider.java:141)
        at org.apache.maven.surefire.junit4.JUnit4Provider.invoke(JUnit4Provider.java:112)
        at sun.reflect.NativeMethodAccessorImpl.invoke0(Native Method)
        at sun.reflect.NativeMethodAccessorImpl.invoke(NativeMethodAccessorImpl.java:62)
        at sun.reflect.DelegatingMethodAccessorImpl.invoke(DelegatingMethodAccessorImpl.java:43)
        at java.lang.reflect.Method.invoke(Method.java:498)
        at org.apache.maven.surefire.util.ReflectionUtils.invokeMethodWithArray(ReflectionUtils.java:189)
        at org.apache.maven.surefire.booter.ProviderFactory$ProviderProxy.invoke(ProviderFactory.java:165)
        at org.apache.maven.surefire.booter.ProviderFactory.invokeProvider(ProviderFactory.java:85)
        at org.apache.maven.surefire.booter.ForkedBooter.runSuitesInProcess(ForkedBooter.java:115)
        at org.apache.maven.surefire.booter.ForkedBooter.main(ForkedBooter.java:75)
Jun 05, 2018 9:00:26 AM org.geoserver.importer.Importer copyFromFeatureReader
INFO: load to target took 18
Jun 05, 2018 9:00:26 AM org.geoserver.catalog.ResourcePool getFeatureType
WARNING: Error while getting feature type, flushing cache and retrying: Failed to find the datastore factory for dummy, did you forget to install the store extension jar?
Jun 05, 2018 9:00:27 AM org.geoserver.catalog.ResourcePool getFeatureType
WARNING: Error while getting feature type, flushing cache and retrying: Failed to find the datastore factory for dummy, did you forget to install the store extension jar?
Jun 05, 2018 9:00:27 AM org.geoserver.catalog.ResourcePool getFeatureType
WARNING: Error while getting feature type, flushing cache and retrying: Failed to find the datastore factory for dummy, did you forget to install the store extension jar?
Tests run: 12, Failures: 0, Errors: 0, Skipped: 0, Time elapsed: 13.788 sec
Running org.geoserver.importer.rest.converters.ImportJSONIOTest
Jun 05, 2018 9:00:28 AM org.geoserver.platform.GeoServerExtensions checkContext
WARNING: Extension lookup 'GeoServerSecurityProvider', but ApplicationContext is unset.
Jun 05, 2018 9:00:28 AM org.geoserver.platform.GeoServerExtensions checkContext
WARNING: Extension lookup 'ExtensionFilter', but ApplicationContext is unset.
Jun 05, 2018 9:00:28 AM org.geoserver.platform.GeoServerExtensions checkContext
WARNING: Extension lookup 'ExtensionProvider', but ApplicationContext is unset.
Jun 05, 2018 9:00:28 AM org.geoserver.platform.GeoServerExtensions checkContext
WARNING: Extension lookup 'ExtensionFilter', but ApplicationContext is unset.
Jun 05, 2018 9:00:28 AM org.geoserver.importer.Importer createContextStore
INFO: Enabling import store: memory
Tests run: 4, Failures: 0, Errors: 0, Skipped: 0, Time elapsed: 0.964 sec

Results :

Tests run: 70, Failures: 0, Errors: 0, Skipped: 0

[INFO]
[INFO] --- maven-jar-plugin:2.4:jar (default-jar) @ gs-importer-rest ---
[INFO] Building jar: <https://build.geoserver.org/job/geoserver-2.13.x/ws/src/extension/importer/rest/target/gs-importer-rest-2.13-SNAPSHOT.jar>
[INFO]
[INFO] --- maven-jar-plugin:2.4:test-jar (default) @ gs-importer-rest ---
[INFO] Building jar: <https://build.geoserver.org/job/geoserver-2.13.x/ws/src/extension/importer/rest/target/gs-importer-rest-2.13-SNAPSHOT-tests.jar>
[INFO]
[INFO] --- maven-source-plugin:2.2.1:jar-no-fork (attach-sources) @ gs-importer-rest ---
[INFO] Building jar: <https://build.geoserver.org/job/geoserver-2.13.x/ws/src/extension/importer/rest/target/gs-importer-rest-2.13-SNAPSHOT-sources.jar>
[INFO]
[INFO] --- maven-source-plugin:2.2.1:test-jar-no-fork (attach-sources) @ gs-importer-rest ---
[INFO] Building jar: <https://build.geoserver.org/job/geoserver-2.13.x/ws/src/extension/importer/rest/target/gs-importer-rest-2.13-SNAPSHOT-test-sources.jar>
[INFO]
[INFO] --- maven-install-plugin:2.4:install (default-install) @ gs-importer-rest ---
[INFO] Installing <https://build.geoserver.org/job/geoserver-2.13.x/ws/src/extension/importer/rest/target/gs-importer-rest-2.13-SNAPSHOT.jar> to /var/jenkins/.m2/repository/org/geoserver/importer/gs-importer-rest/2.13-SNAPSHOT/gs-importer-rest-2.13-SNAPSHOT.jar
[INFO] Installing <https://build.geoserver.org/job/geoserver-2.13.x/ws/src/extension/importer/rest/pom.xml> to /var/jenkins/.m2/repository/org/geoserver/importer/gs-importer-rest/2.13-SNAPSHOT/gs-importer-rest-2.13-SNAPSHOT.pom
[INFO] Installing <https://build.geoserver.org/job/geoserver-2.13.x/ws/src/extension/importer/rest/target/gs-importer-rest-2.13-SNAPSHOT-tests.jar> to /var/jenkins/.m2/repository/org/geoserver/importer/gs-importer-rest/2.13-SNAPSHOT/gs-importer-rest-2.13-SNAPSHOT-tests.jar
[INFO] Installing <https://build.geoserver.org/job/geoserver-2.13.x/ws/src/extension/importer/rest/target/gs-importer-rest-2.13-SNAPSHOT-sources.jar> to /var/jenkins/.m2/repository/org/geoserver/importer/gs-importer-rest/2.13-SNAPSHOT/gs-importer-rest-2.13-SNAPSHOT-sources.jar
[INFO] Installing <https://build.geoserver.org/job/geoserver-2.13.x/ws/src/extension/importer/rest/target/gs-importer-rest-2.13-SNAPSHOT-test-sources.jar> to /var/jenkins/.m2/repository/org/geoserver/importer/gs-importer-rest/2.13-SNAPSHOT/gs-importer-rest-2.13-SNAPSHOT-test-sources.jar
[INFO] ------------------------------------------------------------------------
[INFO] Reactor Summary:
[INFO]
[INFO] GeoServer .......................................... SUCCESS [  5.760 s]
[INFO] Core Platform Module ............................... SUCCESS [ 11.001 s]
[INFO] Open Web Service Module ............................ SUCCESS [ 11.293 s]
[INFO] Main Module ........................................ SUCCESS [ 57.915 s]
[INFO] GeoServer Security Modules ......................... SUCCESS [  0.068 s]
[INFO] GeoServer Security Tests Module .................... SUCCESS [01:12 min]
[INFO] GeoServer JDBC Security Module ..................... SUCCESS [ 35.799 s]
[INFO] GeoServer LDAP Security Module ..................... SUCCESS [ 20.035 s]
[INFO] Web Coverage Service Module ........................ SUCCESS [  3.703 s]
[INFO] Web Coverage Service 1.0 Module .................... SUCCESS [ 15.709 s]
[INFO] Web Coverage Service 1.1 Module .................... SUCCESS [ 18.304 s]
[INFO] Web Coverage Service 2.0 Module .................... SUCCESS [ 36.971 s]
[INFO] Web Feature Service Module ......................... SUCCESS [01:31 min]
[INFO] Web Map Service Module ............................. SUCCESS [01:55 min]
[INFO] KML support for GeoServer .......................... SUCCESS [ 27.582 s]
[INFO] gs-rest ............................................ SUCCESS [ 15.289 s]
[INFO] GeoWebCache (GWC) Module ........................... FAILURE [02:22 min]
[INFO] gs-restconfig ...................................... SUCCESS [01:16 min]
[INFO] gs-restconfig-wcs .................................. SUCCESS [ 16.031 s]
[INFO] gs-restconfig-wfs .................................. SUCCESS [ 17.890 s]
[INFO] gs-restconfig-wms .................................. SUCCESS [ 12.240 s]
[INFO] GeoServer Web Modules .............................. SUCCESS [  0.059 s]
[INFO] Core UI Module ..................................... SUCCESS [01:05 min]
[INFO] WMS UI Module ...................................... SUCCESS [ 29.266 s]
[INFO] GWC UI Module ...................................... SKIPPED
[INFO] WFS UI Module ...................................... SUCCESS [ 10.063 s]
[INFO] Demos Module ....................................... SUCCESS [ 16.854 s]
[INFO] WCS UI Module ...................................... SUCCESS [ 11.697 s]
[INFO] Security UI Modules ................................ SUCCESS [  0.050 s]
[INFO] Security UI Core Module ............................ SUCCESS [01:30 min]
[INFO] Security UI JDBC Module ............................ SUCCESS [01:07 min]
[INFO] Security UI LDAP Module ............................ SUCCESS [ 17.914 s]
[INFO] REST UI Module ..................................... SUCCESS [ 10.527 s]
[INFO] GeoServer Extensions ............................... SUCCESS [  0.035 s]
[INFO] Printing Module .................................... SUCCESS [ 13.301 s]
[INFO] GeoServer Web Application .......................... SKIPPED
[INFO] Community Space .................................... SUCCESS [  0.037 s]
[INFO] Application Schema Support ......................... SUCCESS [  0.025 s]
[INFO] Application Schema Integration Test ................ SUCCESS [02:33 min]
[INFO] Sample DataAccess Integration Test ................. SUCCESS [  9.398 s]
[INFO] ArcSDE DataStore Extension ......................... SUCCESS [ 10.666 s]
[INFO] H2 DataStore Extension ............................. SUCCESS [ 10.574 s]
[INFO] SQL Server DataStore Extension ..................... SUCCESS [  0.969 s]
[INFO] Oracle DataStore Extension ......................... SUCCESS [  0.392 s]
[INFO] MySQL DataStore Extension .......................... SUCCESS [  0.268 s]
[INFO] DB2 DataStore Extension ............................ SUCCESS [  0.212 s]
[INFO] ImageMap Output Format ............................. SUCCESS [  7.273 s]
[INFO] ImageI/O-Ext GDAL Coverage Extension ............... SUCCESS [  4.283 s]
[INFO] JP2K Coverage Extension ............................ SUCCESS [  0.280 s]
[INFO] OGR parent ......................................... SUCCESS [  0.025 s]
[INFO] OGR CORE ........................................... SUCCESS [  1.761 s]
[INFO] OGR WFS ............................................ SUCCESS [  8.208 s]
[INFO] Web Processing Service parent ...................... SUCCESS [  0.051 s]
[INFO] Web Processing Service Module ...................... SUCCESS [01:07 min]
[INFO] OGR WPS ............................................ SUCCESS [ 10.389 s]
[INFO] Excel Output Format ................................ SUCCESS [ 12.118 s]
[INFO] Chart external graphics support .................... SUCCESS [  0.470 s]
[INFO] Feature Generalization Extension ................... SUCCESS [  2.214 s]
[INFO] Image Mosaic JDBC Extension ........................ SUCCESS [  0.508 s]
[INFO] OWS request flow controller ........................ SUCCESS [ 16.051 s]
[INFO] Web process status sharing with Hazelcast .......... SUCCESS [ 18.222 s]
[INFO] Web Processing Service GUI ......................... SUCCESS [ 23.405 s]
[INFO] GeoServer Layer Querying filter functions .......... SUCCESS [ 13.101 s]
[INFO] Teradata DataStore Extension ....................... SUCCESS [  1.971 s]
[INFO] GeoServer Monitor Extensions ....................... SUCCESS [  0.042 s]
[INFO] Core Monitor Extension ............................. SUCCESS [ 25.300 s]
[INFO] GeoServer Security Extension Modules ............... SUCCESS [  0.030 s]
[INFO] GeoServer CAS Security Module ...................... SUCCESS [  6.506 s]
[INFO] GeoServer Security Extension Web Modules ........... SUCCESS [  0.105 s]
[INFO] GeoServer CAS Security Web Module .................. SUCCESS [  2.213 s]
[INFO] XLST based WFS output format ....................... SUCCESS [ 17.274 s]
[INFO] GeoServer INSPIRE Extensions ....................... SKIPPED
[INFO] GeoServer CSS Styling .............................. SUCCESS [ 15.428 s]
[INFO] Catalog Services for the Web parent ................ SUCCESS [  0.051 s]
[INFO] Catalog Services for the Web interfaces ............ SUCCESS [  8.526 s]
[INFO] Catalog Services for the Web - Simple CatalogStore implementation SUCCESS [  8.065 s]
[INFO] Catalog Services for the Web core module ........... SUCCESS [ 30.703 s]
[INFO] CSW UI Module ...................................... SUCCESS [ 11.456 s]
[INFO] DXF WFS output format and WPS PPIO ................. SUCCESS [  0.052 s]
[INFO] DXF WFS output format .............................. SUCCESS [ 11.423 s]
[INFO] DXF WPS PPIO ....................................... SUCCESS [  8.405 s]
[INFO] GeoServer WCS 2.0 Earth Observation Extensions ..... SUCCESS [  0.065 s]
[INFO] Web Coverage Service 2.0 Earth Observation extensions SUCCESS [ 15.593 s]
[INFO] Web Coverage Service 2.0 Earth Observation GUI extension SUCCESS [ 12.544 s]
[INFO] GeoServer libjpeg-turbo Module ..................... FAILURE [  6.559 s]
[INFO] GeoServer Data Importer ............................ SUCCESS [  0.043 s]
[INFO] Importer Core Module ............................... SUCCESS [ 49.484 s]
[INFO] Importer REST Api Module-ng ........................ SUCCESS [ 41.629 s]
[INFO] Importer Berkley DB Persistence Module ............. SUCCESS [ 14.438 s]
[INFO] Importer Web UI Module ............................. SUCCESS [ 13.200 s]
[INFO] GRIB Coverage Format ............................... SUCCESS [ 14.363 s]
[INFO] NetCDF Coverage format ............................. SUCCESS [ 15.435 s]
[INFO] WCS NetCDF output Module ........................... SUCCESS [ 50.373 s]
[INFO] Vector Tiles ....................................... SUCCESS [ 13.235 s]
[INFO] Ysld GeoServer Plugin .............................. SKIPPED
[INFO] MongoDB Data Store ................................. SUCCESS [  2.031 s]
[INFO] ------------------------------------------------------------------------
[INFO] BUILD FAILURE
[INFO] ------------------------------------------------------------------------
[INFO] Total time: 16:38 min (Wall Clock)
[INFO] Finished at: 2018-06-05T09:00:29+00:00
[INFO] Final Memory: 137M/1140M
[INFO] ------------------------------------------------------------------------
[ERROR] Failed to execute goal org.apache.maven.plugins:maven-surefire-plugin:2.12.3:test (default-test) on project gs-libjpeg-turbo: There are test failures.
[ERROR]
[ERROR] Please refer to <https://build.geoserver.org/job/geoserver-2.13.x/ws/src/extension/libjpeg-turbo/target/surefire-reports> for the individual test results.
[ERROR] -> [Help 1]
[ERROR] Failed to execute goal org.apache.maven.plugins:maven-surefire-plugin:2.12.3:test (default-test) on project gs-gwc: There are test failures.
[ERROR]
[ERROR] Please refer to <https://build.geoserver.org/job/geoserver-2.13.x/ws/src/gwc/target/surefire-reports> for the individual test results.
[ERROR] -> [Help 1]
[ERROR]
[ERROR] To see the full stack trace of the errors, re-run Maven with the -e switch.
[ERROR] Re-run Maven using the -X switch to enable full debug logging.
[ERROR]
[ERROR] For more information about the errors and possible solutions, please read the following articles:
[ERROR] [Help 1] http://cwiki.apache.org/confluence/display/MAVEN/MojoFailureException
[ERROR]
[ERROR] After correcting the problems, you can resume the build with the command
[ERROR]   mvn <goals> -rf :gs-libjpeg-turbo
Build step 'Invoke top-level Maven targets' marked build as failure

------------------------------------------------------------------------------
Check out the vibrant tech community on one of the world's most
engaging tech sites, Slashdot.org! http://sdm.link/slashdot
_______________________________________________
Geoserver-devel mailing list
[hidden email]
https://lists.sourceforge.net/lists/listinfo/geoserver-devel
Reply | Threaded
Open this post in threaded view
|

Build failed in Jenkins: geoserver-2.13.x #135

monitor
See <https://build.geoserver.org/job/geoserver-2.13.x/135/display/redirect?page=changes>

Changes:

[Andrea Aime] [GEOS-8600] GetTimeSeries slowness against multi-band coverage views

[Andrea Aime] [GEOS-8770] REST: listing granules in a structured coverage view fails

[Andrea Aime] [GEOS-8771] REST: cannot harvest files unless the input has file://

------------------------------------------
[...truncated 11.02 MB...]
[INFO] --- maven-source-plugin:2.2.1:test-jar-no-fork (attach-sources) @ gs-web-sec-cas ---
[INFO] No sources in project. Archive not created.
[INFO]
[INFO] --- maven-install-plugin:2.4:install (default-install) @ gs-web-sec-cas ---
[INFO] Installing <https://build.geoserver.org/job/geoserver-2.13.x/ws/src/extension/security/web/web-cas/target/gs-web-sec-cas-2.13-SNAPSHOT.jar> to /var/jenkins/.m2/repository/org/geoserver/security/gs-web-sec-cas/2.13-SNAPSHOT/gs-web-sec-cas-2.13-SNAPSHOT.jar
[INFO] Installing <https://build.geoserver.org/job/geoserver-2.13.x/ws/src/extension/security/web/web-cas/pom.xml> to /var/jenkins/.m2/repository/org/geoserver/security/gs-web-sec-cas/2.13-SNAPSHOT/gs-web-sec-cas-2.13-SNAPSHOT.pom
[INFO] Installing <https://build.geoserver.org/job/geoserver-2.13.x/ws/src/extension/security/web/web-cas/target/gs-web-sec-cas-2.13-SNAPSHOT-tests.jar> to /var/jenkins/.m2/repository/org/geoserver/security/gs-web-sec-cas/2.13-SNAPSHOT/gs-web-sec-cas-2.13-SNAPSHOT-tests.jar
[INFO] Installing <https://build.geoserver.org/job/geoserver-2.13.x/ws/src/extension/security/web/web-cas/target/gs-web-sec-cas-2.13-SNAPSHOT-sources.jar> to /var/jenkins/.m2/repository/org/geoserver/security/gs-web-sec-cas/2.13-SNAPSHOT/gs-web-sec-cas-2.13-SNAPSHOT-sources.jar
Jun 05, 2018 3:37:16 PM org.geoserver.importer.Importer copyFromFeatureReader
INFO: load to target took 26
Jun 05, 2018 3:37:18 PM org.geoserver.catalog.ResourcePool getFeatureType
WARNING: Error while getting feature type, flushing cache and retrying: Failed to find the datastore factory for dummy, did you forget to install the store extension jar?
Jun 05, 2018 3:37:19 PM org.geoserver.importer.Importer copyFromFeatureReader
INFO: load to target took 16
05 Jun 15:37:20 ERROR [geoserver.rest] - No such import: 0
org.geoserver.rest.RestException 404 NOT_FOUND: No such import: 0
        at org.geoserver.importer.rest.ImportBaseController.context(ImportBaseController.java:43)
        at org.geoserver.importer.rest.ImportBaseController.context(ImportBaseController.java:27)
        at org.geoserver.importer.rest.ImportBaseController.context(ImportBaseController.java:23)
        at org.geoserver.importer.rest.ImportController.getImports(ImportController.java:97)
        at sun.reflect.GeneratedMethodAccessor257.invoke(Unknown Source)
        at sun.reflect.DelegatingMethodAccessorImpl.invoke(DelegatingMethodAccessorImpl.java:43)
        at java.lang.reflect.Method.invoke(Method.java:498)
        at org.springframework.web.method.support.InvocableHandlerMethod.doInvoke(InvocableHandlerMethod.java:205)
        at org.springframework.web.method.support.InvocableHandlerMethod.invokeForRequest(InvocableHandlerMethod.java:133)
        at org.springframework.web.servlet.mvc.method.annotation.ServletInvocableHandlerMethod.invokeAndHandle(ServletInvocableHandlerMethod.java:116)
        at org.springframework.web.servlet.mvc.method.annotation.RequestMappingHandlerAdapter.invokeHandlerMethod(RequestMappingHandlerAdapter.java:827)
        at org.springframework.web.servlet.mvc.method.annotation.RequestMappingHandlerAdapter.handleInternal(RequestMappingHandlerAdapter.java:738)
        at org.springframework.web.servlet.mvc.method.AbstractHandlerMethodAdapter.handle(AbstractHandlerMethodAdapter.java:85)
        at org.springframework.web.servlet.DispatcherServlet.doDispatch(DispatcherServlet.java:963)
        at org.springframework.web.servlet.DispatcherServlet.doService(DispatcherServlet.java:897)
        at org.springframework.web.servlet.FrameworkServlet.processRequest(FrameworkServlet.java:970)
        at org.springframework.web.servlet.FrameworkServlet.doGet(FrameworkServlet.java:861)
        at javax.servlet.http.HttpServlet.service(HttpServlet.java:668)
        at org.springframework.web.servlet.FrameworkServlet.service(FrameworkServlet.java:846)
        at javax.servlet.http.HttpServlet.service(HttpServlet.java:770)
        at org.geoserver.test.GeoServerSystemTestSupport$2.service(GeoServerSystemTestSupport.java:1689)
        at javax.servlet.http.HttpServlet.service(HttpServlet.java:770)
        at org.springframework.mock.web.MockFilterChain$ServletFilterProxy.doFilter(MockFilterChain.java:167)
        at org.springframework.mock.web.MockFilterChain.doFilter(MockFilterChain.java:134)
        at org.geoserver.test.GeoServerSystemTestSupport.dispatch(GeoServerSystemTestSupport.java:1716)
        at org.geoserver.test.GeoServerSystemTestSupport.dispatch(GeoServerSystemTestSupport.java:1647)
        at org.geoserver.test.GeoServerSystemTestSupport.getAsServletResponse(GeoServerSystemTestSupport.java:1066)
        at org.geoserver.test.GeoServerSystemTestSupport.getAsServletResponse(GeoServerSystemTestSupport.java:1049)
        at org.geoserver.importer.rest.ImporterIntegrationTest.testDirectExecuteInternal(ImporterIntegrationTest.java:311)
        at org.geoserver.importer.rest.ImporterIntegrationTest.testDirectExecuteSync(ImporterIntegrationTest.java:239)
        at sun.reflect.NativeMethodAccessorImpl.invoke0(Native Method)
        at sun.reflect.NativeMethodAccessorImpl.invoke(NativeMethodAccessorImpl.java:62)
        at sun.reflect.DelegatingMethodAccessorImpl.invoke(DelegatingMethodAccessorImpl.java:43)
        at java.lang.reflect.Method.invoke(Method.java:498)
        at org.junit.runners.model.FrameworkMethod$1.runReflectiveCall(FrameworkMethod.java:47)
        at org.junit.internal.runners.model.ReflectiveCallable.run(ReflectiveCallable.java:12)
        at org.junit.runners.model.FrameworkMethod.invokeExplosively(FrameworkMethod.java:44)
        at org.junit.internal.runners.statements.InvokeMethod.evaluate(InvokeMethod.java:17)
        at org.junit.internal.runners.statements.RunBefores.evaluate(RunBefores.java:26)
        at org.junit.internal.runners.statements.RunAfters.evaluate(RunAfters.java:27)
        at org.junit.rules.RunRules.evaluate(RunRules.java:20)
        at org.junit.runners.ParentRunner.runLeaf(ParentRunner.java:271)
        at org.junit.runners.BlockJUnit4ClassRunner.runChild(BlockJUnit4ClassRunner.java:70)
        at org.junit.runners.BlockJUnit4ClassRunner.runChild(BlockJUnit4ClassRunner.java:50)
        at org.junit.runners.ParentRunner$3.run(ParentRunner.java:238)
        at org.junit.runners.ParentRunner$1.schedule(ParentRunner.java:63)
        at org.junit.runners.ParentRunner.runChildren(ParentRunner.java:236)
        at org.junit.runners.ParentRunner.access$000(ParentRunner.java:53)
        at org.junit.runners.ParentRunner$2.evaluate(ParentRunner.java:229)
        at org.junit.internal.runners.statements.RunBefores.evaluate(RunBefores.java:26)
        at org.junit.internal.runners.statements.RunAfters.evaluate(RunAfters.java:27)
        at org.junit.runners.ParentRunner.run(ParentRunner.java:309)
        at org.apache.maven.surefire.junit4.JUnit4Provider.execute(JUnit4Provider.java:252)
        at org.apache.maven.surefire.junit4.JUnit4Provider.executeTestSet(JUnit4Provider.java:141)
        at org.apache.maven.surefire.junit4.JUnit4Provider.invoke(JUnit4Provider.java:112)
        at sun.reflect.NativeMethodAccessorImpl.invoke0(Native Method)
        at sun.reflect.NativeMethodAccessorImpl.invoke(NativeMethodAccessorImpl.java:62)
        at sun.reflect.DelegatingMethodAccessorImpl.invoke(DelegatingMethodAccessorImpl.java:43)
        at java.lang.reflect.Method.invoke(Method.java:498)
        at org.apache.maven.surefire.util.ReflectionUtils.invokeMethodWithArray(ReflectionUtils.java:189)
        at org.apache.maven.surefire.booter.ProviderFactory$ProviderProxy.invoke(ProviderFactory.java:165)
        at org.apache.maven.surefire.booter.ProviderFactory.invokeProvider(ProviderFactory.java:85)
        at org.apache.maven.surefire.booter.ForkedBooter.runSuitesInProcess(ForkedBooter.java:115)
        at org.apache.maven.surefire.booter.ForkedBooter.main(ForkedBooter.java:75)
Jun 05, 2018 3:37:20 PM org.geoserver.importer.Importer copyFromFeatureReader
INFO: load to target took 15
Jun 05, 2018 3:37:20 PM org.geoserver.catalog.ResourcePool getFeatureType
WARNING: Error while getting feature type, flushing cache and retrying: Failed to find the datastore factory for dummy, did you forget to install the store extension jar?
Jun 05, 2018 3:37:21 PM org.geoserver.catalog.ResourcePool getFeatureType
WARNING: Error while getting feature type, flushing cache and retrying: Failed to find the datastore factory for dummy, did you forget to install the store extension jar?
Jun 05, 2018 3:37:21 PM org.geoserver.catalog.ResourcePool getFeatureType
WARNING: Error while getting feature type, flushing cache and retrying: Failed to find the datastore factory for dummy, did you forget to install the store extension jar?
Tests run: 12, Failures: 0, Errors: 0, Skipped: 0, Time elapsed: 13.927 sec
Running org.geoserver.importer.rest.converters.ImportJSONIOTest
Jun 05, 2018 3:37:22 PM org.geoserver.platform.GeoServerExtensions checkContext
WARNING: Extension lookup 'GeoServerSecurityProvider', but ApplicationContext is unset.
Jun 05, 2018 3:37:22 PM org.geoserver.platform.GeoServerExtensions checkContext
WARNING: Extension lookup 'ExtensionFilter', but ApplicationContext is unset.
Jun 05, 2018 3:37:22 PM org.geoserver.platform.GeoServerExtensions checkContext
WARNING: Extension lookup 'ExtensionProvider', but ApplicationContext is unset.
Jun 05, 2018 3:37:22 PM org.geoserver.platform.GeoServerExtensions checkContext
WARNING: Extension lookup 'ExtensionFilter', but ApplicationContext is unset.
Jun 05, 2018 3:37:22 PM org.geoserver.importer.Importer createContextStore
INFO: Enabling import store: memory
Tests run: 4, Failures: 0, Errors: 0, Skipped: 0, Time elapsed: 0.976 sec

Results :

Tests run: 70, Failures: 0, Errors: 0, Skipped: 0

[INFO]
[INFO] --- maven-jar-plugin:2.4:jar (default-jar) @ gs-importer-rest ---
[INFO] Building jar: <https://build.geoserver.org/job/geoserver-2.13.x/ws/src/extension/importer/rest/target/gs-importer-rest-2.13-SNAPSHOT.jar>
[INFO]
[INFO] --- maven-jar-plugin:2.4:test-jar (default) @ gs-importer-rest ---
[INFO] Building jar: <https://build.geoserver.org/job/geoserver-2.13.x/ws/src/extension/importer/rest/target/gs-importer-rest-2.13-SNAPSHOT-tests.jar>
[INFO]
[INFO] --- maven-source-plugin:2.2.1:jar-no-fork (attach-sources) @ gs-importer-rest ---
[INFO] Building jar: <https://build.geoserver.org/job/geoserver-2.13.x/ws/src/extension/importer/rest/target/gs-importer-rest-2.13-SNAPSHOT-sources.jar>
[INFO]
[INFO] --- maven-source-plugin:2.2.1:test-jar-no-fork (attach-sources) @ gs-importer-rest ---
[INFO] Building jar: <https://build.geoserver.org/job/geoserver-2.13.x/ws/src/extension/importer/rest/target/gs-importer-rest-2.13-SNAPSHOT-test-sources.jar>
[INFO]
[INFO] --- maven-install-plugin:2.4:install (default-install) @ gs-importer-rest ---
[INFO] Installing <https://build.geoserver.org/job/geoserver-2.13.x/ws/src/extension/importer/rest/target/gs-importer-rest-2.13-SNAPSHOT.jar> to /var/jenkins/.m2/repository/org/geoserver/importer/gs-importer-rest/2.13-SNAPSHOT/gs-importer-rest-2.13-SNAPSHOT.jar
[INFO] Installing <https://build.geoserver.org/job/geoserver-2.13.x/ws/src/extension/importer/rest/pom.xml> to /var/jenkins/.m2/repository/org/geoserver/importer/gs-importer-rest/2.13-SNAPSHOT/gs-importer-rest-2.13-SNAPSHOT.pom
[INFO] Installing <https://build.geoserver.org/job/geoserver-2.13.x/ws/src/extension/importer/rest/target/gs-importer-rest-2.13-SNAPSHOT-tests.jar> to /var/jenkins/.m2/repository/org/geoserver/importer/gs-importer-rest/2.13-SNAPSHOT/gs-importer-rest-2.13-SNAPSHOT-tests.jar
[INFO] Installing <https://build.geoserver.org/job/geoserver-2.13.x/ws/src/extension/importer/rest/target/gs-importer-rest-2.13-SNAPSHOT-sources.jar> to /var/jenkins/.m2/repository/org/geoserver/importer/gs-importer-rest/2.13-SNAPSHOT/gs-importer-rest-2.13-SNAPSHOT-sources.jar
[INFO] Installing <https://build.geoserver.org/job/geoserver-2.13.x/ws/src/extension/importer/rest/target/gs-importer-rest-2.13-SNAPSHOT-test-sources.jar> to /var/jenkins/.m2/repository/org/geoserver/importer/gs-importer-rest/2.13-SNAPSHOT/gs-importer-rest-2.13-SNAPSHOT-test-sources.jar
[INFO] ------------------------------------------------------------------------
[INFO] Reactor Summary:
[INFO]
[INFO] GeoServer .......................................... SUCCESS [  5.392 s]
[INFO] Core Platform Module ............................... SUCCESS [ 11.124 s]
[INFO] Open Web Service Module ............................ SUCCESS [ 11.561 s]
[INFO] Main Module ........................................ SUCCESS [ 59.347 s]
[INFO] GeoServer Security Modules ......................... SUCCESS [  0.059 s]
[INFO] GeoServer Security Tests Module .................... SUCCESS [01:12 min]
[INFO] GeoServer JDBC Security Module ..................... SUCCESS [ 36.137 s]
[INFO] GeoServer LDAP Security Module ..................... SUCCESS [ 22.086 s]
[INFO] Web Coverage Service Module ........................ SUCCESS [  3.536 s]
[INFO] Web Coverage Service 1.0 Module .................... SUCCESS [ 15.593 s]
[INFO] Web Coverage Service 1.1 Module .................... SUCCESS [ 18.201 s]
[INFO] Web Coverage Service 2.0 Module .................... SUCCESS [ 37.394 s]
[INFO] Web Feature Service Module ......................... SUCCESS [01:34 min]
[INFO] Web Map Service Module ............................. SUCCESS [01:52 min]
[INFO] KML support for GeoServer .......................... SUCCESS [ 27.549 s]
[INFO] gs-rest ............................................ SUCCESS [ 16.069 s]
[INFO] GeoWebCache (GWC) Module ........................... FAILURE [02:21 min]
[INFO] gs-restconfig ...................................... SUCCESS [01:22 min]
[INFO] gs-restconfig-wcs .................................. SUCCESS [ 19.850 s]
[INFO] gs-restconfig-wfs .................................. SUCCESS [ 17.927 s]
[INFO] gs-restconfig-wms .................................. SUCCESS [ 12.476 s]
[INFO] GeoServer Web Modules .............................. SUCCESS [  0.051 s]
[INFO] Core UI Module ..................................... SUCCESS [01:07 min]
[INFO] WMS UI Module ...................................... SUCCESS [ 30.030 s]
[INFO] GWC UI Module ...................................... SKIPPED
[INFO] WFS UI Module ...................................... SUCCESS [ 10.494 s]
[INFO] Demos Module ....................................... SUCCESS [ 16.349 s]
[INFO] WCS UI Module ...................................... SUCCESS [ 11.730 s]
[INFO] Security UI Modules ................................ SUCCESS [  0.117 s]
[INFO] Security UI Core Module ............................ SUCCESS [01:34 min]
[INFO] Security UI JDBC Module ............................ SUCCESS [01:03 min]
[INFO] Security UI LDAP Module ............................ SUCCESS [ 18.361 s]
[INFO] REST UI Module ..................................... SUCCESS [ 10.245 s]
[INFO] GeoServer Extensions ............................... SUCCESS [  0.045 s]
[INFO] Printing Module .................................... SUCCESS [ 13.299 s]
[INFO] GeoServer Web Application .......................... SKIPPED
[INFO] Community Space .................................... SUCCESS [  0.034 s]
[INFO] Application Schema Support ......................... SUCCESS [  0.026 s]
[INFO] Application Schema Integration Test ................ SUCCESS [02:33 min]
[INFO] Sample DataAccess Integration Test ................. SUCCESS [ 10.109 s]
[INFO] ArcSDE DataStore Extension ......................... SUCCESS [ 10.611 s]
[INFO] H2 DataStore Extension ............................. SUCCESS [ 10.673 s]
[INFO] SQL Server DataStore Extension ..................... SUCCESS [  0.942 s]
[INFO] Oracle DataStore Extension ......................... SUCCESS [  0.430 s]
[INFO] MySQL DataStore Extension .......................... SUCCESS [  0.218 s]
[INFO] DB2 DataStore Extension ............................ SUCCESS [  0.203 s]
[INFO] ImageMap Output Format ............................. SUCCESS [  6.982 s]
[INFO] ImageI/O-Ext GDAL Coverage Extension ............... SUCCESS [  4.960 s]
[INFO] JP2K Coverage Extension ............................ SUCCESS [  0.269 s]
[INFO] OGR parent ......................................... SUCCESS [  0.029 s]
[INFO] OGR CORE ........................................... SUCCESS [  1.901 s]
[INFO] OGR WFS ............................................ SUCCESS [  8.651 s]
[INFO] Web Processing Service parent ...................... SUCCESS [  0.021 s]
[INFO] Web Processing Service Module ...................... SUCCESS [01:08 min]
[INFO] OGR WPS ............................................ SUCCESS [ 10.424 s]
[INFO] Excel Output Format ................................ SUCCESS [ 11.681 s]
[INFO] Chart external graphics support .................... SUCCESS [  0.491 s]
[INFO] Feature Generalization Extension ................... SUCCESS [  2.148 s]
[INFO] Image Mosaic JDBC Extension ........................ SUCCESS [  0.521 s]
[INFO] OWS request flow controller ........................ SUCCESS [ 16.037 s]
[INFO] Web process status sharing with Hazelcast .......... SUCCESS [ 23.096 s]
[INFO] Web Processing Service GUI ......................... SUCCESS [ 25.869 s]
[INFO] GeoServer Layer Querying filter functions .......... SUCCESS [ 13.445 s]
[INFO] Teradata DataStore Extension ....................... SUCCESS [  2.048 s]
[INFO] GeoServer Monitor Extensions ....................... SUCCESS [  0.049 s]
[INFO] Core Monitor Extension ............................. SUCCESS [ 22.827 s]
[INFO] GeoServer Security Extension Modules ............... SUCCESS [  0.033 s]
[INFO] GeoServer CAS Security Module ...................... SUCCESS [  5.696 s]
[INFO] GeoServer Security Extension Web Modules ........... SUCCESS [  0.037 s]
[INFO] GeoServer CAS Security Web Module .................. SUCCESS [  1.788 s]
[INFO] XLST based WFS output format ....................... SUCCESS [ 17.449 s]
[INFO] GeoServer INSPIRE Extensions ....................... SKIPPED
[INFO] GeoServer CSS Styling .............................. SUCCESS [ 15.473 s]
[INFO] Catalog Services for the Web parent ................ SUCCESS [  0.050 s]
[INFO] Catalog Services for the Web interfaces ............ SUCCESS [  8.914 s]
[INFO] Catalog Services for the Web - Simple CatalogStore implementation SUCCESS [  8.324 s]
[INFO] Catalog Services for the Web core module ........... SUCCESS [ 31.311 s]
[INFO] CSW UI Module ...................................... SUCCESS [  9.596 s]
[INFO] DXF WFS output format and WPS PPIO ................. SUCCESS [  0.050 s]
[INFO] DXF WFS output format .............................. SUCCESS [ 11.147 s]
[INFO] DXF WPS PPIO ....................................... SUCCESS [  8.861 s]
[INFO] GeoServer WCS 2.0 Earth Observation Extensions ..... SUCCESS [  0.050 s]
[INFO] Web Coverage Service 2.0 Earth Observation extensions SUCCESS [ 19.282 s]
[INFO] Web Coverage Service 2.0 Earth Observation GUI extension SUCCESS [ 13.834 s]
[INFO] GeoServer libjpeg-turbo Module ..................... FAILURE [  6.698 s]
[INFO] GeoServer Data Importer ............................ SUCCESS [  0.034 s]
[INFO] Importer Core Module ............................... SUCCESS [ 48.788 s]
[INFO] Importer REST Api Module-ng ........................ SUCCESS [ 41.668 s]
[INFO] Importer Berkley DB Persistence Module ............. SUCCESS [ 13.927 s]
[INFO] Importer Web UI Module ............................. SUCCESS [ 13.515 s]
[INFO] GRIB Coverage Format ............................... SUCCESS [ 14.531 s]
[INFO] NetCDF Coverage format ............................. SUCCESS [ 15.646 s]
[INFO] WCS NetCDF output Module ........................... SUCCESS [ 52.989 s]
[INFO] Vector Tiles ....................................... SUCCESS [ 13.463 s]
[INFO] Ysld GeoServer Plugin .............................. SKIPPED
[INFO] MongoDB Data Store ................................. SUCCESS [  1.881 s]
[INFO] ------------------------------------------------------------------------
[INFO] BUILD FAILURE
[INFO] ------------------------------------------------------------------------
[INFO] Total time: 16:52 min (Wall Clock)
[INFO] Finished at: 2018-06-05T15:37:22+00:00
[INFO] Final Memory: 138M/1052M
[INFO] ------------------------------------------------------------------------
[ERROR] Failed to execute goal org.apache.maven.plugins:maven-surefire-plugin:2.12.3:test (default-test) on project gs-libjpeg-turbo: There are test failures.
[ERROR]
[ERROR] Please refer to <https://build.geoserver.org/job/geoserver-2.13.x/ws/src/extension/libjpeg-turbo/target/surefire-reports> for the individual test results.
[ERROR] -> [Help 1]
[ERROR] Failed to execute goal org.apache.maven.plugins:maven-surefire-plugin:2.12.3:test (default-test) on project gs-gwc: There are test failures.
[ERROR]
[ERROR] Please refer to <https://build.geoserver.org/job/geoserver-2.13.x/ws/src/gwc/target/surefire-reports> for the individual test results.
[ERROR] -> [Help 1]
[ERROR]
[ERROR] To see the full stack trace of the errors, re-run Maven with the -e switch.
[ERROR] Re-run Maven using the -X switch to enable full debug logging.
[ERROR]
[ERROR] For more information about the errors and possible solutions, please read the following articles:
[ERROR] [Help 1] http://cwiki.apache.org/confluence/display/MAVEN/MojoFailureException
[ERROR]
[ERROR] After correcting the problems, you can resume the build with the command
[ERROR]   mvn <goals> -rf :gs-libjpeg-turbo
Build step 'Invoke top-level Maven targets' marked build as failure

------------------------------------------------------------------------------
Check out the vibrant tech community on one of the world's most
engaging tech sites, Slashdot.org! http://sdm.link/slashdot
_______________________________________________
Geoserver-devel mailing list
[hidden email]
https://lists.sourceforge.net/lists/listinfo/geoserver-devel
Reply | Threaded
Open this post in threaded view
|

Build failed in Jenkins: geoserver-2.13.x #136

monitor
See <https://build.geoserver.org/job/geoserver-2.13.x/136/display/redirect?page=changes>

Changes:

[Daniele Romagnoli] Updating to Imageio-ext 1.1.22 version

------------------------------------------
[...truncated 11.01 MB...]
[INFO]
[INFO] --- maven-source-plugin:2.2.1:jar-no-fork (attach-sources) @ gs-web-sec-cas ---
[INFO] Building jar: <https://build.geoserver.org/job/geoserver-2.13.x/ws/src/extension/security/web/web-cas/target/gs-web-sec-cas-2.13-SNAPSHOT-sources.jar>
[INFO]
[INFO] --- maven-source-plugin:2.2.1:test-jar-no-fork (attach-sources) @ gs-web-sec-cas ---
[INFO] No sources in project. Archive not created.
[INFO]
[INFO] --- maven-install-plugin:2.4:install (default-install) @ gs-web-sec-cas ---
[INFO] Installing <https://build.geoserver.org/job/geoserver-2.13.x/ws/src/extension/security/web/web-cas/target/gs-web-sec-cas-2.13-SNAPSHOT.jar> to /var/jenkins/.m2/repository/org/geoserver/security/gs-web-sec-cas/2.13-SNAPSHOT/gs-web-sec-cas-2.13-SNAPSHOT.jar
[INFO] Installing <https://build.geoserver.org/job/geoserver-2.13.x/ws/src/extension/security/web/web-cas/pom.xml> to /var/jenkins/.m2/repository/org/geoserver/security/gs-web-sec-cas/2.13-SNAPSHOT/gs-web-sec-cas-2.13-SNAPSHOT.pom
[INFO] Installing <https://build.geoserver.org/job/geoserver-2.13.x/ws/src/extension/security/web/web-cas/target/gs-web-sec-cas-2.13-SNAPSHOT-tests.jar> to /var/jenkins/.m2/repository/org/geoserver/security/gs-web-sec-cas/2.13-SNAPSHOT/gs-web-sec-cas-2.13-SNAPSHOT-tests.jar
[INFO] Installing <https://build.geoserver.org/job/geoserver-2.13.x/ws/src/extension/security/web/web-cas/target/gs-web-sec-cas-2.13-SNAPSHOT-sources.jar> to /var/jenkins/.m2/repository/org/geoserver/security/gs-web-sec-cas/2.13-SNAPSHOT/gs-web-sec-cas-2.13-SNAPSHOT-sources.jar
Jun 05, 2018 4:29:30 PM org.geoserver.importer.Importer copyFromFeatureReader
INFO: load to target took 18
Jun 05, 2018 4:29:33 PM org.geoserver.catalog.ResourcePool getFeatureType
WARNING: Error while getting feature type, flushing cache and retrying: Failed to find the datastore factory for dummy, did you forget to install the store extension jar?
Jun 05, 2018 4:29:33 PM org.geoserver.importer.Importer copyFromFeatureReader
INFO: load to target took 16
05 Jun 16:29:34 ERROR [geoserver.rest] - No such import: 0
org.geoserver.rest.RestException 404 NOT_FOUND: No such import: 0
        at org.geoserver.importer.rest.ImportBaseController.context(ImportBaseController.java:43)
        at org.geoserver.importer.rest.ImportBaseController.context(ImportBaseController.java:27)
        at org.geoserver.importer.rest.ImportBaseController.context(ImportBaseController.java:23)
        at org.geoserver.importer.rest.ImportController.getImports(ImportController.java:97)
        at sun.reflect.GeneratedMethodAccessor260.invoke(Unknown Source)
        at sun.reflect.DelegatingMethodAccessorImpl.invoke(DelegatingMethodAccessorImpl.java:43)
        at java.lang.reflect.Method.invoke(Method.java:498)
        at org.springframework.web.method.support.InvocableHandlerMethod.doInvoke(InvocableHandlerMethod.java:205)
        at org.springframework.web.method.support.InvocableHandlerMethod.invokeForRequest(InvocableHandlerMethod.java:133)
        at org.springframework.web.servlet.mvc.method.annotation.ServletInvocableHandlerMethod.invokeAndHandle(ServletInvocableHandlerMethod.java:116)
        at org.springframework.web.servlet.mvc.method.annotation.RequestMappingHandlerAdapter.invokeHandlerMethod(RequestMappingHandlerAdapter.java:827)
        at org.springframework.web.servlet.mvc.method.annotation.RequestMappingHandlerAdapter.handleInternal(RequestMappingHandlerAdapter.java:738)
        at org.springframework.web.servlet.mvc.method.AbstractHandlerMethodAdapter.handle(AbstractHandlerMethodAdapter.java:85)
        at org.springframework.web.servlet.DispatcherServlet.doDispatch(DispatcherServlet.java:963)
        at org.springframework.web.servlet.DispatcherServlet.doService(DispatcherServlet.java:897)
        at org.springframework.web.servlet.FrameworkServlet.processRequest(FrameworkServlet.java:970)
        at org.springframework.web.servlet.FrameworkServlet.doGet(FrameworkServlet.java:861)
        at javax.servlet.http.HttpServlet.service(HttpServlet.java:668)
        at org.springframework.web.servlet.FrameworkServlet.service(FrameworkServlet.java:846)
        at javax.servlet.http.HttpServlet.service(HttpServlet.java:770)
        at org.geoserver.test.GeoServerSystemTestSupport$2.service(GeoServerSystemTestSupport.java:1689)
        at javax.servlet.http.HttpServlet.service(HttpServlet.java:770)
        at org.springframework.mock.web.MockFilterChain$ServletFilterProxy.doFilter(MockFilterChain.java:167)
        at org.springframework.mock.web.MockFilterChain.doFilter(MockFilterChain.java:134)
        at org.geoserver.test.GeoServerSystemTestSupport.dispatch(GeoServerSystemTestSupport.java:1716)
        at org.geoserver.test.GeoServerSystemTestSupport.dispatch(GeoServerSystemTestSupport.java:1647)
        at org.geoserver.test.GeoServerSystemTestSupport.getAsServletResponse(GeoServerSystemTestSupport.java:1066)
        at org.geoserver.test.GeoServerSystemTestSupport.getAsServletResponse(GeoServerSystemTestSupport.java:1049)
        at org.geoserver.importer.rest.ImporterIntegrationTest.testDirectExecuteInternal(ImporterIntegrationTest.java:311)
        at org.geoserver.importer.rest.ImporterIntegrationTest.testDirectExecuteSync(ImporterIntegrationTest.java:239)
        at sun.reflect.NativeMethodAccessorImpl.invoke0(Native Method)
        at sun.reflect.NativeMethodAccessorImpl.invoke(NativeMethodAccessorImpl.java:62)
        at sun.reflect.DelegatingMethodAccessorImpl.invoke(DelegatingMethodAccessorImpl.java:43)
        at java.lang.reflect.Method.invoke(Method.java:498)
        at org.junit.runners.model.FrameworkMethod$1.runReflectiveCall(FrameworkMethod.java:47)
        at org.junit.internal.runners.model.ReflectiveCallable.run(ReflectiveCallable.java:12)
        at org.junit.runners.model.FrameworkMethod.invokeExplosively(FrameworkMethod.java:44)
        at org.junit.internal.runners.statements.InvokeMethod.evaluate(InvokeMethod.java:17)
        at org.junit.internal.runners.statements.RunBefores.evaluate(RunBefores.java:26)
        at org.junit.internal.runners.statements.RunAfters.evaluate(RunAfters.java:27)
        at org.junit.rules.RunRules.evaluate(RunRules.java:20)
        at org.junit.runners.ParentRunner.runLeaf(ParentRunner.java:271)
        at org.junit.runners.BlockJUnit4ClassRunner.runChild(BlockJUnit4ClassRunner.java:70)
        at org.junit.runners.BlockJUnit4ClassRunner.runChild(BlockJUnit4ClassRunner.java:50)
        at org.junit.runners.ParentRunner$3.run(ParentRunner.java:238)
        at org.junit.runners.ParentRunner$1.schedule(ParentRunner.java:63)
        at org.junit.runners.ParentRunner.runChildren(ParentRunner.java:236)
        at org.junit.runners.ParentRunner.access$000(ParentRunner.java:53)
        at org.junit.runners.ParentRunner$2.evaluate(ParentRunner.java:229)
        at org.junit.internal.runners.statements.RunBefores.evaluate(RunBefores.java:26)
        at org.junit.internal.runners.statements.RunAfters.evaluate(RunAfters.java:27)
        at org.junit.runners.ParentRunner.run(ParentRunner.java:309)
        at org.apache.maven.surefire.junit4.JUnit4Provider.execute(JUnit4Provider.java:252)
        at org.apache.maven.surefire.junit4.JUnit4Provider.executeTestSet(JUnit4Provider.java:141)
        at org.apache.maven.surefire.junit4.JUnit4Provider.invoke(JUnit4Provider.java:112)
        at sun.reflect.NativeMethodAccessorImpl.invoke0(Native Method)
        at sun.reflect.NativeMethodAccessorImpl.invoke(NativeMethodAccessorImpl.java:62)
        at sun.reflect.DelegatingMethodAccessorImpl.invoke(DelegatingMethodAccessorImpl.java:43)
        at java.lang.reflect.Method.invoke(Method.java:498)
        at org.apache.maven.surefire.util.ReflectionUtils.invokeMethodWithArray(ReflectionUtils.java:189)
        at org.apache.maven.surefire.booter.ProviderFactory$ProviderProxy.invoke(ProviderFactory.java:165)
        at org.apache.maven.surefire.booter.ProviderFactory.invokeProvider(ProviderFactory.java:85)
        at org.apache.maven.surefire.booter.ForkedBooter.runSuitesInProcess(ForkedBooter.java:115)
        at org.apache.maven.surefire.booter.ForkedBooter.main(ForkedBooter.java:75)
Jun 05, 2018 4:29:34 PM org.geoserver.importer.Importer copyFromFeatureReader
INFO: load to target took 14
Jun 05, 2018 4:29:34 PM org.geoserver.catalog.ResourcePool getFeatureType
WARNING: Error while getting feature type, flushing cache and retrying: Failed to find the datastore factory for dummy, did you forget to install the store extension jar?
Jun 05, 2018 4:29:35 PM org.geoserver.catalog.ResourcePool getFeatureType
WARNING: Error while getting feature type, flushing cache and retrying: Failed to find the datastore factory for dummy, did you forget to install the store extension jar?
Jun 05, 2018 4:29:35 PM org.geoserver.catalog.ResourcePool getFeatureType
WARNING: Error while getting feature type, flushing cache and retrying: Failed to find the datastore factory for dummy, did you forget to install the store extension jar?
Tests run: 12, Failures: 0, Errors: 0, Skipped: 0, Time elapsed: 13.512 sec
Running org.geoserver.importer.rest.converters.ImportJSONIOTest
Jun 05, 2018 4:29:36 PM org.geoserver.platform.GeoServerExtensions checkContext
WARNING: Extension lookup 'GeoServerSecurityProvider', but ApplicationContext is unset.
Jun 05, 2018 4:29:36 PM org.geoserver.platform.GeoServerExtensions checkContext
WARNING: Extension lookup 'ExtensionFilter', but ApplicationContext is unset.
Jun 05, 2018 4:29:36 PM org.geoserver.platform.GeoServerExtensions checkContext
WARNING: Extension lookup 'ExtensionProvider', but ApplicationContext is unset.
Jun 05, 2018 4:29:36 PM org.geoserver.platform.GeoServerExtensions checkContext
WARNING: Extension lookup 'ExtensionFilter', but ApplicationContext is unset.
Jun 05, 2018 4:29:36 PM org.geoserver.importer.Importer createContextStore
INFO: Enabling import store: memory
Tests run: 4, Failures: 0, Errors: 0, Skipped: 0, Time elapsed: 0.882 sec

Results :

Tests run: 70, Failures: 0, Errors: 0, Skipped: 0

[INFO]
[INFO] --- maven-jar-plugin:2.4:jar (default-jar) @ gs-importer-rest ---
[INFO] Building jar: <https://build.geoserver.org/job/geoserver-2.13.x/ws/src/extension/importer/rest/target/gs-importer-rest-2.13-SNAPSHOT.jar>
[INFO]
[INFO] --- maven-jar-plugin:2.4:test-jar (default) @ gs-importer-rest ---
[INFO] Building jar: <https://build.geoserver.org/job/geoserver-2.13.x/ws/src/extension/importer/rest/target/gs-importer-rest-2.13-SNAPSHOT-tests.jar>
[INFO]
[INFO] --- maven-source-plugin:2.2.1:jar-no-fork (attach-sources) @ gs-importer-rest ---
[INFO] Building jar: <https://build.geoserver.org/job/geoserver-2.13.x/ws/src/extension/importer/rest/target/gs-importer-rest-2.13-SNAPSHOT-sources.jar>
[INFO]
[INFO] --- maven-source-plugin:2.2.1:test-jar-no-fork (attach-sources) @ gs-importer-rest ---
[INFO] Building jar: <https://build.geoserver.org/job/geoserver-2.13.x/ws/src/extension/importer/rest/target/gs-importer-rest-2.13-SNAPSHOT-test-sources.jar>
[INFO]
[INFO] --- maven-install-plugin:2.4:install (default-install) @ gs-importer-rest ---
[INFO] Installing <https://build.geoserver.org/job/geoserver-2.13.x/ws/src/extension/importer/rest/target/gs-importer-rest-2.13-SNAPSHOT.jar> to /var/jenkins/.m2/repository/org/geoserver/importer/gs-importer-rest/2.13-SNAPSHOT/gs-importer-rest-2.13-SNAPSHOT.jar
[INFO] Installing <https://build.geoserver.org/job/geoserver-2.13.x/ws/src/extension/importer/rest/pom.xml> to /var/jenkins/.m2/repository/org/geoserver/importer/gs-importer-rest/2.13-SNAPSHOT/gs-importer-rest-2.13-SNAPSHOT.pom
[INFO] Installing <https://build.geoserver.org/job/geoserver-2.13.x/ws/src/extension/importer/rest/target/gs-importer-rest-2.13-SNAPSHOT-tests.jar> to /var/jenkins/.m2/repository/org/geoserver/importer/gs-importer-rest/2.13-SNAPSHOT/gs-importer-rest-2.13-SNAPSHOT-tests.jar
[INFO] Installing <https://build.geoserver.org/job/geoserver-2.13.x/ws/src/extension/importer/rest/target/gs-importer-rest-2.13-SNAPSHOT-sources.jar> to /var/jenkins/.m2/repository/org/geoserver/importer/gs-importer-rest/2.13-SNAPSHOT/gs-importer-rest-2.13-SNAPSHOT-sources.jar
[INFO] Installing <https://build.geoserver.org/job/geoserver-2.13.x/ws/src/extension/importer/rest/target/gs-importer-rest-2.13-SNAPSHOT-test-sources.jar> to /var/jenkins/.m2/repository/org/geoserver/importer/gs-importer-rest/2.13-SNAPSHOT/gs-importer-rest-2.13-SNAPSHOT-test-sources.jar
[INFO] ------------------------------------------------------------------------
[INFO] Reactor Summary:
[INFO]
[INFO] GeoServer .......................................... SUCCESS [  5.332 s]
[INFO] Core Platform Module ............................... SUCCESS [ 10.986 s]
[INFO] Open Web Service Module ............................ SUCCESS [ 10.966 s]
[INFO] Main Module ........................................ SUCCESS [ 58.068 s]
[INFO] GeoServer Security Modules ......................... SUCCESS [  0.059 s]
[INFO] GeoServer Security Tests Module .................... SUCCESS [01:10 min]
[INFO] GeoServer JDBC Security Module ..................... SUCCESS [ 35.809 s]
[INFO] GeoServer LDAP Security Module ..................... SUCCESS [ 20.516 s]
[INFO] Web Coverage Service Module ........................ SUCCESS [  3.410 s]
[INFO] Web Coverage Service 1.0 Module .................... SUCCESS [ 15.350 s]
[INFO] Web Coverage Service 1.1 Module .................... SUCCESS [ 18.984 s]
[INFO] Web Coverage Service 2.0 Module .................... SUCCESS [ 37.011 s]
[INFO] Web Feature Service Module ......................... SUCCESS [01:34 min]
[INFO] Web Map Service Module ............................. SUCCESS [01:50 min]
[INFO] KML support for GeoServer .......................... SUCCESS [ 28.138 s]
[INFO] gs-rest ............................................ SUCCESS [ 15.970 s]
[INFO] GeoWebCache (GWC) Module ........................... FAILURE [02:51 min]
[INFO] gs-restconfig ...................................... SUCCESS [01:21 min]
[INFO] gs-restconfig-wcs .................................. SUCCESS [ 19.702 s]
[INFO] gs-restconfig-wfs .................................. SUCCESS [ 18.019 s]
[INFO] gs-restconfig-wms .................................. SUCCESS [ 12.634 s]
[INFO] GeoServer Web Modules .............................. SUCCESS [  0.058 s]
[INFO] Core UI Module ..................................... SUCCESS [01:06 min]
[INFO] WMS UI Module ...................................... SUCCESS [ 29.845 s]
[INFO] GWC UI Module ...................................... SKIPPED
[INFO] WFS UI Module ...................................... SUCCESS [ 10.345 s]
[INFO] Demos Module ....................................... SUCCESS [ 17.124 s]
[INFO] WCS UI Module ...................................... SUCCESS [ 11.826 s]
[INFO] Security UI Modules ................................ SUCCESS [  0.087 s]
[INFO] Security UI Core Module ............................ SUCCESS [01:33 min]
[INFO] Security UI JDBC Module ............................ SUCCESS [01:04 min]
[INFO] Security UI LDAP Module ............................ SUCCESS [ 18.111 s]
[INFO] REST UI Module ..................................... SUCCESS [ 10.261 s]
[INFO] GeoServer Extensions ............................... SUCCESS [  0.055 s]
[INFO] Printing Module .................................... SUCCESS [ 13.009 s]
[INFO] GeoServer Web Application .......................... SKIPPED
[INFO] Community Space .................................... SUCCESS [  0.047 s]
[INFO] Application Schema Support ......................... SUCCESS [  0.024 s]
[INFO] Application Schema Integration Test ................ SUCCESS [02:31 min]
[INFO] Sample DataAccess Integration Test ................. SUCCESS [ 10.175 s]
[INFO] ArcSDE DataStore Extension ......................... SUCCESS [ 10.471 s]
[INFO] H2 DataStore Extension ............................. SUCCESS [ 10.830 s]
[INFO] SQL Server DataStore Extension ..................... SUCCESS [  0.891 s]
[INFO] Oracle DataStore Extension ......................... SUCCESS [  0.387 s]
[INFO] MySQL DataStore Extension .......................... SUCCESS [  0.215 s]
[INFO] DB2 DataStore Extension ............................ SUCCESS [  0.209 s]
[INFO] ImageMap Output Format ............................. SUCCESS [  7.150 s]
[INFO] ImageI/O-Ext GDAL Coverage Extension ............... SUCCESS [  4.189 s]
[INFO] JP2K Coverage Extension ............................ SUCCESS [  0.275 s]
[INFO] OGR parent ......................................... SUCCESS [  0.041 s]
[INFO] OGR CORE ........................................... SUCCESS [  1.832 s]
[INFO] OGR WFS ............................................ SUCCESS [  8.634 s]
[INFO] Web Processing Service parent ...................... SUCCESS [  0.046 s]
[INFO] Web Processing Service Module ...................... SUCCESS [01:02 min]
[INFO] OGR WPS ............................................ SUCCESS [ 10.774 s]
[INFO] Excel Output Format ................................ SUCCESS [ 12.041 s]
[INFO] Chart external graphics support .................... SUCCESS [  0.543 s]
[INFO] Feature Generalization Extension ................... SUCCESS [  2.061 s]
[INFO] Image Mosaic JDBC Extension ........................ SUCCESS [  0.484 s]
[INFO] OWS request flow controller ........................ SUCCESS [ 15.147 s]
[INFO] Web process status sharing with Hazelcast .......... SUCCESS [ 23.898 s]
[INFO] Web Processing Service GUI ......................... SUCCESS [ 24.163 s]
[INFO] GeoServer Layer Querying filter functions .......... SUCCESS [ 13.114 s]
[INFO] Teradata DataStore Extension ....................... SUCCESS [  2.130 s]
[INFO] GeoServer Monitor Extensions ....................... SUCCESS [  0.047 s]
[INFO] Core Monitor Extension ............................. SUCCESS [ 19.392 s]
[INFO] GeoServer Security Extension Modules ............... SUCCESS [  0.027 s]
[INFO] GeoServer CAS Security Module ...................... SUCCESS [  7.416 s]
[INFO] GeoServer Security Extension Web Modules ........... SUCCESS [  0.037 s]
[INFO] GeoServer CAS Security Web Module .................. SUCCESS [  1.957 s]
[INFO] XLST based WFS output format ....................... SUCCESS [ 17.141 s]
[INFO] GeoServer INSPIRE Extensions ....................... SKIPPED
[INFO] GeoServer CSS Styling .............................. SUCCESS [ 15.549 s]
[INFO] Catalog Services for the Web parent ................ SUCCESS [  0.033 s]
[INFO] Catalog Services for the Web interfaces ............ SUCCESS [  8.789 s]
[INFO] Catalog Services for the Web - Simple CatalogStore implementation SUCCESS [  8.417 s]
[INFO] Catalog Services for the Web core module ........... SUCCESS [ 32.191 s]
[INFO] CSW UI Module ...................................... SUCCESS [  9.243 s]
[INFO] DXF WFS output format and WPS PPIO ................. SUCCESS [  0.026 s]
[INFO] DXF WFS output format .............................. SUCCESS [ 10.768 s]
[INFO] DXF WPS PPIO ....................................... SUCCESS [  8.664 s]
[INFO] GeoServer WCS 2.0 Earth Observation Extensions ..... SUCCESS [  0.027 s]
[INFO] Web Coverage Service 2.0 Earth Observation extensions SUCCESS [ 15.212 s]
[INFO] Web Coverage Service 2.0 Earth Observation GUI extension SUCCESS [ 12.792 s]
[INFO] GeoServer libjpeg-turbo Module ..................... SUCCESS [  8.626 s]
[INFO] GeoServer Data Importer ............................ SUCCESS [  0.044 s]
[INFO] Importer Core Module ............................... SUCCESS [ 49.710 s]
[INFO] Importer REST Api Module-ng ........................ SUCCESS [ 41.597 s]
[INFO] Importer Berkley DB Persistence Module ............. SUCCESS [ 13.716 s]
[INFO] Importer Web UI Module ............................. SUCCESS [ 13.112 s]
[INFO] GRIB Coverage Format ............................... SUCCESS [ 14.226 s]
[INFO] NetCDF Coverage format ............................. SUCCESS [ 15.356 s]
[INFO] WCS NetCDF output Module ........................... SUCCESS [ 51.668 s]
[INFO] Vector Tiles ....................................... SUCCESS [ 14.123 s]
[INFO] Ysld GeoServer Plugin .............................. SKIPPED
[INFO] MongoDB Data Store ................................. SUCCESS [  1.991 s]
[INFO] ------------------------------------------------------------------------
[INFO] BUILD FAILURE
[INFO] ------------------------------------------------------------------------
[INFO] Total time: 16:53 min (Wall Clock)
[INFO] Finished at: 2018-06-05T16:29:36+00:00
[INFO] Final Memory: 136M/1044M
[INFO] ------------------------------------------------------------------------
[ERROR] Failed to execute goal org.apache.maven.plugins:maven-surefire-plugin:2.12.3:test (default-test) on project gs-gwc: There are test failures.
[ERROR]
[ERROR] Please refer to <https://build.geoserver.org/job/geoserver-2.13.x/ws/src/gwc/target/surefire-reports> for the individual test results.
[ERROR] -> [Help 1]
[ERROR]
[ERROR] To see the full stack trace of the errors, re-run Maven with the -e switch.
[ERROR] Re-run Maven using the -X switch to enable full debug logging.
[ERROR]
[ERROR] For more information about the errors and possible solutions, please read the following articles:
[ERROR] [Help 1] http://cwiki.apache.org/confluence/display/MAVEN/MojoFailureException
[ERROR]
[ERROR] After correcting the problems, you can resume the build with the command
[ERROR]   mvn <goals> -rf :gs-gwc
Build step 'Invoke top-level Maven targets' marked build as failure

------------------------------------------------------------------------------
Check out the vibrant tech community on one of the world's most
engaging tech sites, Slashdot.org! http://sdm.link/slashdot
_______________________________________________
Geoserver-devel mailing list
[hidden email]
https://lists.sourceforge.net/lists/listinfo/geoserver-devel
Reply | Threaded
Open this post in threaded view
|

Jenkins build is back to normal : geoserver-2.13.x #137

monitor
See <https://build.geoserver.org/job/geoserver-2.13.x/137/display/redirect?page=changes>


------------------------------------------------------------------------------
Check out the vibrant tech community on one of the world's most
engaging tech sites, Slashdot.org! http://sdm.link/slashdot
_______________________________________________
Geoserver-devel mailing list
[hidden email]
https://lists.sourceforge.net/lists/listinfo/geoserver-devel