Build failed in Jenkins: geoserver-2.12.x #251

classic Classic list List threaded Threaded
2 messages Options
Reply | Threaded
Open this post in threaded view
|

Build failed in Jenkins: geoserver-2.12.x #251

monitor
See <https://build.geoserver.org/job/geoserver-2.12.x/251/display/redirect>

------------------------------------------
[...truncated 5.68 MB...]
Jun 12, 2018 8:54:13 PM org.geoserver.platform.GeoServerExtensions checkContext
WARNING: Extension lookup 'ExtensionFilter', but ApplicationContext is unset.
Jun 12, 2018 8:54:13 PM org.geoserver.platform.GeoServerExtensions checkContext
WARNING: Extension lookup 'XStreamPersisterInitializer', but ApplicationContext is unset.
Jun 12, 2018 8:54:13 PM org.geoserver.platform.GeoServerExtensions checkContext
WARNING: Extension lookup 'ExtensionFilter', but ApplicationContext is unset.
Jun 12, 2018 8:54:13 PM org.geoserver.platform.GeoServerExtensions checkContext
WARNING: Extension lookup 'ExtensionProvider', but ApplicationContext is unset.
Jun 12, 2018 8:54:13 PM org.geoserver.platform.GeoServerExtensions checkContext
WARNING: Extension lookup 'ExtensionFilter', but ApplicationContext is unset.
Jun 12, 2018 8:54:13 PM org.geotools.image.ImageWorker <clinit>
INFO: Warp/affine reduction enabled: true
Jun 12, 2018 8:54:13 PM org.geoserver.platform.GeoServerExtensions checkContext
WARNING: Extension lookup 'XStreamPersisterInitializer', but ApplicationContext is unset.
Jun 12, 2018 8:54:13 PM org.geoserver.platform.GeoServerExtensions checkContext
WARNING: Extension lookup 'ExtensionFilter', but ApplicationContext is unset.
Jun 12, 2018 8:54:13 PM org.geoserver.platform.GeoServerExtensions checkContext
WARNING: Extension lookup 'ExtensionProvider', but ApplicationContext is unset.
Jun 12, 2018 8:54:13 PM org.geoserver.platform.GeoServerExtensions checkContext
WARNING: Extension lookup 'ExtensionFilter', but ApplicationContext is unset.
Jun 12, 2018 8:54:14 PM org.geoserver.platform.GeoServerExtensions checkContext
WARNING: Extension lookup 'GeoServerResourceLoader', but ApplicationContext is unset.
Jun 12, 2018 8:54:14 PM org.geoserver.platform.GeoServerExtensions checkContext
WARNING: Extension lookup 'GeoServerResourceLoader', but ApplicationContext is unset.
Jun 12, 2018 8:54:14 PM org.geoserver.platform.GeoServerExtensions checkContext
WARNING: Extension lookup 'ExtensionFilter', but ApplicationContext is unset.
Jun 12, 2018 8:54:14 PM org.geoserver.platform.GeoServerExtensions checkContext
WARNING: Extension lookup 'ExtensionProvider', but ApplicationContext is unset.
Jun 12, 2018 8:54:14 PM org.geoserver.platform.GeoServerExtensions checkContext
WARNING: Extension lookup 'ExtensionFilter', but ApplicationContext is unset.
Jun 12, 2018 8:54:14 PM org.geoserver.platform.GeoServerExtensions checkContext
WARNING: Extension lookup 'GeoServerResourceLoader', but ApplicationContext is unset.
Jun 12, 2018 8:54:14 PM org.geoserver.platform.GeoServerExtensions checkContext
WARNING: Extension lookup 'GeoServerResourceLoader', but ApplicationContext is unset.
Jun 12, 2018 8:54:14 PM org.geoserver.platform.GeoServerExtensions checkContext
WARNING: Extension lookup 'ExtensionFilter', but ApplicationContext is unset.
Jun 12, 2018 8:54:14 PM org.geoserver.platform.GeoServerExtensions checkContext
WARNING: Extension lookup 'ExtensionProvider', but ApplicationContext is unset.
Jun 12, 2018 8:54:14 PM org.geoserver.platform.GeoServerExtensions checkContext
WARNING: Extension lookup 'ExtensionFilter', but ApplicationContext is unset.
Jun 12, 2018 8:54:15 PM org.geoserver.platform.GeoServerExtensions checkContext
WARNING: Extension lookup 'GeoServerSecurityProvider', but ApplicationContext is unset.
Jun 12, 2018 8:54:15 PM org.geoserver.platform.GeoServerExtensions checkContext
WARNING: Extension lookup 'ExtensionFilter', but ApplicationContext is unset.
Jun 12, 2018 8:54:15 PM org.geoserver.platform.GeoServerExtensions checkContext
WARNING: Extension lookup 'ExtensionProvider', but ApplicationContext is unset.
Jun 12, 2018 8:54:15 PM org.geoserver.platform.GeoServerExtensions checkContext
WARNING: Extension lookup 'ExtensionFilter', but ApplicationContext is unset.
Tests run: 5, Failures: 0, Errors: 0, Skipped: 0, Time elapsed: 3.746 sec

Results :

Tests run: 5, Failures: 0, Errors: 0, Skipped: 0

[INFO]
[INFO] --- maven-jar-plugin:2.4:jar (default-jar) @ gs-dxf-wps ---
[INFO] Building jar: <https://build.geoserver.org/job/geoserver-2.12.x/ws/src/extension/dxf/wps/target/gs-dxf-wps-2.12-SNAPSHOT.jar>
[INFO]
[INFO] --- maven-jar-plugin:2.4:test-jar (default) @ gs-dxf-wps ---
[INFO] Building jar: <https://build.geoserver.org/job/geoserver-2.12.x/ws/src/extension/dxf/wps/target/gs-dxf-wps-2.12-SNAPSHOT-tests.jar>
[INFO]
[INFO] --- maven-source-plugin:2.2.1:jar-no-fork (attach-sources) @ gs-dxf-wps ---
[INFO] Building jar: <https://build.geoserver.org/job/geoserver-2.12.x/ws/src/extension/dxf/wps/target/gs-dxf-wps-2.12-SNAPSHOT-sources.jar>
[INFO]
[INFO] --- maven-source-plugin:2.2.1:test-jar-no-fork (attach-sources) @ gs-dxf-wps ---
[INFO] Building jar: <https://build.geoserver.org/job/geoserver-2.12.x/ws/src/extension/dxf/wps/target/gs-dxf-wps-2.12-SNAPSHOT-test-sources.jar>
[INFO]
[INFO] --- fmt-maven-plugin:2.4.0:check (default) @ gs-dxf-wps ---
[debug] Using AOSP style
[INFO] Processed 2 files (0 non-complying).
[INFO]
[INFO] --- maven-install-plugin:2.4:install (default-install) @ gs-dxf-wps ---
[INFO] Installing <https://build.geoserver.org/job/geoserver-2.12.x/ws/src/extension/dxf/wps/target/gs-dxf-wps-2.12-SNAPSHOT.jar> to /var/jenkins/.m2/repository/org/geoserver/extension/gs-dxf-wps/2.12-SNAPSHOT/gs-dxf-wps-2.12-SNAPSHOT.jar
[INFO] Installing <https://build.geoserver.org/job/geoserver-2.12.x/ws/src/extension/dxf/wps/pom.xml> to /var/jenkins/.m2/repository/org/geoserver/extension/gs-dxf-wps/2.12-SNAPSHOT/gs-dxf-wps-2.12-SNAPSHOT.pom
[INFO] Installing <https://build.geoserver.org/job/geoserver-2.12.x/ws/src/extension/dxf/wps/target/gs-dxf-wps-2.12-SNAPSHOT-tests.jar> to /var/jenkins/.m2/repository/org/geoserver/extension/gs-dxf-wps/2.12-SNAPSHOT/gs-dxf-wps-2.12-SNAPSHOT-tests.jar
[INFO] Installing <https://build.geoserver.org/job/geoserver-2.12.x/ws/src/extension/dxf/wps/target/gs-dxf-wps-2.12-SNAPSHOT-sources.jar> to /var/jenkins/.m2/repository/org/geoserver/extension/gs-dxf-wps/2.12-SNAPSHOT/gs-dxf-wps-2.12-SNAPSHOT-sources.jar
[INFO] Installing <https://build.geoserver.org/job/geoserver-2.12.x/ws/src/extension/dxf/wps/target/gs-dxf-wps-2.12-SNAPSHOT-test-sources.jar> to /var/jenkins/.m2/repository/org/geoserver/extension/gs-dxf-wps/2.12-SNAPSHOT/gs-dxf-wps-2.12-SNAPSHOT-test-sources.jar
Jun 12, 2018 8:54:17 PM com.hazelcast.core.LifecycleService
INFO: [127.0.0.1]:5011 [dev] [3.3.1] Address[127.0.0.1]:5011 is SHUTTING_DOWN
Jun 12, 2018 8:54:17 PM com.hazelcast.cluster.ClusterService
INFO: [127.0.0.1]:5012 [dev] [3.3.1] Master Address[127.0.0.1]:5011 left the cluster. Assigning new master Member [127.0.0.1]:5012 this
Jun 12, 2018 8:54:17 PM com.hazelcast.cluster.ClusterService
INFO: [127.0.0.1]:5012 [dev] [3.3.1] Removing Member [127.0.0.1]:5011
Jun 12, 2018 8:54:17 PM com.hazelcast.cluster.ClusterService
INFO: [127.0.0.1]:5012 [dev] [3.3.1]

Members [1] {
        Member [127.0.0.1]:5012 this
}

Jun 12, 2018 8:54:17 PM com.hazelcast.initializer
INFO: [127.0.0.1]:5011 [dev] [3.3.1] Destroying node initializer.
Jun 12, 2018 8:54:17 PM com.hazelcast.instance.Node
INFO: [127.0.0.1]:5011 [dev] [3.3.1] Hazelcast Shutdown is completed in 14 ms.
Jun 12, 2018 8:54:17 PM com.hazelcast.core.LifecycleService
INFO: [127.0.0.1]:5011 [dev] [3.3.1] Address[127.0.0.1]:5011 is SHUTDOWN
Jun 12, 2018 8:54:17 PM com.hazelcast.core.LifecycleService
INFO: [127.0.0.1]:5012 [dev] [3.3.1] Address[127.0.0.1]:5012 is SHUTTING_DOWN
Jun 12, 2018 8:54:17 PM com.hazelcast.initializer
INFO: [127.0.0.1]:5012 [dev] [3.3.1] Destroying node initializer.
Jun 12, 2018 8:54:17 PM com.hazelcast.instance.Node
INFO: [127.0.0.1]:5012 [dev] [3.3.1] Hazelcast Shutdown is completed in 6 ms.
Jun 12, 2018 8:54:17 PM com.hazelcast.core.LifecycleService
INFO: [127.0.0.1]:5012 [dev] [3.3.1] Address[127.0.0.1]:5012 is SHUTDOWN
Tests run: 4, Failures: 0, Errors: 0, Skipped: 0, Time elapsed: 9.897 sec

Results :

Tests run: 8, Failures: 0, Errors: 0, Skipped: 0

[INFO]
[INFO] --- maven-jar-plugin:2.4:jar (default-jar) @ gs-wps-cluster-hazelcast ---
[INFO] Building jar: <https://build.geoserver.org/job/geoserver-2.12.x/ws/src/extension/wps/wps-cluster-hazelcast/target/gs-wps-cluster-hazelcast-2.12-SNAPSHOT.jar>
[INFO]
[INFO] --- maven-jar-plugin:2.4:test-jar (default) @ gs-wps-cluster-hazelcast ---
[INFO] Building jar: <https://build.geoserver.org/job/geoserver-2.12.x/ws/src/extension/wps/wps-cluster-hazelcast/target/gs-wps-cluster-hazelcast-2.12-SNAPSHOT-tests.jar>
[INFO]
[INFO] --- maven-source-plugin:2.2.1:jar-no-fork (attach-sources) @ gs-wps-cluster-hazelcast ---
[INFO] Building jar: <https://build.geoserver.org/job/geoserver-2.12.x/ws/src/extension/wps/wps-cluster-hazelcast/target/gs-wps-cluster-hazelcast-2.12-SNAPSHOT-sources.jar>
[INFO]
[INFO] --- maven-source-plugin:2.2.1:test-jar-no-fork (attach-sources) @ gs-wps-cluster-hazelcast ---
[INFO] Building jar: <https://build.geoserver.org/job/geoserver-2.12.x/ws/src/extension/wps/wps-cluster-hazelcast/target/gs-wps-cluster-hazelcast-2.12-SNAPSHOT-test-sources.jar>
[INFO]
[INFO] --- fmt-maven-plugin:2.4.0:check (default) @ gs-wps-cluster-hazelcast ---
[debug] Using AOSP style
[INFO] Processed 5 files (0 non-complying).
[INFO]
[INFO] --- maven-install-plugin:2.4:install (default-install) @ gs-wps-cluster-hazelcast ---
[INFO] Installing <https://build.geoserver.org/job/geoserver-2.12.x/ws/src/extension/wps/wps-cluster-hazelcast/target/gs-wps-cluster-hazelcast-2.12-SNAPSHOT.jar> to /var/jenkins/.m2/repository/org/geoserver/extension/gs-wps-cluster-hazelcast/2.12-SNAPSHOT/gs-wps-cluster-hazelcast-2.12-SNAPSHOT.jar
[INFO] Installing <https://build.geoserver.org/job/geoserver-2.12.x/ws/src/extension/wps/wps-cluster-hazelcast/pom.xml> to /var/jenkins/.m2/repository/org/geoserver/extension/gs-wps-cluster-hazelcast/2.12-SNAPSHOT/gs-wps-cluster-hazelcast-2.12-SNAPSHOT.pom
[INFO] Installing <https://build.geoserver.org/job/geoserver-2.12.x/ws/src/extension/wps/wps-cluster-hazelcast/target/gs-wps-cluster-hazelcast-2.12-SNAPSHOT-tests.jar> to /var/jenkins/.m2/repository/org/geoserver/extension/gs-wps-cluster-hazelcast/2.12-SNAPSHOT/gs-wps-cluster-hazelcast-2.12-SNAPSHOT-tests.jar
[INFO] Installing <https://build.geoserver.org/job/geoserver-2.12.x/ws/src/extension/wps/wps-cluster-hazelcast/target/gs-wps-cluster-hazelcast-2.12-SNAPSHOT-sources.jar> to /var/jenkins/.m2/repository/org/geoserver/extension/gs-wps-cluster-hazelcast/2.12-SNAPSHOT/gs-wps-cluster-hazelcast-2.12-SNAPSHOT-sources.jar
[INFO] Installing <https://build.geoserver.org/job/geoserver-2.12.x/ws/src/extension/wps/wps-cluster-hazelcast/target/gs-wps-cluster-hazelcast-2.12-SNAPSHOT-test-sources.jar> to /var/jenkins/.m2/repository/org/geoserver/extension/gs-wps-cluster-hazelcast/2.12-SNAPSHOT/gs-wps-cluster-hazelcast-2.12-SNAPSHOT-test-sources.jar
[INFO] ------------------------------------------------------------------------
[INFO] Reactor Summary:
[INFO]
[INFO] GeoServer .......................................... SUCCESS [  5.906 s]
[INFO] Core Platform Module ............................... SUCCESS [ 12.835 s]
[INFO] Open Web Service Module ............................ SUCCESS [ 11.087 s]
[INFO] Main Module ........................................ SUCCESS [01:53 min]
[INFO] GeoServer Security Modules ......................... SUCCESS [  0.086 s]
[INFO] GeoServer JDBC Security Module ..................... SUCCESS [ 35.463 s]
[INFO] GeoServer LDAP Security Module ..................... SUCCESS [ 19.365 s]
[INFO] Web Coverage Service Module ........................ SUCCESS [  4.349 s]
[INFO] Web Coverage Service 1.0 Module .................... SUCCESS [ 20.129 s]
[INFO] Web Coverage Service 1.1 Module .................... SUCCESS [ 22.624 s]
[INFO] Web Coverage Service 2.0 Module .................... SUCCESS [ 36.704 s]
[INFO] Web Feature Service Module ......................... SUCCESS [01:23 min]
[INFO] Web Map Service Module ............................. FAILURE [01:53 min]
[INFO] KML support for GeoServer .......................... SKIPPED
[INFO] gs-rest ............................................ SUCCESS [ 15.364 s]
[INFO] gs-restconfig ...................................... SKIPPED
[INFO] GeoWebCache (GWC) Module ........................... SKIPPED
[INFO] GeoServer Web Modules .............................. SUCCESS [  0.066 s]
[INFO] Core UI Module ..................................... SUCCESS [01:01 min]
[INFO] WMS UI Module ...................................... SKIPPED
[INFO] GWC UI Module ...................................... SKIPPED
[INFO] WFS UI Module ...................................... SUCCESS [ 11.961 s]
[INFO] Demos Module ....................................... SKIPPED
[INFO] WCS UI Module ...................................... SKIPPED
[INFO] Security UI Modules ................................ SUCCESS [  0.060 s]
[INFO] Security UI Core Module ............................ SKIPPED
[INFO] Security UI JDBC Module ............................ SKIPPED
[INFO] Security UI LDAP Module ............................ SKIPPED
[INFO] REST UI Module ..................................... SKIPPED
[INFO] GeoServer Extensions ............................... SUCCESS [  0.045 s]
[INFO] Printing Module .................................... SUCCESS [ 12.317 s]
[INFO] GeoServer Web Application .......................... SKIPPED
[INFO] Community Space .................................... SUCCESS [  0.027 s]
[INFO] Application Schema Support ......................... SUCCESS [  0.028 s]
[INFO] Application Schema Integration Test ................ SKIPPED
[INFO] Sample DataAccess Integration Test ................. SUCCESS [  9.660 s]
[INFO] ArcSDE DataStore Extension ......................... SUCCESS [ 12.052 s]
[INFO] H2 DataStore Extension ............................. SKIPPED
[INFO] SQL Server DataStore Extension ..................... SUCCESS [  0.909 s]
[INFO] Oracle DataStore Extension ......................... SUCCESS [  0.373 s]
[INFO] MySQL DataStore Extension .......................... SUCCESS [  0.196 s]
[INFO] DB2 DataStore Extension ............................ SUCCESS [  0.211 s]
[INFO] ImageMap Output Format ............................. SKIPPED
[INFO] ImageI/O-Ext GDAL Coverage Extension ............... SUCCESS [  3.997 s]
[INFO] JP2K Coverage Extension ............................ SUCCESS [  0.267 s]
[INFO] OGR parent ......................................... SUCCESS [  0.060 s]
[INFO] OGR CORE ........................................... SUCCESS [  3.344 s]
[INFO] OGR WFS ............................................ SUCCESS [  8.189 s]
[INFO] Web Processing Service parent ...................... SUCCESS [  0.049 s]
[INFO] Web Processing Service Module ...................... SUCCESS [01:08 min]
[INFO] OGR WPS ............................................ SUCCESS [  9.651 s]
[INFO] Excel Output Format ................................ SUCCESS [ 11.693 s]
[INFO] Chart external graphics support .................... SUCCESS [  0.515 s]
[INFO] Feature Generalization Extension ................... SUCCESS [  2.905 s]
[INFO] Image Mosaic JDBC Extension ........................ SUCCESS [  0.476 s]
[INFO] OWS request flow controller ........................ SUCCESS [ 11.164 s]
[INFO] Web process status sharing with Hazelcast .......... SUCCESS [ 17.377 s]
[INFO] Web Processing Service GUI ......................... SKIPPED
[INFO] GeoServer Layer Querying filter functions .......... SUCCESS [ 12.971 s]
[INFO] Teradata DataStore Extension ....................... SUCCESS [  2.567 s]
[INFO] GeoServer Monitor Extensions ....................... SUCCESS [  0.057 s]
[INFO] Core Monitor Extension ............................. SKIPPED
[INFO] GeoServer Security Extension Modules ............... SKIPPED
[INFO] GeoServer CAS Security Module ...................... SKIPPED
[INFO] GeoServer Security Extension Web Modules ........... SKIPPED
[INFO] GeoServer CAS Security Web Module .................. SKIPPED
[INFO] XLST based WFS output format ....................... SKIPPED
[INFO] GeoServer INSPIRE Extensions ....................... SKIPPED
[INFO] GeoServer CSS Styling .............................. SKIPPED
[INFO] Catalog Services for the Web parent ................ SUCCESS [  0.079 s]
[INFO] Catalog Services for the Web interfaces ............ SUCCESS [  8.897 s]
[INFO] Catalog Services for the Web - Simple CatalogStore implementation SUCCESS [  7.936 s]
[INFO] Catalog Services for the Web core module ........... SUCCESS [ 35.146 s]
[INFO] CSW UI Module ...................................... SUCCESS [  9.121 s]
[INFO] DXF WFS output format and WPS PPIO ................. SUCCESS [  0.028 s]
[INFO] DXF WFS output format .............................. SUCCESS [ 11.676 s]
[INFO] DXF WPS PPIO ....................................... SUCCESS [  6.723 s]
[INFO] GeoServer WCS 2.0 Earth Observation Extensions ..... SUCCESS [  0.037 s]
[INFO] Web Coverage Service 2.0 Earth Observation extensions SUCCESS [ 15.031 s]
[INFO] Web Coverage Service 2.0 Earth Observation GUI extension SUCCESS [ 11.001 s]
[INFO] GeoServer libjpeg-turbo Module ..................... SKIPPED
[INFO] GeoServer Data Importer ............................ SKIPPED
[INFO] Importer Core Module ............................... SKIPPED
[INFO] Importer REST Api Module-ng ........................ SKIPPED
[INFO] Importer Berkley DB Persistence Module ............. SKIPPED
[INFO] Importer Web UI Module ............................. SKIPPED
[INFO] GRIB Coverage Format ............................... SUCCESS [ 17.970 s]
[INFO] NetCDF Coverage format ............................. SKIPPED
[INFO] WCS NetCDF output Module ........................... SKIPPED
[INFO] Vector Tiles ....................................... SKIPPED
[INFO] Ysld GeoServer Plugin .............................. SKIPPED
[INFO] MongoDB Data Store ................................. SUCCESS [  1.887 s]
[INFO] ------------------------------------------------------------------------
[INFO] BUILD FAILURE
[INFO] ------------------------------------------------------------------------
[INFO] Total time: 08:30 min (Wall Clock)
[INFO] Finished at: 2018-06-12T20:54:17+00:00
[INFO] Final Memory: 125M/1576M
[INFO] ------------------------------------------------------------------------
[ERROR] Failed to execute goal org.apache.maven.plugins:maven-surefire-plugin:2.12.3:test (default-test) on project gs-wms: There are test failures.
[ERROR]
[ERROR] Please refer to <https://build.geoserver.org/job/geoserver-2.12.x/ws/src/wms/target/surefire-reports> for the individual test results.
[ERROR] -> [Help 1]
[ERROR]
[ERROR] To see the full stack trace of the errors, re-run Maven with the -e switch.
[ERROR] Re-run Maven using the -X switch to enable full debug logging.
[ERROR]
[ERROR] For more information about the errors and possible solutions, please read the following articles:
[ERROR] [Help 1] http://cwiki.apache.org/confluence/display/MAVEN/MojoFailureException
[ERROR]
[ERROR] After correcting the problems, you can resume the build with the command
[ERROR]   mvn <goals> -rf :gs-wms
Build step 'Invoke top-level Maven targets' marked build as failure

------------------------------------------------------------------------------
Check out the vibrant tech community on one of the world's most
engaging tech sites, Slashdot.org! http://sdm.link/slashdot
_______________________________________________
Geoserver-devel mailing list
[hidden email]
https://lists.sourceforge.net/lists/listinfo/geoserver-devel
Reply | Threaded
Open this post in threaded view
|

Jenkins build is back to normal : geoserver-2.12.x #252

monitor
See <https://build.geoserver.org/job/geoserver-2.12.x/252/display/redirect>


------------------------------------------------------------------------------
Check out the vibrant tech community on one of the world's most
engaging tech sites, Slashdot.org! http://sdm.link/slashdot
_______________________________________________
Geoserver-devel mailing list
[hidden email]
https://lists.sourceforge.net/lists/listinfo/geoserver-devel